beam-commits mailing list archives

Site index · List index
Message view « Date » · « Thread »
Top « Date » · « Thread »
From Apache Jenkins Server <jenk...@builds.apache.org>
Subject Build failed in Jenkins: beam_PostCommit_Java_MavenInstall #2086
Date Wed, 14 Dec 2016 00:41:42 GMT
See <https://builds.apache.org/job/beam_PostCommit_Java_MavenInstall/2086/changes>

Changes:

[davor] Update version from 0.5.0-SNAPSHOT to 0.5.0-incubating-SNAPSHOT

[klk] [BEAM-1149] Explode windows when fn uses side inputs

[dhalperi] Some minor changes and fixes for sorter module

------------------------------------------
[...truncated 8421 lines...]
[INFO] 
[INFO] --- maven-source-plugin:2.4:jar-no-fork (attach-sources) @ beam-sdks-java-maven-archetypes-starter
---
[INFO] Building jar: <https://builds.apache.org/job/beam_PostCommit_Java_MavenInstall/ws/sdks/java/maven-archetypes/starter/target/beam-sdks-java-maven-archetypes-starter-0.5.0-incubating-SNAPSHOT-sources.jar>
[INFO] 
[INFO] --- maven-source-plugin:2.4:test-jar-no-fork (attach-test-sources) @ beam-sdks-java-maven-archetypes-starter
---
[INFO] Building jar: <https://builds.apache.org/job/beam_PostCommit_Java_MavenInstall/ws/sdks/java/maven-archetypes/starter/target/beam-sdks-java-maven-archetypes-starter-0.5.0-incubating-SNAPSHOT-test-sources.jar>
[INFO] 
[INFO] --- maven-dependency-plugin:2.10:analyze-only (default) @ beam-sdks-java-maven-archetypes-starter
---
[INFO] No dependency problems found
[INFO] 
[INFO] --- apache-rat-plugin:0.12:check (default) @ beam-sdks-java-maven-archetypes-starter
---
[INFO] Enabled default license matchers.
[INFO] Will parse SCM ignores for exclusions...
[INFO] Finished adding exclusions from SCM ignore files.
[INFO] 61 implicit excludes (use -debug for more details).
[INFO] Exclude: **/target/**/*
[INFO] Exclude: **/dependency-reduced-pom.xml
[INFO] Exclude: **/hs_err_pid*.log
[INFO] Exclude: .github/**/*
[INFO] Exclude: **/*.iml
[INFO] Exclude: **/.idea/**/*
[INFO] Exclude: **/package-list
[INFO] Exclude: **/user.avsc
[INFO] Exclude: **/test/resources/**/*.txt
[INFO] Exclude: **/test/**/.placeholder
[INFO] Exclude: .repository/**/*
[INFO] Exclude: **/.checkstyle
[INFO] Exclude: **/.classpath
[INFO] Exclude: **/.factorypath
[INFO] Exclude: **/.project
[INFO] Exclude: **/.settings/**/*
[INFO] 7 resources included (use -debug for more details)
[INFO] Rat check: Summary over all files. Unapproved: 0, unknown: 0, generated: 0, approved:
7 licenses.
[INFO] 
[INFO] --- maven-install-plugin:2.5.2:install (default-install) @ beam-sdks-java-maven-archetypes-starter
---
[INFO] Installing <https://builds.apache.org/job/beam_PostCommit_Java_MavenInstall/ws/sdks/java/maven-archetypes/starter/target/beam-sdks-java-maven-archetypes-starter-0.5.0-incubating-SNAPSHOT.jar>
to <https://builds.apache.org/job/beam_PostCommit_Java_MavenInstall/ws/.repository/org/apache/beam/beam-sdks-java-maven-archetypes-starter/0.5.0-incubating-SNAPSHOT/beam-sdks-java-maven-archetypes-starter-0.5.0-incubating-SNAPSHOT.jar>
[INFO] Installing <https://builds.apache.org/job/beam_PostCommit_Java_MavenInstall/ws/sdks/java/maven-archetypes/starter/pom.xml>
to <https://builds.apache.org/job/beam_PostCommit_Java_MavenInstall/ws/.repository/org/apache/beam/beam-sdks-java-maven-archetypes-starter/0.5.0-incubating-SNAPSHOT/beam-sdks-java-maven-archetypes-starter-0.5.0-incubating-SNAPSHOT.pom>
[INFO] Installing <https://builds.apache.org/job/beam_PostCommit_Java_MavenInstall/ws/sdks/java/maven-archetypes/starter/target/beam-sdks-java-maven-archetypes-starter-0.5.0-incubating-SNAPSHOT-sources.jar>
to <https://builds.apache.org/job/beam_PostCommit_Java_MavenInstall/ws/.repository/org/apache/beam/beam-sdks-java-maven-archetypes-starter/0.5.0-incubating-SNAPSHOT/beam-sdks-java-maven-archetypes-starter-0.5.0-incubating-SNAPSHOT-sources.jar>
[INFO] Installing <https://builds.apache.org/job/beam_PostCommit_Java_MavenInstall/ws/sdks/java/maven-archetypes/starter/target/beam-sdks-java-maven-archetypes-starter-0.5.0-incubating-SNAPSHOT-test-sources.jar>
to <https://builds.apache.org/job/beam_PostCommit_Java_MavenInstall/ws/.repository/org/apache/beam/beam-sdks-java-maven-archetypes-starter/0.5.0-incubating-SNAPSHOT/beam-sdks-java-maven-archetypes-starter-0.5.0-incubating-SNAPSHOT-test-sources.jar>
[INFO] 
[INFO] --- maven-archetype-plugin:2.4:integration-test (default-integration-test) @ beam-sdks-java-maven-archetypes-starter
---
[INFO] Processing Archetype IT project: basic
[INFO] ----------------------------------------------------------------------------
[INFO] Using following parameters for creating project from Archetype: beam-sdks-java-maven-archetypes-starter:0.5.0-incubating-SNAPSHOT
[INFO] ----------------------------------------------------------------------------
[INFO] Parameter: groupId, Value: archetype.it
[INFO] Parameter: artifactId, Value: basic
[INFO] Parameter: version, Value: 0.1
[INFO] Parameter: package, Value: it.pkg
[INFO] Parameter: packageInPathFormat, Value: it/pkg
[INFO] Parameter: version, Value: 0.1
[INFO] Parameter: package, Value: it.pkg
[INFO] Parameter: groupId, Value: archetype.it
[INFO] Parameter: targetPlatform, Value: 1.7
[INFO] Parameter: artifactId, Value: basic
[INFO] project created from Archetype in dir: <https://builds.apache.org/job/beam_PostCommit_Java_MavenInstall/ws/sdks/java/maven-archetypes/starter/target/test-classes/projects/basic/project/basic>
[INFO] Comparing generated project with reference content: <https://builds.apache.org/job/beam_PostCommit_Java_MavenInstall/ws/sdks/java/maven-archetypes/starter/target/test-classes/projects/basic/reference>
[WARNING] Contents of file pom.xml are not equal
[JENKINS] Recording test results
[INFO] ------------------------------------------------------------------------
[INFO] Reactor Summary:
[INFO] 
[INFO] Apache Beam :: Parent .............................. SUCCESS [ 35.182 s]
[INFO] Apache Beam :: SDKs :: Java :: Build Tools ......... SUCCESS [  9.984 s]
[INFO] Apache Beam :: SDKs ................................ SUCCESS [ 13.324 s]
[INFO] Apache Beam :: SDKs :: Java ........................ SUCCESS [ 15.111 s]
[INFO] Apache Beam :: SDKs :: Java :: Core ................ SUCCESS [04:37 min]
[INFO] Apache Beam :: Runners ............................. SUCCESS [  4.719 s]
[INFO] Apache Beam :: Runners :: Core Java ................ SUCCESS [01:05 min]
[INFO] Apache Beam :: Runners :: Direct Java .............. SUCCESS [02:46 min]
[INFO] Apache Beam :: Runners :: Google Cloud Dataflow .... SUCCESS [ 40.963 s]
[INFO] Apache Beam :: SDKs :: Java :: IO .................. SUCCESS [  8.182 s]
[INFO] Apache Beam :: SDKs :: Java :: IO :: Google Cloud Platform SUCCESS [05:09 min]
[INFO] Apache Beam :: SDKs :: Java :: IO :: HDFS .......... SUCCESS [ 32.111 s]
[INFO] Apache Beam :: SDKs :: Java :: IO :: JMS ........... SUCCESS [ 19.525 s]
[INFO] Apache Beam :: SDKs :: Java :: IO :: Kafka ......... SUCCESS [ 19.717 s]
[INFO] Apache Beam :: SDKs :: Java :: IO :: Kinesis ....... SUCCESS [ 26.742 s]
[INFO] Apache Beam :: SDKs :: Java :: IO :: MongoDB ....... SUCCESS [ 32.648 s]
[INFO] Apache Beam :: SDKs :: Java :: IO :: JDBC .......... SUCCESS [ 25.103 s]
[INFO] Apache Beam :: SDKs :: Java :: Maven Archetypes .... SUCCESS [  5.910 s]
[INFO] Apache Beam :: SDKs :: Java :: Maven Archetypes :: Starter FAILURE [ 10.538 s]
[INFO] Apache Beam :: SDKs :: Java :: Maven Archetypes :: Examples SKIPPED
[INFO] Apache Beam :: SDKs :: Java :: Maven Archetypes :: Examples - Java 8 SKIPPED
[INFO] Apache Beam :: SDKs :: Java :: Extensions .......... SKIPPED
[INFO] Apache Beam :: SDKs :: Java :: Extensions :: Join library SKIPPED
[INFO] Apache Beam :: SDKs :: Java :: Extensions :: Sorter  SKIPPED
[INFO] Apache Beam :: SDKs :: Java :: Java 8 Tests ........ SKIPPED
[INFO] Apache Beam :: Runners :: Flink .................... SKIPPED
[INFO] Apache Beam :: Runners :: Flink :: Core ............ SKIPPED
[INFO] Apache Beam :: Runners :: Flink :: Examples ........ SKIPPED
[INFO] Apache Beam :: Runners :: Spark .................... SKIPPED
[INFO] Apache Beam :: Runners :: Apex ..................... SKIPPED
[INFO] Apache Beam :: Examples ............................ SKIPPED
[INFO] Apache Beam :: Examples :: Java .................... SKIPPED
[INFO] Apache Beam :: Examples :: Java 8 .................. SKIPPED
[INFO] ------------------------------------------------------------------------
[INFO] BUILD FAILURE
[INFO] ------------------------------------------------------------------------
[INFO] Total time: 21:15 min
[INFO] Finished at: 2016-12-14T00:38:14+00:00
[INFO] Final Memory: 155M/917M
[INFO] ------------------------------------------------------------------------
Waiting for Jenkins to finish collecting data
[ERROR] Failed to execute goal org.apache.maven.plugins:maven-archetype-plugin:2.4:integration-test
(default-integration-test) on project beam-sdks-java-maven-archetypes-starter:
[ERROR] Archetype IT 'basic' failed: Some content are not equals
[ERROR] -> [Help 1]
org.apache.maven.lifecycle.LifecycleExecutionException: Failed to execute goal org.apache.maven.plugins:maven-archetype-plugin:2.4:integration-test
(default-integration-test) on project beam-sdks-java-maven-archetypes-starter: 
Archetype IT 'basic' failed: Some content are not equals
	at org.apache.maven.lifecycle.internal.MojoExecutor.execute(MojoExecutor.java:216)
	at org.apache.maven.lifecycle.internal.MojoExecutor.execute(MojoExecutor.java:153)
	at org.apache.maven.lifecycle.internal.MojoExecutor.execute(MojoExecutor.java:145)
	at org.apache.maven.lifecycle.internal.LifecycleModuleBuilder.buildProject(LifecycleModuleBuilder.java:116)
	at org.apache.maven.lifecycle.internal.LifecycleModuleBuilder.buildProject(LifecycleModuleBuilder.java:80)
	at org.apache.maven.lifecycle.internal.builder.singlethreaded.SingleThreadedBuilder.build(SingleThreadedBuilder.java:51)
	at org.apache.maven.lifecycle.internal.LifecycleStarter.execute(LifecycleStarter.java:128)
	at org.apache.maven.DefaultMaven.doExecute(DefaultMaven.java:307)
	at org.apache.maven.DefaultMaven.doExecute(DefaultMaven.java:193)
	at org.apache.maven.DefaultMaven.execute(DefaultMaven.java:106)
	at org.jvnet.hudson.maven3.launcher.Maven32Launcher.main(Maven32Launcher.java:132)
	at sun.reflect.NativeMethodAccessorImpl.invoke0(Native Method)
	at sun.reflect.NativeMethodAccessorImpl.invoke(NativeMethodAccessorImpl.java:62)
	at sun.reflect.DelegatingMethodAccessorImpl.invoke(DelegatingMethodAccessorImpl.java:43)
	at java.lang.reflect.Method.invoke(Method.java:498)
	at org.codehaus.plexus.classworlds.launcher.Launcher.launchStandard(Launcher.java:330)
	at org.codehaus.plexus.classworlds.launcher.Launcher.launch(Launcher.java:238)
	at jenkins.maven3.agent.Maven32Main.launch(Maven32Main.java:186)
	at sun.reflect.NativeMethodAccessorImpl.invoke0(Native Method)
	at sun.reflect.NativeMethodAccessorImpl.invoke(NativeMethodAccessorImpl.java:62)
	at sun.reflect.DelegatingMethodAccessorImpl.invoke(DelegatingMethodAccessorImpl.java:43)
	at java.lang.reflect.Method.invoke(Method.java:498)
	at hudson.maven.Maven3Builder.call(Maven3Builder.java:136)
	at hudson.maven.Maven3Builder.call(Maven3Builder.java:71)
	at hudson.remoting.UserRequest.perform(UserRequest.java:153)
	at hudson.remoting.UserRequest.perform(UserRequest.java:50)
	at hudson.remoting.Request$2.run(Request.java:332)
	at hudson.remoting.InterceptingExecutorService$1.call(InterceptingExecutorService.java:68)
	at java.util.concurrent.FutureTask.run(FutureTask.java:266)
	at java.util.concurrent.ThreadPoolExecutor.runWorker(ThreadPoolExecutor.java:1142)
	at java.util.concurrent.ThreadPoolExecutor$Worker.run(ThreadPoolExecutor.java:617)
	at java.lang.Thread.run(Thread.java:745)
Caused by: org.apache.maven.plugin.MojoExecutionException: 
Archetype IT 'basic' failed: Some content are not equals
	at org.apache.maven.archetype.mojos.IntegrationTestMojo.execute(IntegrationTestMojo.java:269)
	at org.apache.maven.plugin.DefaultBuildPluginManager.executeMojo(DefaultBuildPluginManager.java:134)
	at org.apache.maven.lifecycle.internal.MojoExecutor.execute(MojoExecutor.java:208)
	... 31 more
[ERROR] 
[ERROR] Re-run Maven using the -X switch to enable full debug logging.
[ERROR] 
[ERROR] For more information about the errors and possible solutions, please read the following
articles:
[ERROR] [Help 1] http://cwiki.apache.org/confluence/display/MAVEN/MojoExecutionException
[ERROR] 
[ERROR] After correcting the problems, you can resume the build with the command
[ERROR]   mvn <goals> -rf :beam-sdks-java-maven-archetypes-starter
[JENKINS] Archiving <https://builds.apache.org/job/beam_PostCommit_Java_MavenInstall/ws/sdks/java/io/pom.xml>
to org.apache.beam/beam-sdks-java-io-parent/0.5.0-incubating-SNAPSHOT/beam-sdks-java-io-parent-0.5.0-incubating-SNAPSHOT.pom
[JENKINS] Archiving <https://builds.apache.org/job/beam_PostCommit_Java_MavenInstall/ws/sdks/java/maven-archetypes/starter/pom.xml>
to org.apache.beam/beam-sdks-java-maven-archetypes-starter/0.5.0-incubating-SNAPSHOT/beam-sdks-java-maven-archetypes-starter-0.5.0-incubating-SNAPSHOT.pom
[JENKINS] Archiving <https://builds.apache.org/job/beam_PostCommit_Java_MavenInstall/ws/sdks/java/maven-archetypes/starter/target/beam-sdks-java-maven-archetypes-starter-0.5.0-incubating-SNAPSHOT.jar>
to org.apache.beam/beam-sdks-java-maven-archetypes-starter/0.5.0-incubating-SNAPSHOT/beam-sdks-java-maven-archetypes-starter-0.5.0-incubating-SNAPSHOT.jar
[JENKINS] Archiving <https://builds.apache.org/job/beam_PostCommit_Java_MavenInstall/ws/sdks/java/maven-archetypes/starter/target/beam-sdks-java-maven-archetypes-starter-0.5.0-incubating-SNAPSHOT-sources.jar>
to org.apache.beam/beam-sdks-java-maven-archetypes-starter/0.5.0-incubating-SNAPSHOT/beam-sdks-java-maven-archetypes-starter-0.5.0-incubating-SNAPSHOT-sources.jar
[JENKINS] Archiving <https://builds.apache.org/job/beam_PostCommit_Java_MavenInstall/ws/sdks/java/maven-archetypes/starter/target/beam-sdks-java-maven-archetypes-starter-0.5.0-incubating-SNAPSHOT-test-sources.jar>
to org.apache.beam/beam-sdks-java-maven-archetypes-starter/0.5.0-incubating-SNAPSHOT/beam-sdks-java-maven-archetypes-starter-0.5.0-incubating-SNAPSHOT-test-sources.jar
[JENKINS] Archiving <https://builds.apache.org/job/beam_PostCommit_Java_MavenInstall/ws/runners/direct-java/dependency-reduced-pom.xml>
to org.apache.beam/beam-runners-direct-java/0.5.0-incubating-SNAPSHOT/beam-runners-direct-java-0.5.0-incubating-SNAPSHOT.pom
[JENKINS] Archiving <https://builds.apache.org/job/beam_PostCommit_Java_MavenInstall/ws/runners/direct-java/target/beam-runners-direct-java-0.5.0-incubating-SNAPSHOT.jar>
to org.apache.beam/beam-runners-direct-java/0.5.0-incubating-SNAPSHOT/beam-runners-direct-java-0.5.0-incubating-SNAPSHOT.jar
[JENKINS] Archiving <https://builds.apache.org/job/beam_PostCommit_Java_MavenInstall/ws/runners/direct-java/target/beam-runners-direct-java-0.5.0-incubating-SNAPSHOT-javadoc.jar>
to org.apache.beam/beam-runners-direct-java/0.5.0-incubating-SNAPSHOT/beam-runners-direct-java-0.5.0-incubating-SNAPSHOT-javadoc.jar
[JENKINS] Archiving <https://builds.apache.org/job/beam_PostCommit_Java_MavenInstall/ws/runners/direct-java/target/beam-runners-direct-java-0.5.0-incubating-SNAPSHOT-sources.jar>
to org.apache.beam/beam-runners-direct-java/0.5.0-incubating-SNAPSHOT/beam-runners-direct-java-0.5.0-incubating-SNAPSHOT-sources.jar
[JENKINS] Archiving <https://builds.apache.org/job/beam_PostCommit_Java_MavenInstall/ws/runners/direct-java/target/beam-runners-direct-java-0.5.0-incubating-SNAPSHOT-test-sources.jar>
to org.apache.beam/beam-runners-direct-java/0.5.0-incubating-SNAPSHOT/beam-runners-direct-java-0.5.0-incubating-SNAPSHOT-test-sources.jar
[JENKINS] Archiving <https://builds.apache.org/job/beam_PostCommit_Java_MavenInstall/ws/runners/direct-java/target/beam-runners-direct-java-0.5.0-incubating-SNAPSHOT-tests.jar>
to org.apache.beam/beam-runners-direct-java/0.5.0-incubating-SNAPSHOT/beam-runners-direct-java-0.5.0-incubating-SNAPSHOT-tests.jar
[JENKINS] Archiving <https://builds.apache.org/job/beam_PostCommit_Java_MavenInstall/ws/examples/java/pom.xml>
to org.apache.beam/beam-examples-java/0.5.0-incubating-SNAPSHOT/beam-examples-java-0.5.0-incubating-SNAPSHOT.pom
[JENKINS] Archiving <https://builds.apache.org/job/beam_PostCommit_Java_MavenInstall/ws/sdks/java/build-tools/pom.xml>
to org.apache.beam/beam-sdks-java-build-tools/0.5.0-incubating-SNAPSHOT/beam-sdks-java-build-tools-0.5.0-incubating-SNAPSHOT.pom
[JENKINS] Archiving <https://builds.apache.org/job/beam_PostCommit_Java_MavenInstall/ws/sdks/java/build-tools/target/beam-sdks-java-build-tools-0.5.0-incubating-SNAPSHOT.jar>
to org.apache.beam/beam-sdks-java-build-tools/0.5.0-incubating-SNAPSHOT/beam-sdks-java-build-tools-0.5.0-incubating-SNAPSHOT.jar
[JENKINS] Archiving <https://builds.apache.org/job/beam_PostCommit_Java_MavenInstall/ws/sdks/java/build-tools/target/beam-sdks-java-build-tools-0.5.0-incubating-SNAPSHOT-sources.jar>
to org.apache.beam/beam-sdks-java-build-tools/0.5.0-incubating-SNAPSHOT/beam-sdks-java-build-tools-0.5.0-incubating-SNAPSHOT-sources.jar
[JENKINS] Archiving <https://builds.apache.org/job/beam_PostCommit_Java_MavenInstall/ws/sdks/java/build-tools/target/beam-sdks-java-build-tools-0.5.0-incubating-SNAPSHOT-test-sources.jar>
to org.apache.beam/beam-sdks-java-build-tools/0.5.0-incubating-SNAPSHOT/beam-sdks-java-build-tools-0.5.0-incubating-SNAPSHOT-test-sources.jar
[JENKINS] Archiving <https://builds.apache.org/job/beam_PostCommit_Java_MavenInstall/ws/sdks/java/build-tools/target/beam-sdks-java-build-tools-0.5.0-incubating-SNAPSHOT-tests.jar>
to org.apache.beam/beam-sdks-java-build-tools/0.5.0-incubating-SNAPSHOT/beam-sdks-java-build-tools-0.5.0-incubating-SNAPSHOT-tests.jar
[JENKINS] Archiving <https://builds.apache.org/job/beam_PostCommit_Java_MavenInstall/ws/sdks/java/core/dependency-reduced-pom.xml>
to org.apache.beam/beam-sdks-java-core/0.5.0-incubating-SNAPSHOT/beam-sdks-java-core-0.5.0-incubating-SNAPSHOT.pom
[JENKINS] Archiving <https://builds.apache.org/job/beam_PostCommit_Java_MavenInstall/ws/sdks/java/core/target/beam-sdks-java-core-0.5.0-incubating-SNAPSHOT.jar>
to org.apache.beam/beam-sdks-java-core/0.5.0-incubating-SNAPSHOT/beam-sdks-java-core-0.5.0-incubating-SNAPSHOT.jar
[JENKINS] Archiving <https://builds.apache.org/job/beam_PostCommit_Java_MavenInstall/ws/sdks/java/core/target/beam-sdks-java-core-0.5.0-incubating-SNAPSHOT-javadoc.jar>
to org.apache.beam/beam-sdks-java-core/0.5.0-incubating-SNAPSHOT/beam-sdks-java-core-0.5.0-incubating-SNAPSHOT-javadoc.jar
[JENKINS] Archiving <https://builds.apache.org/job/beam_PostCommit_Java_MavenInstall/ws/sdks/java/core/target/beam-sdks-java-core-0.5.0-incubating-SNAPSHOT-sources.jar>
to org.apache.beam/beam-sdks-java-core/0.5.0-incubating-SNAPSHOT/beam-sdks-java-core-0.5.0-incubating-SNAPSHOT-sources.jar
[JENKINS] Archiving <https://builds.apache.org/job/beam_PostCommit_Java_MavenInstall/ws/sdks/java/core/target/beam-sdks-java-core-0.5.0-incubating-SNAPSHOT-test-sources.jar>
to org.apache.beam/beam-sdks-java-core/0.5.0-incubating-SNAPSHOT/beam-sdks-java-core-0.5.0-incubating-SNAPSHOT-test-sources.jar
[JENKINS] Archiving <https://builds.apache.org/job/beam_PostCommit_Java_MavenInstall/ws/sdks/java/core/target/beam-sdks-java-core-0.5.0-incubating-SNAPSHOT-tests.jar>
to org.apache.beam/beam-sdks-java-core/0.5.0-incubating-SNAPSHOT/beam-sdks-java-core-0.5.0-incubating-SNAPSHOT-tests.jar
Compressed 11.41 MB of artifacts by 11.0% relative to #2085
[JENKINS] Archiving <https://builds.apache.org/job/beam_PostCommit_Java_MavenInstall/ws/runners/flink/examples/pom.xml>
to org.apache.beam/beam-runners-flink_2.10-examples/0.5.0-incubating-SNAPSHOT/beam-runners-flink_2.10-examples-0.5.0-incubating-SNAPSHOT.pom
[JENKINS] Archiving <https://builds.apache.org/job/beam_PostCommit_Java_MavenInstall/ws/runners/core-java/dependency-reduced-pom.xml>
to org.apache.beam/beam-runners-core-java/0.5.0-incubating-SNAPSHOT/beam-runners-core-java-0.5.0-incubating-SNAPSHOT.pom
[JENKINS] Archiving <https://builds.apache.org/job/beam_PostCommit_Java_MavenInstall/ws/runners/core-java/target/beam-runners-core-java-0.5.0-incubating-SNAPSHOT.jar>
to org.apache.beam/beam-runners-core-java/0.5.0-incubating-SNAPSHOT/beam-runners-core-java-0.5.0-incubating-SNAPSHOT.jar
[JENKINS] Archiving <https://builds.apache.org/job/beam_PostCommit_Java_MavenInstall/ws/runners/core-java/target/beam-runners-core-java-0.5.0-incubating-SNAPSHOT-javadoc.jar>
to org.apache.beam/beam-runners-core-java/0.5.0-incubating-SNAPSHOT/beam-runners-core-java-0.5.0-incubating-SNAPSHOT-javadoc.jar
[JENKINS] Archiving <https://builds.apache.org/job/beam_PostCommit_Java_MavenInstall/ws/runners/core-java/target/beam-runners-core-java-0.5.0-incubating-SNAPSHOT-sources.jar>
to org.apache.beam/beam-runners-core-java/0.5.0-incubating-SNAPSHOT/beam-runners-core-java-0.5.0-incubating-SNAPSHOT-sources.jar
[JENKINS] Archiving <https://builds.apache.org/job/beam_PostCommit_Java_MavenInstall/ws/runners/core-java/target/beam-runners-core-java-0.5.0-incubating-SNAPSHOT-test-sources.jar>
to org.apache.beam/beam-runners-core-java/0.5.0-incubating-SNAPSHOT/beam-runners-core-java-0.5.0-incubating-SNAPSHOT-test-sources.jar
[JENKINS] Archiving <https://builds.apache.org/job/beam_PostCommit_Java_MavenInstall/ws/runners/core-java/target/beam-runners-core-java-0.5.0-incubating-SNAPSHOT-tests.jar>
to org.apache.beam/beam-runners-core-java/0.5.0-incubating-SNAPSHOT/beam-runners-core-java-0.5.0-incubating-SNAPSHOT-tests.jar
[JENKINS] Archiving <https://builds.apache.org/job/beam_PostCommit_Java_MavenInstall/ws/sdks/java/io/kinesis/pom.xml>
to org.apache.beam/beam-sdks-java-io-kinesis/0.5.0-incubating-SNAPSHOT/beam-sdks-java-io-kinesis-0.5.0-incubating-SNAPSHOT.pom
[JENKINS] Archiving <https://builds.apache.org/job/beam_PostCommit_Java_MavenInstall/ws/sdks/java/io/kinesis/target/beam-sdks-java-io-kinesis-0.5.0-incubating-SNAPSHOT.jar>
to org.apache.beam/beam-sdks-java-io-kinesis/0.5.0-incubating-SNAPSHOT/beam-sdks-java-io-kinesis-0.5.0-incubating-SNAPSHOT.jar
[JENKINS] Archiving <https://builds.apache.org/job/beam_PostCommit_Java_MavenInstall/ws/sdks/java/io/kinesis/target/beam-sdks-java-io-kinesis-0.5.0-incubating-SNAPSHOT-javadoc.jar>
to org.apache.beam/beam-sdks-java-io-kinesis/0.5.0-incubating-SNAPSHOT/beam-sdks-java-io-kinesis-0.5.0-incubating-SNAPSHOT-javadoc.jar
[JENKINS] Archiving <https://builds.apache.org/job/beam_PostCommit_Java_MavenInstall/ws/sdks/java/io/kinesis/target/beam-sdks-java-io-kinesis-0.5.0-incubating-SNAPSHOT-sources.jar>
to org.apache.beam/beam-sdks-java-io-kinesis/0.5.0-incubating-SNAPSHOT/beam-sdks-java-io-kinesis-0.5.0-incubating-SNAPSHOT-sources.jar
[JENKINS] Archiving <https://builds.apache.org/job/beam_PostCommit_Java_MavenInstall/ws/sdks/java/io/kinesis/target/beam-sdks-java-io-kinesis-0.5.0-incubating-SNAPSHOT-test-sources.jar>
to org.apache.beam/beam-sdks-java-io-kinesis/0.5.0-incubating-SNAPSHOT/beam-sdks-java-io-kinesis-0.5.0-incubating-SNAPSHOT-test-sources.jar
[JENKINS] Archiving <https://builds.apache.org/job/beam_PostCommit_Java_MavenInstall/ws/sdks/java/io/kinesis/target/beam-sdks-java-io-kinesis-0.5.0-incubating-SNAPSHOT-tests.jar>
to org.apache.beam/beam-sdks-java-io-kinesis/0.5.0-incubating-SNAPSHOT/beam-sdks-java-io-kinesis-0.5.0-incubating-SNAPSHOT-tests.jar
[JENKINS] Archiving <https://builds.apache.org/job/beam_PostCommit_Java_MavenInstall/ws/sdks/java/io/kafka/pom.xml>
to org.apache.beam/beam-sdks-java-io-kafka/0.5.0-incubating-SNAPSHOT/beam-sdks-java-io-kafka-0.5.0-incubating-SNAPSHOT.pom
[JENKINS] Archiving <https://builds.apache.org/job/beam_PostCommit_Java_MavenInstall/ws/sdks/java/io/kafka/target/beam-sdks-java-io-kafka-0.5.0-incubating-SNAPSHOT.jar>
to org.apache.beam/beam-sdks-java-io-kafka/0.5.0-incubating-SNAPSHOT/beam-sdks-java-io-kafka-0.5.0-incubating-SNAPSHOT.jar
[JENKINS] Archiving <https://builds.apache.org/job/beam_PostCommit_Java_MavenInstall/ws/sdks/java/io/kafka/target/beam-sdks-java-io-kafka-0.5.0-incubating-SNAPSHOT-javadoc.jar>
to org.apache.beam/beam-sdks-java-io-kafka/0.5.0-incubating-SNAPSHOT/beam-sdks-java-io-kafka-0.5.0-incubating-SNAPSHOT-javadoc.jar
[JENKINS] Archiving <https://builds.apache.org/job/beam_PostCommit_Java_MavenInstall/ws/sdks/java/io/kafka/target/beam-sdks-java-io-kafka-0.5.0-incubating-SNAPSHOT-sources.jar>
to org.apache.beam/beam-sdks-java-io-kafka/0.5.0-incubating-SNAPSHOT/beam-sdks-java-io-kafka-0.5.0-incubating-SNAPSHOT-sources.jar
[JENKINS] Archiving <https://builds.apache.org/job/beam_PostCommit_Java_MavenInstall/ws/sdks/java/io/kafka/target/beam-sdks-java-io-kafka-0.5.0-incubating-SNAPSHOT-test-sources.jar>
to org.apache.beam/beam-sdks-java-io-kafka/0.5.0-incubating-SNAPSHOT/beam-sdks-java-io-kafka-0.5.0-incubating-SNAPSHOT-test-sources.jar
[JENKINS] Archiving <https://builds.apache.org/job/beam_PostCommit_Java_MavenInstall/ws/sdks/java/io/kafka/target/beam-sdks-java-io-kafka-0.5.0-incubating-SNAPSHOT-tests.jar>
to org.apache.beam/beam-sdks-java-io-kafka/0.5.0-incubating-SNAPSHOT/beam-sdks-java-io-kafka-0.5.0-incubating-SNAPSHOT-tests.jar
[JENKINS] Archiving <https://builds.apache.org/job/beam_PostCommit_Java_MavenInstall/ws/runners/flink/runner/pom.xml>
to org.apache.beam/beam-runners-flink_2.10/0.5.0-incubating-SNAPSHOT/beam-runners-flink_2.10-0.5.0-incubating-SNAPSHOT.pom
[JENKINS] Archiving <https://builds.apache.org/job/beam_PostCommit_Java_MavenInstall/ws/sdks/java/io/google-cloud-platform/pom.xml>
to org.apache.beam/beam-sdks-java-io-google-cloud-platform/0.5.0-incubating-SNAPSHOT/beam-sdks-java-io-google-cloud-platform-0.5.0-incubating-SNAPSHOT.pom
[JENKINS] Archiving <https://builds.apache.org/job/beam_PostCommit_Java_MavenInstall/ws/sdks/java/io/google-cloud-platform/target/beam-sdks-java-io-google-cloud-platform-0.5.0-incubating-SNAPSHOT.jar>
to org.apache.beam/beam-sdks-java-io-google-cloud-platform/0.5.0-incubating-SNAPSHOT/beam-sdks-java-io-google-cloud-platform-0.5.0-incubating-SNAPSHOT.jar
[JENKINS] Archiving <https://builds.apache.org/job/beam_PostCommit_Java_MavenInstall/ws/sdks/java/io/google-cloud-platform/target/beam-sdks-java-io-google-cloud-platform-0.5.0-incubating-SNAPSHOT-javadoc.jar>
to org.apache.beam/beam-sdks-java-io-google-cloud-platform/0.5.0-incubating-SNAPSHOT/beam-sdks-java-io-google-cloud-platform-0.5.0-incubating-SNAPSHOT-javadoc.jar
[JENKINS] Archiving <https://builds.apache.org/job/beam_PostCommit_Java_MavenInstall/ws/sdks/java/io/google-cloud-platform/target/beam-sdks-java-io-google-cloud-platform-0.5.0-incubating-SNAPSHOT-sources.jar>
to org.apache.beam/beam-sdks-java-io-google-cloud-platform/0.5.0-incubating-SNAPSHOT/beam-sdks-java-io-google-cloud-platform-0.5.0-incubating-SNAPSHOT-sources.jar
[JENKINS] Archiving <https://builds.apache.org/job/beam_PostCommit_Java_MavenInstall/ws/sdks/java/io/google-cloud-platform/target/beam-sdks-java-io-google-cloud-platform-0.5.0-incubating-SNAPSHOT-test-sources.jar>
to org.apache.beam/beam-sdks-java-io-google-cloud-platform/0.5.0-incubating-SNAPSHOT/beam-sdks-java-io-google-cloud-platform-0.5.0-incubating-SNAPSHOT-test-sources.jar
[JENKINS] Archiving <https://builds.apache.org/job/beam_PostCommit_Java_MavenInstall/ws/sdks/java/io/google-cloud-platform/target/beam-sdks-java-io-google-cloud-platform-0.5.0-incubating-SNAPSHOT-tests.jar>
to org.apache.beam/beam-sdks-java-io-google-cloud-platform/0.5.0-incubating-SNAPSHOT/beam-sdks-java-io-google-cloud-platform-0.5.0-incubating-SNAPSHOT-tests.jar
[JENKINS] Archiving <https://builds.apache.org/job/beam_PostCommit_Java_MavenInstall/ws/sdks/java/pom.xml>
to org.apache.beam/beam-sdks-java-parent/0.5.0-incubating-SNAPSHOT/beam-sdks-java-parent-0.5.0-incubating-SNAPSHOT.pom
[JENKINS] Archiving <https://builds.apache.org/job/beam_PostCommit_Java_MavenInstall/ws/pom.xml>
to org.apache.beam/beam-parent/0.5.0-incubating-SNAPSHOT/beam-parent-0.5.0-incubating-SNAPSHOT.pom
[JENKINS] Archiving <https://builds.apache.org/job/beam_PostCommit_Java_MavenInstall/ws/sdks/java/maven-archetypes/examples-java8/pom.xml>
to org.apache.beam/beam-sdks-java-maven-archetypes-examples-java8/0.5.0-incubating-SNAPSHOT/beam-sdks-java-maven-archetypes-examples-java8-0.5.0-incubating-SNAPSHOT.pom
[JENKINS] Archiving <https://builds.apache.org/job/beam_PostCommit_Java_MavenInstall/ws/sdks/java/maven-archetypes/examples/pom.xml>
to org.apache.beam/beam-sdks-java-maven-archetypes-examples/0.5.0-incubating-SNAPSHOT/beam-sdks-java-maven-archetypes-examples-0.5.0-incubating-SNAPSHOT.pom
[JENKINS] Archiving <https://builds.apache.org/job/beam_PostCommit_Java_MavenInstall/ws/runners/spark/pom.xml>
to org.apache.beam/beam-runners-spark/0.5.0-incubating-SNAPSHOT/beam-runners-spark-0.5.0-incubating-SNAPSHOT.pom
[JENKINS] Archiving <https://builds.apache.org/job/beam_PostCommit_Java_MavenInstall/ws/sdks/java/io/hdfs/pom.xml>
to org.apache.beam/beam-sdks-java-io-hdfs/0.5.0-incubating-SNAPSHOT/beam-sdks-java-io-hdfs-0.5.0-incubating-SNAPSHOT.pom
[JENKINS] Archiving <https://builds.apache.org/job/beam_PostCommit_Java_MavenInstall/ws/sdks/java/io/hdfs/target/beam-sdks-java-io-hdfs-0.5.0-incubating-SNAPSHOT.jar>
to org.apache.beam/beam-sdks-java-io-hdfs/0.5.0-incubating-SNAPSHOT/beam-sdks-java-io-hdfs-0.5.0-incubating-SNAPSHOT.jar
[JENKINS] Archiving <https://builds.apache.org/job/beam_PostCommit_Java_MavenInstall/ws/sdks/java/io/hdfs/target/beam-sdks-java-io-hdfs-0.5.0-incubating-SNAPSHOT-javadoc.jar>
to org.apache.beam/beam-sdks-java-io-hdfs/0.5.0-incubating-SNAPSHOT/beam-sdks-java-io-hdfs-0.5.0-incubating-SNAPSHOT-javadoc.jar
[JENKINS] Archiving <https://builds.apache.org/job/beam_PostCommit_Java_MavenInstall/ws/sdks/java/io/hdfs/target/beam-sdks-java-io-hdfs-0.5.0-incubating-SNAPSHOT-sources.jar>
to org.apache.beam/beam-sdks-java-io-hdfs/0.5.0-incubating-SNAPSHOT/beam-sdks-java-io-hdfs-0.5.0-incubating-SNAPSHOT-sources.jar
[JENKINS] Archiving <https://builds.apache.org/job/beam_PostCommit_Java_MavenInstall/ws/sdks/java/io/hdfs/target/beam-sdks-java-io-hdfs-0.5.0-incubating-SNAPSHOT-test-sources.jar>
to org.apache.beam/beam-sdks-java-io-hdfs/0.5.0-incubating-SNAPSHOT/beam-sdks-java-io-hdfs-0.5.0-incubating-SNAPSHOT-test-sources.jar
[JENKINS] Archiving <https://builds.apache.org/job/beam_PostCommit_Java_MavenInstall/ws/sdks/java/io/hdfs/target/beam-sdks-java-io-hdfs-0.5.0-incubating-SNAPSHOT-tests.jar>
to org.apache.beam/beam-sdks-java-io-hdfs/0.5.0-incubating-SNAPSHOT/beam-sdks-java-io-hdfs-0.5.0-incubating-SNAPSHOT-tests.jar
[JENKINS] Archiving <https://builds.apache.org/job/beam_PostCommit_Java_MavenInstall/ws/sdks/java/maven-archetypes/pom.xml>
to org.apache.beam/beam-sdks-java-maven-archetypes-parent/0.5.0-incubating-SNAPSHOT/beam-sdks-java-maven-archetypes-parent-0.5.0-incubating-SNAPSHOT.pom
[JENKINS] Archiving <https://builds.apache.org/job/beam_PostCommit_Java_MavenInstall/ws/runners/google-cloud-dataflow-java/dependency-reduced-pom.xml>
to org.apache.beam/beam-runners-google-cloud-dataflow-java/0.5.0-incubating-SNAPSHOT/beam-runners-google-cloud-dataflow-java-0.5.0-incubating-SNAPSHOT.pom
[JENKINS] Archiving <https://builds.apache.org/job/beam_PostCommit_Java_MavenInstall/ws/runners/google-cloud-dataflow-java/target/beam-runners-google-cloud-dataflow-java-0.5.0-incubating-SNAPSHOT.jar>
to org.apache.beam/beam-runners-google-cloud-dataflow-java/0.5.0-incubating-SNAPSHOT/beam-runners-google-cloud-dataflow-java-0.5.0-incubating-SNAPSHOT.jar
[JENKINS] Archiving <https://builds.apache.org/job/beam_PostCommit_Java_MavenInstall/ws/runners/google-cloud-dataflow-java/target/beam-runners-google-cloud-dataflow-java-0.5.0-incubating-SNAPSHOT-javadoc.jar>
to org.apache.beam/beam-runners-google-cloud-dataflow-java/0.5.0-incubating-SNAPSHOT/beam-runners-google-cloud-dataflow-java-0.5.0-incubating-SNAPSHOT-javadoc.jar
[JENKINS] Archiving <https://builds.apache.org/job/beam_PostCommit_Java_MavenInstall/ws/runners/google-cloud-dataflow-java/target/beam-runners-google-cloud-dataflow-java-0.5.0-incubating-SNAPSHOT-sources.jar>
to org.apache.beam/beam-runners-google-cloud-dataflow-java/0.5.0-incubating-SNAPSHOT/beam-runners-google-cloud-dataflow-java-0.5.0-incubating-SNAPSHOT-sources.jar
[JENKINS] Archiving <https://builds.apache.org/job/beam_PostCommit_Java_MavenInstall/ws/runners/google-cloud-dataflow-java/target/beam-runners-google-cloud-dataflow-java-0.5.0-incubating-SNAPSHOT-test-sources.jar>
to org.apache.beam/beam-runners-google-cloud-dataflow-java/0.5.0-incubating-SNAPSHOT/beam-runners-google-cloud-dataflow-java-0.5.0-incubating-SNAPSHOT-test-sources.jar
[JENKINS] Archiving <https://builds.apache.org/job/beam_PostCommit_Java_MavenInstall/ws/runners/google-cloud-dataflow-java/target/beam-runners-google-cloud-dataflow-java-0.5.0-incubating-SNAPSHOT-tests.jar>
to org.apache.beam/beam-runners-google-cloud-dataflow-java/0.5.0-incubating-SNAPSHOT/beam-runners-google-cloud-dataflow-java-0.5.0-incubating-SNAPSHOT-tests.jar
[JENKINS] Archiving <https://builds.apache.org/job/beam_PostCommit_Java_MavenInstall/ws/runners/apex/pom.xml>
to org.apache.beam/beam-runners-apex/0.5.0-incubating-SNAPSHOT/beam-runners-apex-0.5.0-incubating-SNAPSHOT.pom
[JENKINS] Archiving <https://builds.apache.org/job/beam_PostCommit_Java_MavenInstall/ws/sdks/java/io/jms/pom.xml>
to org.apache.beam/beam-sdks-java-io-jms/0.5.0-incubating-SNAPSHOT/beam-sdks-java-io-jms-0.5.0-incubating-SNAPSHOT.pom
[JENKINS] Archiving <https://builds.apache.org/job/beam_PostCommit_Java_MavenInstall/ws/sdks/java/io/jms/target/beam-sdks-java-io-jms-0.5.0-incubating-SNAPSHOT.jar>
to org.apache.beam/beam-sdks-java-io-jms/0.5.0-incubating-SNAPSHOT/beam-sdks-java-io-jms-0.5.0-incubating-SNAPSHOT.jar
[JENKINS] Archiving <https://builds.apache.org/job/beam_PostCommit_Java_MavenInstall/ws/sdks/java/io/jms/target/beam-sdks-java-io-jms-0.5.0-incubating-SNAPSHOT-javadoc.jar>
to org.apache.beam/beam-sdks-java-io-jms/0.5.0-incubating-SNAPSHOT/beam-sdks-java-io-jms-0.5.0-incubating-SNAPSHOT-javadoc.jar
[JENKINS] Archiving <https://builds.apache.org/job/beam_PostCommit_Java_MavenInstall/ws/sdks/java/io/jms/target/beam-sdks-java-io-jms-0.5.0-incubating-SNAPSHOT-sources.jar>
to org.apache.beam/beam-sdks-java-io-jms/0.5.0-incubating-SNAPSHOT/beam-sdks-java-io-jms-0.5.0-incubating-SNAPSHOT-sources.jar
[JENKINS] Archiving <https://builds.apache.org/job/beam_PostCommit_Java_MavenInstall/ws/sdks/java/io/jms/target/beam-sdks-java-io-jms-0.5.0-incubating-SNAPSHOT-test-sources.jar>
to org.apache.beam/beam-sdks-java-io-jms/0.5.0-incubating-SNAPSHOT/beam-sdks-java-io-jms-0.5.0-incubating-SNAPSHOT-test-sources.jar
[JENKINS] Archiving <https://builds.apache.org/job/beam_PostCommit_Java_MavenInstall/ws/sdks/java/io/jms/target/beam-sdks-java-io-jms-0.5.0-incubating-SNAPSHOT-tests.jar>
to org.apache.beam/beam-sdks-java-io-jms/0.5.0-incubating-SNAPSHOT/beam-sdks-java-io-jms-0.5.0-incubating-SNAPSHOT-tests.jar
[JENKINS] Archiving <https://builds.apache.org/job/beam_PostCommit_Java_MavenInstall/ws/runners/flink/pom.xml>
to org.apache.beam/beam-runners-flink-parent/0.5.0-incubating-SNAPSHOT/beam-runners-flink-parent-0.5.0-incubating-SNAPSHOT.pom
[JENKINS] Archiving <https://builds.apache.org/job/beam_PostCommit_Java_MavenInstall/ws/sdks/java/io/mongodb/pom.xml>
to org.apache.beam/beam-sdks-java-io-mongodb/0.5.0-incubating-SNAPSHOT/beam-sdks-java-io-mongodb-0.5.0-incubating-SNAPSHOT.pom
[JENKINS] Archiving <https://builds.apache.org/job/beam_PostCommit_Java_MavenInstall/ws/sdks/java/io/mongodb/target/beam-sdks-java-io-mongodb-0.5.0-incubating-SNAPSHOT.jar>
to org.apache.beam/beam-sdks-java-io-mongodb/0.5.0-incubating-SNAPSHOT/beam-sdks-java-io-mongodb-0.5.0-incubating-SNAPSHOT.jar
[JENKINS] Archiving <https://builds.apache.org/job/beam_PostCommit_Java_MavenInstall/ws/sdks/java/io/mongodb/target/beam-sdks-java-io-mongodb-0.5.0-incubating-SNAPSHOT-javadoc.jar>
to org.apache.beam/beam-sdks-java-io-mongodb/0.5.0-incubating-SNAPSHOT/beam-sdks-java-io-mongodb-0.5.0-incubating-SNAPSHOT-javadoc.jar
[JENKINS] Archiving <https://builds.apache.org/job/beam_PostCommit_Java_MavenInstall/ws/sdks/java/io/mongodb/target/beam-sdks-java-io-mongodb-0.5.0-incubating-SNAPSHOT-sources.jar>
to org.apache.beam/beam-sdks-java-io-mongodb/0.5.0-incubating-SNAPSHOT/beam-sdks-java-io-mongodb-0.5.0-incubating-SNAPSHOT-sources.jar
[JENKINS] Archiving <https://builds.apache.org/job/beam_PostCommit_Java_MavenInstall/ws/sdks/java/io/mongodb/target/beam-sdks-java-io-mongodb-0.5.0-incubating-SNAPSHOT-test-sources.jar>
to org.apache.beam/beam-sdks-java-io-mongodb/0.5.0-incubating-SNAPSHOT/beam-sdks-java-io-mongodb-0.5.0-incubating-SNAPSHOT-test-sources.jar
[JENKINS] Archiving <https://builds.apache.org/job/beam_PostCommit_Java_MavenInstall/ws/sdks/java/io/mongodb/target/beam-sdks-java-io-mongodb-0.5.0-incubating-SNAPSHOT-tests.jar>
to org.apache.beam/beam-sdks-java-io-mongodb/0.5.0-incubating-SNAPSHOT/beam-sdks-java-io-mongodb-0.5.0-incubating-SNAPSHOT-tests.jar
[JENKINS] Archiving <https://builds.apache.org/job/beam_PostCommit_Java_MavenInstall/ws/sdks/java/extensions/sorter/pom.xml>
to org.apache.beam/beam-sdks-java-extensions-sorter/0.5.0-incubating-SNAPSHOT/beam-sdks-java-extensions-sorter-0.5.0-incubating-SNAPSHOT.pom
[JENKINS] Archiving <https://builds.apache.org/job/beam_PostCommit_Java_MavenInstall/ws/sdks/pom.xml>
to org.apache.beam/beam-sdks-parent/0.5.0-incubating-SNAPSHOT/beam-sdks-parent-0.5.0-incubating-SNAPSHOT.pom
[JENKINS] Archiving <https://builds.apache.org/job/beam_PostCommit_Java_MavenInstall/ws/sdks/java/extensions/join-library/pom.xml>
to org.apache.beam/beam-sdks-java-extensions-join-library/0.5.0-incubating-SNAPSHOT/beam-sdks-java-extensions-join-library-0.5.0-incubating-SNAPSHOT.pom
[JENKINS] Archiving <https://builds.apache.org/job/beam_PostCommit_Java_MavenInstall/ws/runners/pom.xml>
to org.apache.beam/beam-runners-parent/0.5.0-incubating-SNAPSHOT/beam-runners-parent-0.5.0-incubating-SNAPSHOT.pom
[JENKINS] Archiving <https://builds.apache.org/job/beam_PostCommit_Java_MavenInstall/ws/sdks/java/io/jdbc/pom.xml>
to org.apache.beam/beam-sdks-java-io-jdbc/0.5.0-incubating-SNAPSHOT/beam-sdks-java-io-jdbc-0.5.0-incubating-SNAPSHOT.pom
[JENKINS] Archiving <https://builds.apache.org/job/beam_PostCommit_Java_MavenInstall/ws/sdks/java/io/jdbc/target/beam-sdks-java-io-jdbc-0.5.0-incubating-SNAPSHOT.jar>
to org.apache.beam/beam-sdks-java-io-jdbc/0.5.0-incubating-SNAPSHOT/beam-sdks-java-io-jdbc-0.5.0-incubating-SNAPSHOT.jar
[JENKINS] Archiving <https://builds.apache.org/job/beam_PostCommit_Java_MavenInstall/ws/sdks/java/io/jdbc/target/beam-sdks-java-io-jdbc-0.5.0-incubating-SNAPSHOT-javadoc.jar>
to org.apache.beam/beam-sdks-java-io-jdbc/0.5.0-incubating-SNAPSHOT/beam-sdks-java-io-jdbc-0.5.0-incubating-SNAPSHOT-javadoc.jar
[JENKINS] Archiving <https://builds.apache.org/job/beam_PostCommit_Java_MavenInstall/ws/sdks/java/io/jdbc/target/beam-sdks-java-io-jdbc-0.5.0-incubating-SNAPSHOT-sources.jar>
to org.apache.beam/beam-sdks-java-io-jdbc/0.5.0-incubating-SNAPSHOT/beam-sdks-java-io-jdbc-0.5.0-incubating-SNAPSHOT-sources.jar
[JENKINS] Archiving <https://builds.apache.org/job/beam_PostCommit_Java_MavenInstall/ws/sdks/java/io/jdbc/target/beam-sdks-java-io-jdbc-0.5.0-incubating-SNAPSHOT-test-sources.jar>
to org.apache.beam/beam-sdks-java-io-jdbc/0.5.0-incubating-SNAPSHOT/beam-sdks-java-io-jdbc-0.5.0-incubating-SNAPSHOT-test-sources.jar
[JENKINS] Archiving <https://builds.apache.org/job/beam_PostCommit_Java_MavenInstall/ws/sdks/java/io/jdbc/target/beam-sdks-java-io-jdbc-0.5.0-incubating-SNAPSHOT-tests.jar>
to org.apache.beam/beam-sdks-java-io-jdbc/0.5.0-incubating-SNAPSHOT/beam-sdks-java-io-jdbc-0.5.0-incubating-SNAPSHOT-tests.jar
[JENKINS] Archiving <https://builds.apache.org/job/beam_PostCommit_Java_MavenInstall/ws/sdks/java/extensions/pom.xml>
to org.apache.beam/beam-sdks-java-extensions-parent/0.5.0-incubating-SNAPSHOT/beam-sdks-java-extensions-parent-0.5.0-incubating-SNAPSHOT.pom
[JENKINS] Archiving <https://builds.apache.org/job/beam_PostCommit_Java_MavenInstall/ws/examples/pom.xml>
to org.apache.beam/beam-examples-parent/0.5.0-incubating-SNAPSHOT/beam-examples-parent-0.5.0-incubating-SNAPSHOT.pom
channel stopped


Mime
View raw message