beam-commits mailing list archives

Site index · List index
Message view « Date » · « Thread »
Top « Date » · « Thread »
From Apache Jenkins Server <jenk...@builds.apache.org>
Subject Build failed in Jenkins: beam_PostCommit_Java_RunnableOnService_Spark #477
Date Mon, 19 Dec 2016 23:15:01 GMT
See <https://builds.apache.org/job/beam_PostCommit_Java_RunnableOnService_Spark/477/changes>

Changes:

[klk] Fix seed job fetch spec

[bchambers] Add RunnableOnService test for Metrics

[klk] More escaping in Jenkins timestamp spec

------------------------------------------
[...truncated 3780 lines...]
	at hudson.maven.reporters.MavenArtifactArchiver.postBuild(MavenArtifactArchiver.java:100)
	at hudson.maven.Maven3Builder$MavenExecutionListener.sessionEnded(Maven3Builder.java:471)
	at hudson.maven.Maven3Builder$JenkinsEventSpy.onEvent(Maven3Builder.java:287)
	at org.apache.maven.eventspy.internal.EventSpyDispatcher.onEvent(EventSpyDispatcher.java:108)
	at org.apache.maven.eventspy.internal.EventSpyExecutionListener.sessionEnded(EventSpyExecutionListener.java:61)
	at org.apache.maven.lifecycle.internal.DefaultExecutionEventCatapult.fire(DefaultExecutionEventCatapult.java:64)
	at org.apache.maven.lifecycle.internal.DefaultExecutionEventCatapult.fire(DefaultExecutionEventCatapult.java:42)
	at org.apache.maven.lifecycle.internal.LifecycleStarter.execute(LifecycleStarter.java:137)
	at org.apache.maven.DefaultMaven.doExecute(DefaultMaven.java:307)
	at org.apache.maven.DefaultMaven.doExecute(DefaultMaven.java:193)
	at org.apache.maven.DefaultMaven.execute(DefaultMaven.java:106)
	at org.jvnet.hudson.maven3.launcher.Maven32Launcher.main(Maven32Launcher.java:132)
	at sun.reflect.NativeMethodAccessorImpl.invoke0(Native Method)
	at sun.reflect.NativeMethodAccessorImpl.invoke(NativeMethodAccessorImpl.java:62)
	at sun.reflect.DelegatingMethodAccessorImpl.invoke(DelegatingMethodAccessorImpl.java:43)
	at java.lang.reflect.Method.invoke(Method.java:498)
	at org.codehaus.plexus.classworlds.launcher.Launcher.launchStandard(Launcher.java:330)
	at org.codehaus.plexus.classworlds.launcher.Launcher.launch(Launcher.java:238)
	at jenkins.maven3.agent.Maven32Main.launch(Maven32Main.java:186)
	at sun.reflect.NativeMethodAccessorImpl.invoke0(Native Method)
	at sun.reflect.NativeMethodAccessorImpl.invoke(NativeMethodAccessorImpl.java:62)
	at sun.reflect.DelegatingMethodAccessorImpl.invoke(DelegatingMethodAccessorImpl.java:43)
	at java.lang.reflect.Method.invoke(Method.java:498)
	at hudson.maven.Maven3Builder.call(Maven3Builder.java:136)
	at hudson.maven.Maven3Builder.call(Maven3Builder.java:71)
	at hudson.remoting.UserRequest.perform(UserRequest.java:153)
	at hudson.remoting.UserRequest.perform(UserRequest.java:50)
	at hudson.remoting.Request$2.run(Request.java:332)
	at hudson.remoting.InterceptingExecutorService$1.call(InterceptingExecutorService.java:68)
	at java.util.concurrent.FutureTask.run(FutureTask.java:266)
	at java.util.concurrent.ThreadPoolExecutor.runWorker(ThreadPoolExecutor.java:1142)
	at java.util.concurrent.ThreadPoolExecutor$Worker.run(ThreadPoolExecutor.java:617)
	at java.lang.Thread.run(Thread.java:745)
java.io.FileNotFoundException: <https://builds.apache.org/job/beam_PostCommit_Java_RunnableOnService_Spark/ws/sdks/java/io/kafka/pom.xml>
(No such file or directory)
	at java.io.FileInputStream.open0(Native Method)
	at java.io.FileInputStream.open(FileInputStream.java:195)
	at java.io.FileInputStream.<init>(FileInputStream.java:138)
	at hudson.Util.getDigestOf(Util.java:800)
	at hudson.maven.reporters.MavenArtifactArchiver.postBuild(MavenArtifactArchiver.java:100)
	at hudson.maven.Maven3Builder$MavenExecutionListener.sessionEnded(Maven3Builder.java:471)
	at hudson.maven.Maven3Builder$JenkinsEventSpy.onEvent(Maven3Builder.java:287)
	at org.apache.maven.eventspy.internal.EventSpyDispatcher.onEvent(EventSpyDispatcher.java:108)
	at org.apache.maven.eventspy.internal.EventSpyExecutionListener.sessionEnded(EventSpyExecutionListener.java:61)
	at org.apache.maven.lifecycle.internal.DefaultExecutionEventCatapult.fire(DefaultExecutionEventCatapult.java:64)
	at org.apache.maven.lifecycle.internal.DefaultExecutionEventCatapult.fire(DefaultExecutionEventCatapult.java:42)
	at org.apache.maven.lifecycle.internal.LifecycleStarter.execute(LifecycleStarter.java:137)
	at org.apache.maven.DefaultMaven.doExecute(DefaultMaven.java:307)
	at org.apache.maven.DefaultMaven.doExecute(DefaultMaven.java:193)
	at org.apache.maven.DefaultMaven.execute(DefaultMaven.java:106)
	at org.jvnet.hudson.maven3.launcher.Maven32Launcher.main(Maven32Launcher.java:132)
	at sun.reflect.NativeMethodAccessorImpl.invoke0(Native Method)
	at sun.reflect.NativeMethodAccessorImpl.invoke(NativeMethodAccessorImpl.java:62)
	at sun.reflect.DelegatingMethodAccessorImpl.invoke(DelegatingMethodAccessorImpl.java:43)
	at java.lang.reflect.Method.invoke(Method.java:498)
	at org.codehaus.plexus.classworlds.launcher.Launcher.launchStandard(Launcher.java:330)
	at org.codehaus.plexus.classworlds.launcher.Launcher.launch(Launcher.java:238)
	at jenkins.maven3.agent.Maven32Main.launch(Maven32Main.java:186)
	at sun.reflect.NativeMethodAccessorImpl.invoke0(Native Method)
	at sun.reflect.NativeMethodAccessorImpl.invoke(NativeMethodAccessorImpl.java:62)
	at sun.reflect.DelegatingMethodAccessorImpl.invoke(DelegatingMethodAccessorImpl.java:43)
	at java.lang.reflect.Method.invoke(Method.java:498)
	at hudson.maven.Maven3Builder.call(Maven3Builder.java:136)
	at hudson.maven.Maven3Builder.call(Maven3Builder.java:71)
	at hudson.remoting.UserRequest.perform(UserRequest.java:153)
	at hudson.remoting.UserRequest.perform(UserRequest.java:50)
	at hudson.remoting.Request$2.run(Request.java:332)
	at hudson.remoting.InterceptingExecutorService$1.call(InterceptingExecutorService.java:68)
	at java.util.concurrent.FutureTask.run(FutureTask.java:266)
	at java.util.concurrent.ThreadPoolExecutor.runWorker(ThreadPoolExecutor.java:1142)
	at java.util.concurrent.ThreadPoolExecutor$Worker.run(ThreadPoolExecutor.java:617)
	at java.lang.Thread.run(Thread.java:745)
java.io.FileNotFoundException: <https://builds.apache.org/job/beam_PostCommit_Java_RunnableOnService_Spark/ws/sdks/java/pom.xml>
(No such file or directory)
	at java.io.FileInputStream.open0(Native Method)
	at java.io.FileInputStream.open(FileInputStream.java:195)
	at java.io.FileInputStream.<init>(FileInputStream.java:138)
	at hudson.Util.getDigestOf(Util.java:800)
	at hudson.maven.reporters.MavenArtifactArchiver.postBuild(MavenArtifactArchiver.java:100)
	at hudson.maven.Maven3Builder$MavenExecutionListener.sessionEnded(Maven3Builder.java:471)
	at hudson.maven.Maven3Builder$JenkinsEventSpy.onEvent(Maven3Builder.java:287)
	at org.apache.maven.eventspy.internal.EventSpyDispatcher.onEvent(EventSpyDispatcher.java:108)
	at org.apache.maven.eventspy.internal.EventSpyExecutionListener.sessionEnded(EventSpyExecutionListener.java:61)
	at org.apache.maven.lifecycle.internal.DefaultExecutionEventCatapult.fire(DefaultExecutionEventCatapult.java:64)
	at org.apache.maven.lifecycle.internal.DefaultExecutionEventCatapult.fire(DefaultExecutionEventCatapult.java:42)
	at org.apache.maven.lifecycle.internal.LifecycleStarter.execute(LifecycleStarter.java:137)
	at org.apache.maven.DefaultMaven.doExecute(DefaultMaven.java:307)
	at org.apache.maven.DefaultMaven.doExecute(DefaultMaven.java:193)
	at org.apache.maven.DefaultMaven.execute(DefaultMaven.java:106)
	at org.jvnet.hudson.maven3.launcher.Maven32Launcher.main(Maven32Launcher.java:132)
	at sun.reflect.NativeMethodAccessorImpl.invoke0(Native Method)
	at sun.reflect.NativeMethodAccessorImpl.invoke(NativeMethodAccessorImpl.java:62)
	at sun.reflect.DelegatingMethodAccessorImpl.invoke(DelegatingMethodAccessorImpl.java:43)
	at java.lang.reflect.Method.invoke(Method.java:498)
	at org.codehaus.plexus.classworlds.launcher.Launcher.launchStandard(Launcher.java:330)
	at org.codehaus.plexus.classworlds.launcher.Launcher.launch(Launcher.java:238)
	at jenkins.maven3.agent.Maven32Main.launch(Maven32Main.java:186)
	at sun.reflect.NativeMethodAccessorImpl.invoke0(Native Method)
	at sun.reflect.NativeMethodAccessorImpl.invoke(NativeMethodAccessorImpl.java:62)
	at sun.reflect.DelegatingMethodAccessorImpl.invoke(DelegatingMethodAccessorImpl.java:43)
	at java.lang.reflect.Method.invoke(Method.java:498)
	at hudson.maven.Maven3Builder.call(Maven3Builder.java:136)
	at hudson.maven.Maven3Builder.call(Maven3Builder.java:71)
	at hudson.remoting.UserRequest.perform(UserRequest.java:153)
	at hudson.remoting.UserRequest.perform(UserRequest.java:50)
	at hudson.remoting.Request$2.run(Request.java:332)
	at hudson.remoting.InterceptingExecutorService$1.call(InterceptingExecutorService.java:68)
	at java.util.concurrent.FutureTask.run(FutureTask.java:266)
	at java.util.concurrent.ThreadPoolExecutor.runWorker(ThreadPoolExecutor.java:1142)
	at java.util.concurrent.ThreadPoolExecutor$Worker.run(ThreadPoolExecutor.java:617)
	at java.lang.Thread.run(Thread.java:745)
java.io.FileNotFoundException: <https://builds.apache.org/job/beam_PostCommit_Java_RunnableOnService_Spark/ws/pom.xml>
(No such file or directory)
	at java.io.FileInputStream.open0(Native Method)
	at java.io.FileInputStream.open(FileInputStream.java:195)
	at java.io.FileInputStream.<init>(FileInputStream.java:138)
	at hudson.Util.getDigestOf(Util.java:800)
	at hudson.maven.reporters.MavenArtifactArchiver.postBuild(MavenArtifactArchiver.java:100)
	at hudson.maven.Maven3Builder$MavenExecutionListener.sessionEnded(Maven3Builder.java:471)
	at hudson.maven.Maven3Builder$JenkinsEventSpy.onEvent(Maven3Builder.java:287)
	at org.apache.maven.eventspy.internal.EventSpyDispatcher.onEvent(EventSpyDispatcher.java:108)
	at org.apache.maven.eventspy.internal.EventSpyExecutionListener.sessionEnded(EventSpyExecutionListener.java:61)
	at org.apache.maven.lifecycle.internal.DefaultExecutionEventCatapult.fire(DefaultExecutionEventCatapult.java:64)
	at org.apache.maven.lifecycle.internal.DefaultExecutionEventCatapult.fire(DefaultExecutionEventCatapult.java:42)
	at org.apache.maven.lifecycle.internal.LifecycleStarter.execute(LifecycleStarter.java:137)
	at org.apache.maven.DefaultMaven.doExecute(DefaultMaven.java:307)
	at org.apache.maven.DefaultMaven.doExecute(DefaultMaven.java:193)
	at org.apache.maven.DefaultMaven.execute(DefaultMaven.java:106)
	at org.jvnet.hudson.maven3.launcher.Maven32Launcher.main(Maven32Launcher.java:132)
	at sun.reflect.NativeMethodAccessorImpl.invoke0(Native Method)
	at sun.reflect.NativeMethodAccessorImpl.invoke(NativeMethodAccessorImpl.java:62)
	at sun.reflect.DelegatingMethodAccessorImpl.invoke(DelegatingMethodAccessorImpl.java:43)
	at java.lang.reflect.Method.invoke(Method.java:498)
	at org.codehaus.plexus.classworlds.launcher.Launcher.launchStandard(Launcher.java:330)
	at org.codehaus.plexus.classworlds.launcher.Launcher.launch(Launcher.java:238)
	at jenkins.maven3.agent.Maven32Main.launch(Maven32Main.java:186)
	at sun.reflect.NativeMethodAccessorImpl.invoke0(Native Method)
	at sun.reflect.NativeMethodAccessorImpl.invoke(NativeMethodAccessorImpl.java:62)
	at sun.reflect.DelegatingMethodAccessorImpl.invoke(DelegatingMethodAccessorImpl.java:43)
	at java.lang.reflect.Method.invoke(Method.java:498)
	at hudson.maven.Maven3Builder.call(Maven3Builder.java:136)
	at hudson.maven.Maven3Builder.call(Maven3Builder.java:71)
	at hudson.remoting.UserRequest.perform(UserRequest.java:153)
	at hudson.remoting.UserRequest.perform(UserRequest.java:50)
	at hudson.remoting.Request$2.run(Request.java:332)
	at hudson.remoting.InterceptingExecutorService$1.call(InterceptingExecutorService.java:68)
	at java.util.concurrent.FutureTask.run(FutureTask.java:266)
	at java.util.concurrent.ThreadPoolExecutor.runWorker(ThreadPoolExecutor.java:1142)
	at java.util.concurrent.ThreadPoolExecutor$Worker.run(ThreadPoolExecutor.java:617)
	at java.lang.Thread.run(Thread.java:745)
2016-12-19T20:15:05.855 [INFO] ------------------------------------------------------------------------
2016-12-19T20:15:05.855 [INFO] Reactor Summary:
2016-12-19T20:15:05.855 [INFO] 
2016-12-19T20:15:05.855 [INFO] Apache Beam :: Parent .............................. SUCCESS
[ 19.480 s]
2016-12-19T20:15:05.857 [INFO] Apache Beam :: SDKs ................................ SUCCESS
[  0.434 s]
2016-12-19T20:15:05.857 [INFO] Apache Beam :: SDKs :: Java ........................ SUCCESS
[  0.541 s]
2016-12-19T20:15:05.858 [INFO] Apache Beam :: SDKs :: Java :: Core ................ SUCCESS
[02:16 min]
2016-12-19T20:15:05.858 [INFO] Apache Beam :: Runners ............................. SUCCESS
[  0.719 s]
2016-12-19T20:15:05.858 [INFO] Apache Beam :: Runners :: Core Java ................ SUCCESS
[ 28.326 s]
2016-12-19T20:15:05.858 [INFO] Apache Beam :: Runners :: Direct Java .............. SUCCESS
[02:21 min]
2016-12-19T20:15:05.858 [INFO] Apache Beam :: SDKs :: Java :: IO .................. SUCCESS
[  2.084 s]
2016-12-19T20:15:05.858 [INFO] Apache Beam :: SDKs :: Java :: IO :: Kafka ......... FAILURE
[  6.122 s]
2016-12-19T20:15:05.858 [INFO] Apache Beam :: Runners :: Spark .................... SKIPPED
2016-12-19T20:15:05.858 [INFO] ------------------------------------------------------------------------
2016-12-19T20:15:05.858 [INFO] BUILD FAILURE
2016-12-19T20:15:05.858 [INFO] ------------------------------------------------------------------------
2016-12-19T20:15:05.858 [INFO] Total time: 06:06 min
2016-12-19T20:15:05.858 [INFO] Finished at: 2016-12-19T20:15:05+00:00
2016-12-19T20:15:06.400 [INFO] Final Memory: 86M/1489M
2016-12-19T20:15:06.400 [INFO] ------------------------------------------------------------------------
Waiting for Jenkins to finish collecting data
2016-12-19T20:15:09.204 [ERROR] Failed to execute goal org.apache.maven.plugins:maven-jar-plugin:2.5:jar
(default-jar) on project beam-sdks-java-io-kafka: Error assembling JAR: <https://builds.apache.org/job/beam_PostCommit_Java_RunnableOnService_Spark/ws/sdks/java/io/kafka/pom.xml>
isn't a file. -> [Help 1]
org.apache.maven.lifecycle.LifecycleExecutionException: Failed to execute goal org.apache.maven.plugins:maven-jar-plugin:2.5:jar
(default-jar) on project beam-sdks-java-io-kafka: Error assembling JAR
	at org.apache.maven.lifecycle.internal.MojoExecutor.execute(MojoExecutor.java:216)
	at org.apache.maven.lifecycle.internal.MojoExecutor.execute(MojoExecutor.java:153)
	at org.apache.maven.lifecycle.internal.MojoExecutor.execute(MojoExecutor.java:145)
	at org.apache.maven.lifecycle.internal.LifecycleModuleBuilder.buildProject(LifecycleModuleBuilder.java:116)
	at org.apache.maven.lifecycle.internal.LifecycleModuleBuilder.buildProject(LifecycleModuleBuilder.java:80)
	at org.apache.maven.lifecycle.internal.builder.singlethreaded.SingleThreadedBuilder.build(SingleThreadedBuilder.java:51)
	at org.apache.maven.lifecycle.internal.LifecycleStarter.execute(LifecycleStarter.java:128)
	at org.apache.maven.DefaultMaven.doExecute(DefaultMaven.java:307)
	at org.apache.maven.DefaultMaven.doExecute(DefaultMaven.java:193)
	at org.apache.maven.DefaultMaven.execute(DefaultMaven.java:106)
	at org.jvnet.hudson.maven3.launcher.Maven32Launcher.main(Maven32Launcher.java:132)
	at sun.reflect.NativeMethodAccessorImpl.invoke0(Native Method)
	at sun.reflect.NativeMethodAccessorImpl.invoke(NativeMethodAccessorImpl.java:62)
	at sun.reflect.DelegatingMethodAccessorImpl.invoke(DelegatingMethodAccessorImpl.java:43)
	at java.lang.reflect.Method.invoke(Method.java:498)
	at org.codehaus.plexus.classworlds.launcher.Launcher.launchStandard(Launcher.java:330)
	at org.codehaus.plexus.classworlds.launcher.Launcher.launch(Launcher.java:238)
	at jenkins.maven3.agent.Maven32Main.launch(Maven32Main.java:186)
	at sun.reflect.NativeMethodAccessorImpl.invoke0(Native Method)
	at sun.reflect.NativeMethodAccessorImpl.invoke(NativeMethodAccessorImpl.java:62)
	at sun.reflect.DelegatingMethodAccessorImpl.invoke(DelegatingMethodAccessorImpl.java:43)
	at java.lang.reflect.Method.invoke(Method.java:498)
	at hudson.maven.Maven3Builder.call(Maven3Builder.java:136)
	at hudson.maven.Maven3Builder.call(Maven3Builder.java:71)
	at hudson.remoting.UserRequest.perform(UserRequest.java:153)
	at hudson.remoting.UserRequest.perform(UserRequest.java:50)
	at hudson.remoting.Request$2.run(Request.java:332)
	at hudson.remoting.InterceptingExecutorService$1.call(InterceptingExecutorService.java:68)
	at java.util.concurrent.FutureTask.run(FutureTask.java:266)
	at java.util.concurrent.ThreadPoolExecutor.runWorker(ThreadPoolExecutor.java:1142)
	at java.util.concurrent.ThreadPoolExecutor$Worker.run(ThreadPoolExecutor.java:617)
	at java.lang.Thread.run(Thread.java:745)
Caused by: org.apache.maven.plugin.MojoExecutionException: Error assembling JAR
	at org.apache.maven.plugin.jar.AbstractJarMojo.createArchive(AbstractJarMojo.java:233)
	at org.apache.maven.plugin.jar.AbstractJarMojo.execute(AbstractJarMojo.java:251)
	at org.apache.maven.plugin.DefaultBuildPluginManager.executeMojo(DefaultBuildPluginManager.java:134)
	at org.apache.maven.lifecycle.internal.MojoExecutor.execute(MojoExecutor.java:208)
	... 31 more
Caused by: org.codehaus.plexus.archiver.ArchiverException: <https://builds.apache.org/job/beam_PostCommit_Java_RunnableOnService_Spark/ws/sdks/java/io/kafka/pom.xml>
isn't a file.
	at org.codehaus.plexus.archiver.AbstractArchiver.addFile(AbstractArchiver.java:386)
	at org.codehaus.plexus.archiver.AbstractArchiver.addFile(AbstractArchiver.java:326)
	at org.apache.maven.archiver.MavenArchiver.createArchive(MavenArchiver.java:526)
	at org.apache.maven.plugin.jar.AbstractJarMojo.createArchive(AbstractJarMojo.java:226)
	... 34 more
2016-12-19T20:15:09.205 [ERROR] 
2016-12-19T20:15:09.205 [ERROR] Re-run Maven using the -X switch to enable full debug logging.
2016-12-19T20:15:09.205 [ERROR] 
2016-12-19T20:15:09.206 [ERROR] For more information about the errors and possible solutions,
please read the following articles:
2016-12-19T20:15:09.206 [ERROR] [Help 1] http://cwiki.apache.org/confluence/display/MAVEN/MojoExecutionException
2016-12-19T20:15:09.206 [ERROR] 
2016-12-19T20:15:09.206 [ERROR] After correcting the problems, you can resume the build with
the command
2016-12-19T20:15:09.206 [ERROR]   mvn <goals> -rf :beam-sdks-java-io-kafka
[JENKINS] Archiving <https://builds.apache.org/job/beam_PostCommit_Java_RunnableOnService_Spark/ws/runners/direct-java/dependency-reduced-pom.xml>
to org.apache.beam/beam-runners-direct-java/0.5.0-incubating-SNAPSHOT/beam-runners-direct-java-0.5.0-incubating-SNAPSHOT.pom
[JENKINS] Archiving <https://builds.apache.org/job/beam_PostCommit_Java_RunnableOnService_Spark/ws/runners/direct-java/target/beam-runners-direct-java-0.5.0-incubating-SNAPSHOT.jar>
to org.apache.beam/beam-runners-direct-java/0.5.0-incubating-SNAPSHOT/beam-runners-direct-java-0.5.0-incubating-SNAPSHOT.jar
[JENKINS] Archiving <https://builds.apache.org/job/beam_PostCommit_Java_RunnableOnService_Spark/ws/runners/direct-java/target/beam-runners-direct-java-0.5.0-incubating-SNAPSHOT-tests.jar>
to org.apache.beam/beam-runners-direct-java/0.5.0-incubating-SNAPSHOT/beam-runners-direct-java-0.5.0-incubating-SNAPSHOT-tests.jar
Build timed out (after 100 minutes). Marking the build as aborted.
ERROR: Failed to parse POMs
java.io.IOException: Writer side has already been abandoned
	at hudson.remoting.FastPipedInputStream.source(FastPipedInputStream.java:83)
	at hudson.remoting.FastPipedInputStream.read(FastPipedInputStream.java:171)
	at hudson.util.HeadBufferingStream.read(HeadBufferingStream.java:61)
	at java.io.FilterInputStream.read(FilterInputStream.java:107)
	at hudson.util.HeadBufferingStream.fillSide(HeadBufferingStream.java:83)
	at com.cloudbees.jenkins.plugins.jsync.archiver.JSyncArtifactManager.inflate(JSyncArtifactManager.java:285)
	at com.cloudbees.jenkins.plugins.jsync.archiver.JSyncArtifactManager.remoteSync(JSyncArtifactManager.java:155)
	at com.cloudbees.jenkins.plugins.jsync.archiver.JSyncArtifactManager.archive(JSyncArtifactManager.java:76)
	at hudson.maven.MavenBuild$ProxyImpl.performArchiving(MavenBuild.java:483)
	at hudson.maven.MavenModuleSetBuild$MavenModuleSetBuildExecution.doRun(MavenModuleSetBuild.java:855)
	at hudson.model.AbstractBuild$AbstractBuildExecution.run(AbstractBuild.java:534)
	at hudson.model.Run.execute(Run.java:1741)
	at hudson.maven.MavenModuleSetBuild.run(MavenModuleSetBuild.java:531)
	at hudson.model.ResourceController.execute(ResourceController.java:98)
	at hudson.model.Executor.run(Executor.java:410)
Caused by: java.lang.Throwable
	at hudson.remoting.FastPipedInputStream.<init>(FastPipedInputStream.java:51)
	at hudson.remoting.Pipe.createRemoteToLocal(Pipe.java:140)
	at com.cloudbees.jenkins.plugins.jsync.archiver.JSyncArtifactManager.remoteSync(JSyncArtifactManager.java:132)
	... 8 more
channel stopped

Mime
View raw message