beam-commits mailing list archives

Site index · List index
Message view « Date » · « Thread »
Top « Date » · « Thread »
From Apache Jenkins Server <jenk...@builds.apache.org>
Subject Build failed in Jenkins: beam_PostCommit_Java_MavenInstall #2489
Date Wed, 01 Feb 2017 00:13:30 GMT
See <https://builds.apache.org/job/beam_PostCommit_Java_MavenInstall/2489/>

------------------------------------------
[...truncated 429 lines...]
2017-02-01T00:10:52.935 [INFO] Downloaded: https://repo.maven.apache.org/maven2/org/sonatype/sisu/sisu-inject-plexus/1.4.2/sisu-inject-plexus-1.4.2.pom
(6 KB at 187.3 KB/sec)
2017-02-01T00:10:52.938 [INFO] Downloading: https://repo.maven.apache.org/maven2/org/sonatype/sisu/inject/guice-plexus/1.4.2/guice-plexus-1.4.2.pom
2017-02-01T00:10:52.965 [INFO] Downloaded: https://repo.maven.apache.org/maven2/org/sonatype/sisu/inject/guice-plexus/1.4.2/guice-plexus-1.4.2.pom
(4 KB at 113.1 KB/sec)
2017-02-01T00:10:52.968 [INFO] Downloading: https://repo.maven.apache.org/maven2/org/sonatype/sisu/inject/guice-bean/1.4.2/guice-bean-1.4.2.pom
2017-02-01T00:10:52.995 [INFO] Downloaded: https://repo.maven.apache.org/maven2/org/sonatype/sisu/inject/guice-bean/1.4.2/guice-bean-1.4.2.pom
(3 KB at 94.3 KB/sec)
2017-02-01T00:10:52.998 [INFO] Downloading: https://repo.maven.apache.org/maven2/org/sonatype/sisu/sisu-inject/1.4.2/sisu-inject-1.4.2.pom
2017-02-01T00:10:53.054 [INFO] Downloaded: https://repo.maven.apache.org/maven2/org/sonatype/sisu/sisu-inject/1.4.2/sisu-inject-1.4.2.pom
(2 KB at 21.8 KB/sec)
2017-02-01T00:10:53.057 [INFO] Downloading: https://repo.maven.apache.org/maven2/org/sonatype/sisu/sisu-parent/1.4.2/sisu-parent-1.4.2.pom
2017-02-01T00:10:53.087 [INFO] Downloaded: https://repo.maven.apache.org/maven2/org/sonatype/sisu/sisu-parent/1.4.2/sisu-parent-1.4.2.pom
(8 KB at 253.2 KB/sec)
2017-02-01T00:10:53.090 [INFO] Downloading: https://repo.maven.apache.org/maven2/org/sonatype/forge/forge-parent/6/forge-parent-6.pom
2017-02-01T00:10:53.121 [INFO] Downloaded: https://repo.maven.apache.org/maven2/org/sonatype/forge/forge-parent/6/forge-parent-6.pom
(11 KB at 338.8 KB/sec)
2017-02-01T00:10:53.127 [INFO] Downloading: https://repo.maven.apache.org/maven2/org/codehaus/plexus/plexus-classworlds/2.2.3/plexus-classworlds-2.2.3.pom
2017-02-01T00:10:53.156 [INFO] Downloaded: https://repo.maven.apache.org/maven2/org/codehaus/plexus/plexus-classworlds/2.2.3/plexus-classworlds-2.2.3.pom
(4 KB at 134.6 KB/sec)
2017-02-01T00:10:53.160 [INFO] Downloading: https://repo.maven.apache.org/maven2/org/codehaus/plexus/plexus-utils/2.0.5/plexus-utils-2.0.5.pom
2017-02-01T00:10:53.189 [INFO] Downloaded: https://repo.maven.apache.org/maven2/org/codehaus/plexus/plexus-utils/2.0.5/plexus-utils-2.0.5.pom
(4 KB at 112.3 KB/sec)
2017-02-01T00:10:53.195 [INFO] Downloading: https://repo.maven.apache.org/maven2/org/sonatype/sisu/sisu-inject-bean/1.4.2/sisu-inject-bean-1.4.2.pom
2017-02-01T00:10:53.224 [INFO] Downloaded: https://repo.maven.apache.org/maven2/org/sonatype/sisu/sisu-inject-bean/1.4.2/sisu-inject-bean-1.4.2.pom
(6 KB at 183.8 KB/sec)
2017-02-01T00:10:53.229 [INFO] Downloading: https://repo.maven.apache.org/maven2/org/sonatype/sisu/sisu-guice/2.1.7/sisu-guice-2.1.7.pom
2017-02-01T00:10:53.257 [INFO] Downloaded: https://repo.maven.apache.org/maven2/org/sonatype/sisu/sisu-guice/2.1.7/sisu-guice-2.1.7.pom
(11 KB at 385.8 KB/sec)
2017-02-01T00:10:53.262 [INFO] Downloading: https://repo.maven.apache.org/maven2/org/apache/maven/shared/maven-shared-utils/3.0.0/maven-shared-utils-3.0.0.pom
2017-02-01T00:10:53.289 [INFO] Downloaded: https://repo.maven.apache.org/maven2/org/apache/maven/shared/maven-shared-utils/3.0.0/maven-shared-utils-3.0.0.pom
(6 KB at 202.0 KB/sec)
2017-02-01T00:10:53.291 [INFO] Downloading: https://repo.maven.apache.org/maven2/org/apache/maven/shared/maven-shared-components/21/maven-shared-components-21.pom
2017-02-01T00:10:53.318 [INFO] Downloaded: https://repo.maven.apache.org/maven2/org/apache/maven/shared/maven-shared-components/21/maven-shared-components-21.pom
(5 KB at 184.7 KB/sec)
2017-02-01T00:10:53.320 [INFO] Downloading: https://repo.maven.apache.org/maven2/org/apache/maven/maven-parent/25/maven-parent-25.pom
2017-02-01T00:10:53.353 [INFO] Downloaded: https://repo.maven.apache.org/maven2/org/apache/maven/maven-parent/25/maven-parent-25.pom
(37 KB at 1108.0 KB/sec)
2017-02-01T00:10:53.356 [INFO] Downloading: https://repo.maven.apache.org/maven2/org/apache/apache/15/apache-15.pom
2017-02-01T00:10:53.385 [INFO] Downloaded: https://repo.maven.apache.org/maven2/org/apache/apache/15/apache-15.pom
(15 KB at 513.1 KB/sec)
2017-02-01T00:10:53.389 [INFO] Downloading: https://repo.maven.apache.org/maven2/commons-io/commons-io/2.4/commons-io-2.4.pom
2017-02-01T00:10:53.416 [INFO] Downloaded: https://repo.maven.apache.org/maven2/commons-io/commons-io/2.4/commons-io-2.4.pom
(10 KB at 367.7 KB/sec)
2017-02-01T00:10:53.419 [INFO] Downloading: https://repo.maven.apache.org/maven2/org/apache/commons/commons-parent/25/commons-parent-25.pom
2017-02-01T00:10:53.452 [INFO] Downloaded: https://repo.maven.apache.org/maven2/org/apache/commons/commons-parent/25/commons-parent-25.pom
(48 KB at 1429.5 KB/sec)
2017-02-01T00:10:53.459 [INFO] Downloading: https://repo.maven.apache.org/maven2/org/apache/apache/9/apache-9.pom
2017-02-01T00:10:53.490 [INFO] Downloaded: https://repo.maven.apache.org/maven2/org/apache/apache/9/apache-9.pom
(15 KB at 477.6 KB/sec)
2017-02-01T00:10:53.496 [INFO] Downloading: https://repo.maven.apache.org/maven2/com/google/code/findbugs/jsr305/2.0.1/jsr305-2.0.1.pom
2017-02-01T00:10:53.522 [INFO] Downloaded: https://repo.maven.apache.org/maven2/com/google/code/findbugs/jsr305/2.0.1/jsr305-2.0.1.pom
(965 B at 36.2 KB/sec)
2017-02-01T00:10:53.530 [INFO] Downloading: https://repo.maven.apache.org/maven2/org/apache/maven/maven-plugin-api/3.0/maven-plugin-api-3.0.jar
2017-02-01T00:10:53.531 [INFO] Downloading: https://repo.maven.apache.org/maven2/org/codehaus/plexus/plexus-utils/2.0.4/plexus-utils-2.0.4.jar
2017-02-01T00:10:53.531 [INFO] Downloading: https://repo.maven.apache.org/maven2/org/apache/maven/maven-model/3.0/maven-model-3.0.jar
2017-02-01T00:10:53.531 [INFO] Downloading: https://repo.maven.apache.org/maven2/org/apache/maven/maven-artifact/3.0/maven-artifact-3.0.jar
2017-02-01T00:10:53.533 [INFO] Downloading: https://repo.maven.apache.org/maven2/org/sonatype/sisu/sisu-inject-plexus/1.4.2/sisu-inject-plexus-1.4.2.jar
2017-02-01T00:10:53.568 [INFO] Downloaded: https://repo.maven.apache.org/maven2/org/apache/maven/maven-plugin-api/3.0/maven-plugin-api-3.0.jar
(48 KB at 1257.2 KB/sec)
2017-02-01T00:10:53.568 [INFO] Downloading: https://repo.maven.apache.org/maven2/org/codehaus/plexus/plexus-classworlds/2.2.3/plexus-classworlds-2.2.3.jar
2017-02-01T00:10:53.601 [INFO] Downloaded: https://repo.maven.apache.org/maven2/org/codehaus/plexus/plexus-classworlds/2.2.3/plexus-classworlds-2.2.3.jar
(46 KB at 662.0 KB/sec)
2017-02-01T00:10:53.601 [INFO] Downloaded: https://repo.maven.apache.org/maven2/org/apache/maven/maven-model/3.0/maven-model-3.0.jar
(161 KB at 2265.1 KB/sec)
2017-02-01T00:10:53.601 [INFO] Downloading: https://repo.maven.apache.org/maven2/org/sonatype/sisu/sisu-inject-bean/1.4.2/sisu-inject-bean-1.4.2.jar
2017-02-01T00:10:53.602 [INFO] Downloading: https://repo.maven.apache.org/maven2/org/sonatype/sisu/sisu-guice/2.1.7/sisu-guice-2.1.7-noaop.jar
2017-02-01T00:10:53.622 [INFO] Downloaded: https://repo.maven.apache.org/maven2/org/codehaus/plexus/plexus-utils/2.0.4/plexus-utils-2.0.4.jar
(217 KB at 2357.9 KB/sec)
2017-02-01T00:10:53.623 [INFO] Downloading: https://repo.maven.apache.org/maven2/org/apache/maven/shared/maven-shared-utils/3.0.0/maven-shared-utils-3.0.0.jar
2017-02-01T00:10:53.624 [INFO] Downloaded: https://repo.maven.apache.org/maven2/org/apache/maven/maven-artifact/3.0/maven-artifact-3.0.jar
(51 KB at 539.3 KB/sec)
2017-02-01T00:10:53.625 [INFO] Downloading: https://repo.maven.apache.org/maven2/commons-io/commons-io/2.4/commons-io-2.4.jar
2017-02-01T00:10:53.655 [INFO] Downloaded: https://repo.maven.apache.org/maven2/org/sonatype/sisu/sisu-inject-bean/1.4.2/sisu-inject-bean-1.4.2.jar
(150 KB at 1224.6 KB/sec)
2017-02-01T00:10:53.655 [INFO] Downloading: https://repo.maven.apache.org/maven2/com/google/code/findbugs/jsr305/2.0.1/jsr305-2.0.1.jar
2017-02-01T00:10:53.686 [INFO] Downloaded: https://repo.maven.apache.org/maven2/org/sonatype/sisu/sisu-guice/2.1.7/sisu-guice-2.1.7-noaop.jar
(461 KB at 3011.0 KB/sec)
2017-02-01T00:10:53.686 [INFO] Downloaded: https://repo.maven.apache.org/maven2/com/google/code/findbugs/jsr305/2.0.1/jsr305-2.0.1.jar
(32 KB at 203.4 KB/sec)
2017-02-01T00:10:53.689 [INFO] Downloaded: https://repo.maven.apache.org/maven2/commons-io/commons-io/2.4/commons-io-2.4.jar
(181 KB at 1159.0 KB/sec)
2017-02-01T00:10:53.691 [INFO] Downloaded: https://repo.maven.apache.org/maven2/org/apache/maven/shared/maven-shared-utils/3.0.0/maven-shared-utils-3.0.0.jar
(152 KB at 956.2 KB/sec)
[WARNING] Failed to getClass for org.apache.maven.plugins.clean.CleanMojo
[JENKINS] Archiving disabled
2017-02-01T00:13:02.528 [INFO]                                                           
             
2017-02-01T00:13:02.528 [INFO] ------------------------------------------------------------------------
2017-02-01T00:13:02.528 [INFO] Skipping Apache Beam :: Parent
2017-02-01T00:13:02.528 [INFO] This project has been banned from the build due to previous
failures.
2017-02-01T00:13:02.528 [INFO] ------------------------------------------------------------------------
[JENKINS] Archiving disabled
[JENKINS] Archiving disabled
[JENKINS] Archiving disabled
[JENKINS] Archiving disabled
[JENKINS] Archiving disabled
[JENKINS] Archiving disabled
[JENKINS] Archiving disabled
[JENKINS] Archiving disabled
[JENKINS] Archiving disabled
[JENKINS] Archiving disabled
[JENKINS] Archiving disabled
[JENKINS] Archiving disabled
[JENKINS] Archiving disabled
[JENKINS] Archiving disabled
[JENKINS] Archiving disabled
[JENKINS] Archiving disabled
[JENKINS] Archiving disabled
[JENKINS] Archiving disabled
[JENKINS] Archiving disabled
[JENKINS] Archiving disabled
[JENKINS] Archiving disabled
[JENKINS] Archiving disabled
[JENKINS] Archiving disabled
[JENKINS] Archiving disabled
[JENKINS] Archiving disabled
[JENKINS] Archiving disabled
[JENKINS] Archiving disabled
[JENKINS] Archiving disabled
[JENKINS] Archiving disabled
[JENKINS] Archiving disabled
[JENKINS] Archiving disabled
[JENKINS] Archiving disabled
[JENKINS] Archiving disabled
[JENKINS] Archiving disabled
[JENKINS] Archiving disabled
[JENKINS] Archiving disabled
[JENKINS] Archiving disabled
2017-02-01T00:13:09.892 [INFO] ------------------------------------------------------------------------
2017-02-01T00:13:09.892 [INFO] Reactor Summary:
2017-02-01T00:13:09.892 [INFO] 
2017-02-01T00:13:09.893 [INFO] Apache Beam :: Parent .............................. FAILURE
[02:09 min]
2017-02-01T00:13:09.893 [INFO] Apache Beam :: SDKs :: Java :: Build Tools ......... SKIPPED
2017-02-01T00:13:09.893 [INFO] Apache Beam :: SDKs ................................ SKIPPED
2017-02-01T00:13:09.893 [INFO] Apache Beam :: SDKs :: Common ...................... SKIPPED
2017-02-01T00:13:09.893 [INFO] Apache Beam :: SDKs :: Common :: Fn API ............ SKIPPED
2017-02-01T00:13:09.893 [INFO] Apache Beam :: SDKs :: Java ........................ SKIPPED
2017-02-01T00:13:09.893 [INFO] Apache Beam :: SDKs :: Java :: Core ................ SKIPPED
2017-02-01T00:13:09.893 [INFO] Apache Beam :: Runners ............................. SKIPPED
2017-02-01T00:13:09.893 [INFO] Apache Beam :: Runners :: Core Java ................ SKIPPED
2017-02-01T00:13:09.893 [INFO] Apache Beam :: Runners :: Direct Java .............. SKIPPED
2017-02-01T00:13:09.893 [INFO] Apache Beam :: Runners :: Google Cloud Dataflow .... SKIPPED
2017-02-01T00:13:09.893 [INFO] Apache Beam :: SDKs :: Java :: IO .................. SKIPPED
2017-02-01T00:13:09.893 [INFO] Apache Beam :: SDKs :: Java :: IO :: Google Cloud Platform
SKIPPED
2017-02-01T00:13:09.893 [INFO] Apache Beam :: SDKs :: Java :: IO :: HDFS .......... SKIPPED
2017-02-01T00:13:09.893 [INFO] Apache Beam :: SDKs :: Java :: IO :: JMS ........... SKIPPED
2017-02-01T00:13:09.893 [INFO] Apache Beam :: SDKs :: Java :: IO :: Kafka ......... SKIPPED
2017-02-01T00:13:09.893 [INFO] Apache Beam :: SDKs :: Java :: IO :: Kinesis ....... SKIPPED
2017-02-01T00:13:09.894 [INFO] Apache Beam :: SDKs :: Java :: IO :: MongoDB ....... SKIPPED
2017-02-01T00:13:09.894 [INFO] Apache Beam :: SDKs :: Java :: IO :: JDBC .......... SKIPPED
2017-02-01T00:13:09.894 [INFO] Apache Beam :: SDKs :: Java :: IO :: Elasticsearch . SKIPPED
2017-02-01T00:13:09.894 [INFO] Apache Beam :: SDKs :: Java :: IO :: MQTT .......... SKIPPED
2017-02-01T00:13:09.894 [INFO] Apache Beam :: SDKs :: Java :: Maven Archetypes .... SKIPPED
2017-02-01T00:13:09.894 [INFO] Apache Beam :: SDKs :: Java :: Maven Archetypes :: Starter
SKIPPED
2017-02-01T00:13:09.894 [INFO] Apache Beam :: SDKs :: Java :: Maven Archetypes :: Examples
SKIPPED
2017-02-01T00:13:09.894 [INFO] Apache Beam :: SDKs :: Java :: Maven Archetypes :: Examples
- Java 8 SKIPPED
2017-02-01T00:13:09.895 [INFO] Apache Beam :: SDKs :: Java :: Extensions .......... SKIPPED
2017-02-01T00:13:09.895 [INFO] Apache Beam :: SDKs :: Java :: Extensions :: Join library SKIPPED
2017-02-01T00:13:09.895 [INFO] Apache Beam :: SDKs :: Java :: Extensions :: Sorter  SKIPPED
2017-02-01T00:13:09.895 [INFO] Apache Beam :: SDKs :: Java :: Harness ............. SKIPPED
2017-02-01T00:13:09.895 [INFO] Apache Beam :: SDKs :: Java :: Java 8 Tests ........ SKIPPED
2017-02-01T00:13:09.895 [INFO] Apache Beam :: SDKs :: Python ...................... SKIPPED
2017-02-01T00:13:09.895 [INFO] Apache Beam :: Runners :: Flink .................... SKIPPED
2017-02-01T00:13:09.895 [INFO] Apache Beam :: Runners :: Flink :: Core ............ SKIPPED
2017-02-01T00:13:09.895 [INFO] Apache Beam :: Runners :: Flink :: Examples ........ SKIPPED
2017-02-01T00:13:09.895 [INFO] Apache Beam :: Runners :: Spark .................... SKIPPED
2017-02-01T00:13:09.895 [INFO] Apache Beam :: Runners :: Apex ..................... SKIPPED
2017-02-01T00:13:09.895 [INFO] Apache Beam :: Examples ............................ SKIPPED
2017-02-01T00:13:09.895 [INFO] Apache Beam :: Examples :: Java .................... SKIPPED
2017-02-01T00:13:09.895 [INFO] Apache Beam :: Examples :: Java 8 .................. SKIPPED
2017-02-01T00:13:09.895 [INFO] Apache Beam :: SDKs :: Java :: Aggregated Javadoc .. SKIPPED
2017-02-01T00:13:09.895 [INFO] ------------------------------------------------------------------------
2017-02-01T00:13:09.895 [INFO] BUILD FAILURE
2017-02-01T00:13:09.895 [INFO] ------------------------------------------------------------------------
2017-02-01T00:13:09.895 [INFO] Total time: 02:26 min
2017-02-01T00:13:09.895 [INFO] Finished at: 2017-02-01T00:13:09+00:00
2017-02-01T00:13:10.071 [INFO] Final Memory: 37M/329M
2017-02-01T00:13:10.072 [INFO] ------------------------------------------------------------------------
Waiting for Jenkins to finish collecting data
2017-02-01T00:13:20.890 [ERROR] Failed to execute goal org.apache.maven.plugins:maven-clean-plugin:3.0.0:clean
(default-clean) on project beam-parent: Execution default-clean of goal org.apache.maven.plugins:maven-clean-plugin:3.0.0:clean
failed: Plugin org.apache.maven.plugins:maven-clean-plugin:3.0.0 or one of its dependencies
could not be resolved: Could not transfer artifact org.sonatype.sisu:sisu-inject-plexus:jar:1.4.2
from/to central (https://repo.maven.apache.org/maven2): Connect to repo.maven.apache.org:443
[repo.maven.apache.org/151.101.44.215] failed: Connection timed out -> [Help 1]
org.apache.maven.lifecycle.LifecycleExecutionException: Failed to execute goal org.apache.maven.plugins:maven-clean-plugin:3.0.0:clean
(default-clean) on project beam-parent: Execution default-clean of goal org.apache.maven.plugins:maven-clean-plugin:3.0.0:clean
failed: Plugin org.apache.maven.plugins:maven-clean-plugin:3.0.0 or one of its dependencies
could not be resolved: Could not transfer artifact org.sonatype.sisu:sisu-inject-plexus:jar:1.4.2
from/to central (https://repo.maven.apache.org/maven2): Connect to repo.maven.apache.org:443
[repo.maven.apache.org/151.101.44.215] failed: Connection timed out
	at org.apache.maven.lifecycle.internal.MojoExecutor.execute(MojoExecutor.java:224)
	at org.apache.maven.lifecycle.internal.MojoExecutor.execute(MojoExecutor.java:153)
	at org.apache.maven.lifecycle.internal.MojoExecutor.execute(MojoExecutor.java:145)
	at org.apache.maven.lifecycle.internal.LifecycleModuleBuilder.buildProject(LifecycleModuleBuilder.java:116)
	at org.apache.maven.lifecycle.internal.LifecycleModuleBuilder.buildProject(LifecycleModuleBuilder.java:80)
	at org.apache.maven.lifecycle.internal.builder.singlethreaded.SingleThreadedBuilder.build(SingleThreadedBuilder.java:51)
	at org.apache.maven.lifecycle.internal.LifecycleStarter.execute(LifecycleStarter.java:128)
	at org.apache.maven.DefaultMaven.doExecute(DefaultMaven.java:307)
	at org.apache.maven.DefaultMaven.doExecute(DefaultMaven.java:193)
	at org.apache.maven.DefaultMaven.execute(DefaultMaven.java:106)
	at org.jvnet.hudson.maven3.launcher.Maven32Launcher.main(Maven32Launcher.java:132)
	at sun.reflect.NativeMethodAccessorImpl.invoke0(Native Method)
	at sun.reflect.NativeMethodAccessorImpl.invoke(NativeMethodAccessorImpl.java:62)
	at sun.reflect.DelegatingMethodAccessorImpl.invoke(DelegatingMethodAccessorImpl.java:43)
	at java.lang.reflect.Method.invoke(Method.java:498)
	at org.codehaus.plexus.classworlds.launcher.Launcher.launchStandard(Launcher.java:330)
	at org.codehaus.plexus.classworlds.launcher.Launcher.launch(Launcher.java:238)
	at jenkins.maven3.agent.Maven32Main.launch(Maven32Main.java:186)
	at sun.reflect.NativeMethodAccessorImpl.invoke0(Native Method)
	at sun.reflect.NativeMethodAccessorImpl.invoke(NativeMethodAccessorImpl.java:62)
	at sun.reflect.DelegatingMethodAccessorImpl.invoke(DelegatingMethodAccessorImpl.java:43)
	at java.lang.reflect.Method.invoke(Method.java:498)
	at hudson.maven.Maven3Builder.call(Maven3Builder.java:136)
	at hudson.maven.Maven3Builder.call(Maven3Builder.java:71)
	at hudson.remoting.UserRequest.perform(UserRequest.java:153)
	at hudson.remoting.UserRequest.perform(UserRequest.java:50)
	at hudson.remoting.Request$2.run(Request.java:332)
	at hudson.remoting.InterceptingExecutorService$1.call(InterceptingExecutorService.java:68)
	at java.util.concurrent.FutureTask.run(FutureTask.java:266)
	at java.util.concurrent.ThreadPoolExecutor.runWorker(ThreadPoolExecutor.java:1142)
	at java.util.concurrent.ThreadPoolExecutor$Worker.run(ThreadPoolExecutor.java:617)
	at java.lang.Thread.run(Thread.java:745)
Caused by: org.apache.maven.plugin.PluginExecutionException: Execution default-clean of goal
org.apache.maven.plugins:maven-clean-plugin:3.0.0:clean failed: Plugin org.apache.maven.plugins:maven-clean-plugin:3.0.0
or one of its dependencies could not be resolved: Could not transfer artifact org.sonatype.sisu:sisu-inject-plexus:jar:1.4.2
from/to central (https://repo.maven.apache.org/maven2): Connect to repo.maven.apache.org:443
[repo.maven.apache.org/151.101.44.215] failed: Connection timed out
	at org.apache.maven.plugin.DefaultBuildPluginManager.executeMojo(DefaultBuildPluginManager.java:106)
	at org.apache.maven.lifecycle.internal.MojoExecutor.execute(MojoExecutor.java:208)
	... 31 more
Caused by: org.apache.maven.plugin.PluginResolutionException: Plugin org.apache.maven.plugins:maven-clean-plugin:3.0.0
or one of its dependencies could not be resolved: Could not transfer artifact org.sonatype.sisu:sisu-inject-plexus:jar:1.4.2
from/to central (https://repo.maven.apache.org/maven2): Connect to repo.maven.apache.org:443
[repo.maven.apache.org/151.101.44.215] failed: Connection timed out
	at org.apache.maven.plugin.internal.DefaultPluginDependenciesResolver.resolveInternal(DefaultPluginDependenciesResolver.java:218)
	at org.apache.maven.plugin.internal.DefaultPluginDependenciesResolver.resolve(DefaultPluginDependenciesResolver.java:149)
	at org.apache.maven.plugin.internal.DefaultMavenPluginManager.createPluginRealm(DefaultMavenPluginManager.java:422)
	at org.apache.maven.plugin.internal.DefaultMavenPluginManager.setupPluginRealm(DefaultMavenPluginManager.java:385)
	at org.apache.maven.plugin.DefaultBuildPluginManager.getPluginRealm(DefaultBuildPluginManager.java:231)
	at org.apache.maven.plugin.DefaultBuildPluginManager.executeMojo(DefaultBuildPluginManager.java:102)
	... 32 more
Caused by: org.eclipse.aether.resolution.ArtifactResolutionException: Could not transfer artifact
org.sonatype.sisu:sisu-inject-plexus:jar:1.4.2 from/to central (https://repo.maven.apache.org/maven2):
Connect to repo.maven.apache.org:443 [repo.maven.apache.org/151.101.44.215] failed: Connection
timed out
	at org.eclipse.aether.internal.impl.DefaultArtifactResolver.resolve(DefaultArtifactResolver.java:444)
	at org.eclipse.aether.internal.impl.DefaultArtifactResolver.resolveArtifacts(DefaultArtifactResolver.java:246)
	at org.eclipse.aether.internal.impl.DefaultRepositorySystem.resolveDependencies(DefaultRepositorySystem.java:367)
	at org.apache.maven.plugin.internal.DefaultPluginDependenciesResolver.resolveInternal(DefaultPluginDependenciesResolver.java:210)
	... 37 more
Caused by: org.eclipse.aether.transfer.ArtifactTransferException: Could not transfer artifact
org.sonatype.sisu:sisu-inject-plexus:jar:1.4.2 from/to central (https://repo.maven.apache.org/maven2):
Connect to repo.maven.apache.org:443 [repo.maven.apache.org/151.101.44.215] failed: Connection
timed out
	at org.eclipse.aether.connector.basic.ArtifactTransportListener.transferFailed(ArtifactTransportListener.java:43)
	at org.eclipse.aether.connector.basic.BasicRepositoryConnector$TaskRunner.run(BasicRepositoryConnector.java:355)
	at org.eclipse.aether.util.concurrency.RunnableErrorForwarder$1.run(RunnableErrorForwarder.java:67)
	... 3 more
Caused by: org.apache.maven.wagon.TransferFailedException: Connect to repo.maven.apache.org:443
[repo.maven.apache.org/151.101.44.215] failed: Connection timed out
	at org.apache.maven.wagon.providers.http.AbstractHttpClientWagon.fillInputData(AbstractHttpClientWagon.java:1066)
	at org.apache.maven.wagon.providers.http.AbstractHttpClientWagon.fillInputData(AbstractHttpClientWagon.java:960)
	at org.apache.maven.wagon.StreamWagon.getInputStream(StreamWagon.java:116)
	at org.apache.maven.wagon.StreamWagon.getIfNewer(StreamWagon.java:88)
	at org.apache.maven.wagon.StreamWagon.get(StreamWagon.java:61)
	at org.eclipse.aether.transport.wagon.WagonTransporter$GetTaskRunner.run(WagonTransporter.java:560)
	at org.eclipse.aether.transport.wagon.WagonTransporter.execute(WagonTransporter.java:427)
	at org.eclipse.aether.transport.wagon.WagonTransporter.get(WagonTransporter.java:404)
	at org.eclipse.aether.connector.basic.BasicRepositoryConnector$GetTaskRunner.runTask(BasicRepositoryConnector.java:447)
	at org.eclipse.aether.connector.basic.BasicRepositoryConnector$TaskRunner.run(BasicRepositoryConnector.java:350)
	... 4 more
Caused by: org.apache.maven.wagon.providers.http.httpclient.conn.ConnectTimeoutException:
Connect to repo.maven.apache.org:443 [repo.maven.apache.org/151.101.44.215] failed: Connection
timed out
	at org.apache.maven.wagon.providers.http.httpclient.impl.conn.HttpClientConnectionOperator.connect(HttpClientConnectionOperator.java:138)
	at org.apache.maven.wagon.providers.http.httpclient.impl.conn.PoolingHttpClientConnectionManager.connect(PoolingHttpClientConnectionManager.java:318)
	at org.apache.maven.wagon.providers.http.httpclient.impl.execchain.MainClientExec.establishRoute(MainClientExec.java:363)
	at org.apache.maven.wagon.providers.http.httpclient.impl.execchain.MainClientExec.execute(MainClientExec.java:219)
	at org.apache.maven.wagon.providers.http.httpclient.impl.execchain.ProtocolExec.execute(ProtocolExec.java:195)
	at org.apache.maven.wagon.providers.http.httpclient.impl.execchain.RetryExec.execute(RetryExec.java:86)
	at org.apache.maven.wagon.providers.http.httpclient.impl.execchain.RedirectExec.execute(RedirectExec.java:108)
	at org.apache.maven.wagon.providers.http.httpclient.impl.client.InternalHttpClient.doExecute(InternalHttpClient.java:184)
	at org.apache.maven.wagon.providers.http.httpclient.impl.client.CloseableHttpClient.execute(CloseableHttpClient.java:82)
	at org.apache.maven.wagon.providers.http.AbstractHttpClientWagon.execute(AbstractHttpClientWagon.java:832)
	at org.apache.maven.wagon.providers.http.AbstractHttpClientWagon.fillInputData(AbstractHttpClientWagon.java:983)
	... 13 more
Caused by: java.net.ConnectException: Connection timed out
	at java.net.PlainSocketImpl.socketConnect(Native Method)
	at java.net.AbstractPlainSocketImpl.doConnect(AbstractPlainSocketImpl.java:350)
	at java.net.AbstractPlainSocketImpl.connectToAddress(AbstractPlainSocketImpl.java:206)
	at java.net.AbstractPlainSocketImpl.connect(AbstractPlainSocketImpl.java:188)
	at java.net.SocksSocketImpl.connect(SocksSocketImpl.java:392)
	at java.net.Socket.connect(Socket.java:589)
	at org.apache.maven.wagon.providers.http.httpclient.conn.ssl.SSLConnectionSocketFactory.connectSocket(SSLConnectionSocketFactory.java:239)
	at org.apache.maven.wagon.providers.http.httpclient.impl.conn.HttpClientConnectionOperator.connect(HttpClientConnectionOperator.java:123)
	... 23 more
2017-02-01T00:13:20.894 [ERROR] 
2017-02-01T00:13:20.894 [ERROR] Re-run Maven using the -X switch to enable full debug logging.
2017-02-01T00:13:20.894 [ERROR] 
2017-02-01T00:13:20.894 [ERROR] For more information about the errors and possible solutions,
please read the following articles:
2017-02-01T00:13:20.894 [ERROR] [Help 1] http://cwiki.apache.org/confluence/display/MAVEN/PluginResolutionException
channel stopped

Mime
View raw message