beam-commits mailing list archives

Site index · List index
Message view « Date » · « Thread »
Top « Date » · « Thread »
From Apache Jenkins Server <jenk...@builds.apache.org>
Subject Build failed in Jenkins: beam_PostCommit_Java_MavenInstall #2775
Date Tue, 28 Feb 2017 18:42:45 GMT
See <https://builds.apache.org/job/beam_PostCommit_Java_MavenInstall/2775/display/redirect>

------------------------------------------
[...truncated 1.76 MB...]
2017-02-28T18:40:46.037 [INFO] Downloaded: https://repo.maven.apache.org/maven2/com/jcraft/jsch/0.1.53/jsch-0.1.53.pom
(4 KB at 108.9 KB/sec)
2017-02-28T18:40:46.038 [INFO] Downloading: https://repo.maven.apache.org/maven2/org/sonatype/oss/oss-parent/6/oss-parent-6.pom
2017-02-28T18:40:46.064 [INFO] Downloaded: https://repo.maven.apache.org/maven2/org/sonatype/oss/oss-parent/6/oss-parent-6.pom
(5 KB at 181.5 KB/sec)
2017-02-28T18:40:46.065 [INFO] Downloading: https://repo.maven.apache.org/maven2/com/googlecode/javaewah/JavaEWAH/0.7.9/JavaEWAH-0.7.9.pom
2017-02-28T18:40:46.094 [INFO] Downloaded: https://repo.maven.apache.org/maven2/com/googlecode/javaewah/JavaEWAH/0.7.9/JavaEWAH-0.7.9.pom
(5 KB at 146.3 KB/sec)
2017-02-28T18:40:46.095 [INFO] Downloading: https://repo.maven.apache.org/maven2/org/slf4j/slf4j-api/1.7.21/slf4j-api-1.7.21.pom
2017-02-28T18:40:46.121 [INFO] Downloaded: https://repo.maven.apache.org/maven2/org/slf4j/slf4j-api/1.7.21/slf4j-api-1.7.21.pom
(3 KB at 104.2 KB/sec)
2017-02-28T18:40:46.122 [INFO] Downloading: https://repo.maven.apache.org/maven2/org/slf4j/slf4j-parent/1.7.21/slf4j-parent-1.7.21.pom
2017-02-28T18:40:46.148 [INFO] Downloaded: https://repo.maven.apache.org/maven2/org/slf4j/slf4j-parent/1.7.21/slf4j-parent-1.7.21.pom
(14 KB at 527.5 KB/sec)
2017-02-28T18:40:46.149 [INFO] Downloading: https://repo.maven.apache.org/maven2/org/codehaus/plexus/plexus-utils/2.0.7/plexus-utils-2.0.7.pom
2017-02-28T18:40:46.175 [INFO] Downloaded: https://repo.maven.apache.org/maven2/org/codehaus/plexus/plexus-utils/2.0.7/plexus-utils-2.0.7.pom
(3 KB at 105.6 KB/sec)
2017-02-28T18:40:46.177 [INFO] Downloading: https://repo.maven.apache.org/maven2/org/sonatype/sisu/sisu-inject-plexus/1.4.3.2/sisu-inject-plexus-1.4.3.2.pom
2017-02-28T18:40:46.202 [INFO] Downloaded: https://repo.maven.apache.org/maven2/org/sonatype/sisu/sisu-inject-plexus/1.4.3.2/sisu-inject-plexus-1.4.3.2.pom
(6 KB at 203.5 KB/sec)
2017-02-28T18:40:46.203 [INFO] Downloading: https://repo.maven.apache.org/maven2/org/sonatype/sisu/inject/guice-plexus/1.4.3.2/guice-plexus-1.4.3.2.pom
2017-02-28T18:40:46.230 [INFO] Downloaded: https://repo.maven.apache.org/maven2/org/sonatype/sisu/inject/guice-plexus/1.4.3.2/guice-plexus-1.4.3.2.pom
(3 KB at 109.7 KB/sec)
2017-02-28T18:40:46.231 [INFO] Downloading: https://repo.maven.apache.org/maven2/org/sonatype/sisu/inject/guice-bean/1.4.3.2/guice-bean-1.4.3.2.pom
2017-02-28T18:40:46.258 [INFO] Downloaded: https://repo.maven.apache.org/maven2/org/sonatype/sisu/inject/guice-bean/1.4.3.2/guice-bean-1.4.3.2.pom
(3 KB at 91.4 KB/sec)
2017-02-28T18:40:46.259 [INFO] Downloading: https://repo.maven.apache.org/maven2/org/sonatype/sisu/sisu-inject/1.4.3.2/sisu-inject-1.4.3.2.pom
2017-02-28T18:40:46.286 [INFO] Downloaded: https://repo.maven.apache.org/maven2/org/sonatype/sisu/sisu-inject/1.4.3.2/sisu-inject-1.4.3.2.pom
(2 KB at 43.5 KB/sec)
2017-02-28T18:40:46.287 [INFO] Downloading: https://repo.maven.apache.org/maven2/org/sonatype/sisu/sisu-parent/1.4.3.2/sisu-parent-1.4.3.2.pom
2017-02-28T18:40:46.314 [INFO] Downloaded: https://repo.maven.apache.org/maven2/org/sonatype/sisu/sisu-parent/1.4.3.2/sisu-parent-1.4.3.2.pom
(8 KB at 292.4 KB/sec)
2017-02-28T18:40:46.316 [INFO] Downloading: https://repo.maven.apache.org/maven2/org/sonatype/sisu/sisu-inject-bean/1.4.3.2/sisu-inject-bean-1.4.3.2.pom
2017-02-28T18:40:46.345 [INFO] Downloaded: https://repo.maven.apache.org/maven2/org/sonatype/sisu/sisu-inject-bean/1.4.3.2/sisu-inject-bean-1.4.3.2.pom
(6 KB at 178.4 KB/sec)
2017-02-28T18:40:46.346 [INFO] Downloading: https://repo.maven.apache.org/maven2/org/sonatype/sisu/sisu-guice/2.9.2/sisu-guice-2.9.2.pom
2017-02-28T18:40:46.375 [INFO] Downloaded: https://repo.maven.apache.org/maven2/org/sonatype/sisu/sisu-guice/2.9.2/sisu-guice-2.9.2.pom
(8 KB at 247.5 KB/sec)
2017-02-28T18:40:46.376 [INFO] Downloading: https://repo.maven.apache.org/maven2/org/sonatype/sisu/inject/guice-parent/2.9.2/guice-parent-2.9.2.pom
2017-02-28T18:40:46.404 [INFO] Downloaded: https://repo.maven.apache.org/maven2/org/sonatype/sisu/inject/guice-parent/2.9.2/guice-parent-2.9.2.pom
(12 KB at 427.0 KB/sec)
2017-02-28T18:40:46.406 [INFO] Downloading: https://repo.maven.apache.org/maven2/org/slf4j/jcl-over-slf4j/1.7.21/jcl-over-slf4j-1.7.21.pom
2017-02-28T18:40:46.434 [INFO] Downloaded: https://repo.maven.apache.org/maven2/org/slf4j/jcl-over-slf4j/1.7.21/jcl-over-slf4j-1.7.21.pom
(963 B at 32.4 KB/sec)
2017-02-28T18:40:46.515 [INFO] Downloading: https://repo.maven.apache.org/maven2/org/apache/httpcomponents/httpmime/4.5.2/httpmime-4.5.2.jar
2017-02-28T18:40:46.515 [INFO] Downloading: https://repo.maven.apache.org/maven2/com/fasterxml/jackson/core/jackson-core/2.8.3/jackson-core-2.8.3.jar
2017-02-28T18:40:46.516 [INFO] Downloading: https://repo.maven.apache.org/maven2/com/fasterxml/jackson/core/jackson-databind/2.8.3/jackson-databind-2.8.3.jar
2017-02-28T18:40:46.517 [INFO] Downloading: https://repo.maven.apache.org/maven2/com/fasterxml/jackson/core/jackson-annotations/2.8.3/jackson-annotations-2.8.3.jar
2017-02-28T18:40:46.517 [INFO] Downloading: https://repo.maven.apache.org/maven2/org/eclipse/jgit/org.eclipse.jgit/4.5.0.201609210915-r/org.eclipse.jgit-4.5.0.201609210915-r.jar
2017-02-28T18:40:46.547 [INFO] Downloaded: https://repo.maven.apache.org/maven2/org/apache/httpcomponents/httpmime/4.5.2/httpmime-4.5.2.jar
(41 KB at 1252.1 KB/sec)
2017-02-28T18:40:46.547 [INFO] Downloading: https://repo.maven.apache.org/maven2/com/jcraft/jsch/0.1.53/jsch-0.1.53.jar
2017-02-28T18:40:46.549 [INFO] Downloaded: https://repo.maven.apache.org/maven2/com/fasterxml/jackson/core/jackson-annotations/2.8.3/jackson-annotations-2.8.3.jar
(55 KB at 1598.4 KB/sec)
2017-02-28T18:40:46.549 [INFO] Downloading: https://repo.maven.apache.org/maven2/com/googlecode/javaewah/JavaEWAH/0.7.9/JavaEWAH-0.7.9.jar
2017-02-28T18:40:46.580 [INFO] Downloaded: https://repo.maven.apache.org/maven2/com/googlecode/javaewah/JavaEWAH/0.7.9/JavaEWAH-0.7.9.jar
(123 KB at 1939.9 KB/sec)
2017-02-28T18:40:46.580 [INFO] Downloading: https://repo.maven.apache.org/maven2/org/codehaus/plexus/plexus-utils/2.0.7/plexus-utils-2.0.7.jar
2017-02-28T18:40:46.588 [INFO] Downloaded: https://repo.maven.apache.org/maven2/com/jcraft/jsch/0.1.53/jsch-0.1.53.jar
(274 KB at 3854.1 KB/sec)
2017-02-28T18:40:46.588 [INFO] Downloading: https://repo.maven.apache.org/maven2/org/sonatype/sisu/sisu-inject-plexus/1.4.3.2/sisu-inject-plexus-1.4.3.2.jar
2017-02-28T18:40:46.622 [INFO] Downloaded: https://repo.maven.apache.org/maven2/com/fasterxml/jackson/core/jackson-core/2.8.3/jackson-core-2.8.3.jar
(275 KB at 2565.3 KB/sec)
2017-02-28T18:40:46.622 [INFO] Downloading: https://repo.maven.apache.org/maven2/org/sonatype/sisu/sisu-inject-bean/1.4.3.2/sisu-inject-bean-1.4.3.2.jar
2017-02-28T18:40:46.628 [INFO] Downloaded: https://repo.maven.apache.org/maven2/org/codehaus/plexus/plexus-utils/2.0.7/plexus-utils-2.0.7.jar
(219 KB at 1970.2 KB/sec)
2017-02-28T18:40:46.628 [INFO] Downloading: https://repo.maven.apache.org/maven2/org/sonatype/sisu/sisu-guice/2.9.2/sisu-guice-2.9.2-no_aop.jar
2017-02-28T18:40:46.628 [INFO] Downloaded: https://repo.maven.apache.org/maven2/org/sonatype/sisu/sisu-inject-plexus/1.4.3.2/sisu-inject-plexus-1.4.3.2.jar
(201 KB at 1802.4 KB/sec)
2017-02-28T18:40:46.628 [INFO] Downloading: https://repo.maven.apache.org/maven2/org/slf4j/slf4j-api/1.7.21/slf4j-api-1.7.21.jar
2017-02-28T18:40:46.632 [INFO] Downloaded: https://repo.maven.apache.org/maven2/com/fasterxml/jackson/core/jackson-databind/2.8.3/jackson-databind-2.8.3.jar
(1205 KB at 10386.1 KB/sec)
2017-02-28T18:40:46.632 [INFO] Downloading: https://repo.maven.apache.org/maven2/org/slf4j/jcl-over-slf4j/1.7.21/jcl-over-slf4j-1.7.21.jar
2017-02-28T18:40:46.654 [INFO] Downloaded: https://repo.maven.apache.org/maven2/org/sonatype/sisu/sisu-inject-bean/1.4.3.2/sisu-inject-bean-1.4.3.2.jar
(157 KB at 1143.6 KB/sec)
2017-02-28T18:40:46.657 [INFO] Downloaded: https://repo.maven.apache.org/maven2/org/slf4j/slf4j-api/1.7.21/slf4j-api-1.7.21.jar
(41 KB at 286.5 KB/sec)
2017-02-28T18:40:46.657 [INFO] Downloaded: https://repo.maven.apache.org/maven2/org/slf4j/jcl-over-slf4j/1.7.21/jcl-over-slf4j-1.7.21.jar
(17 KB at 114.6 KB/sec)
2017-02-28T18:40:46.671 [INFO] Downloaded: https://repo.maven.apache.org/maven2/org/sonatype/sisu/sisu-guice/2.9.2/sisu-guice-2.9.2-no_aop.jar
(469 KB at 3042.7 KB/sec)
2017-02-28T18:40:46.694 [INFO] Downloaded: https://repo.maven.apache.org/maven2/org/eclipse/jgit/org.eclipse.jgit/4.5.0.201609210915-r/org.eclipse.jgit-4.5.0.201609210915-r.jar
(2324 KB at 13052.5 KB/sec)
2017-02-28T18:40:47.657 [INFO] Starting Coveralls job for jenkins (2775 / https://builds.apache.org/job/beam_PostCommit_Java_MavenInstall/2775/)
2017-02-28T18:40:47.657 [INFO] Using repository token <secret>
2017-02-28T18:40:47.657 [INFO] Git commit 8998cb9 in master
2017-02-28T18:40:47.657 [INFO] Writing Coveralls data to <https://builds.apache.org/job/beam_PostCommit_Java_MavenInstall/ws/target/coveralls.json...>
2017-02-28T18:40:47.711 [INFO] Processing coverage report from <https://builds.apache.org/job/beam_PostCommit_Java_MavenInstall/ws/sdks/java/core/target/site/jacoco/jacoco.xml>
2017-02-28T18:40:48.302 [INFO] Processing coverage report from <https://builds.apache.org/job/beam_PostCommit_Java_MavenInstall/ws/sdks/java/java8tests/target/site/jacoco/jacoco.xml>
2017-02-28T18:40:48.320 [INFO] Processing coverage report from <https://builds.apache.org/job/beam_PostCommit_Java_MavenInstall/ws/runners/core-java/target/site/jacoco/jacoco.xml>
2017-02-28T18:40:48.865 [INFO] Processing coverage report from <https://builds.apache.org/job/beam_PostCommit_Java_MavenInstall/ws/runners/direct-java/target/site/jacoco/jacoco.xml>
2017-02-28T18:40:49.339 [INFO] Processing coverage report from <https://builds.apache.org/job/beam_PostCommit_Java_MavenInstall/ws/runners/google-cloud-dataflow-java/target/site/jacoco/jacoco.xml>
2017-02-28T18:40:49.576 [INFO] Processing coverage report from <https://builds.apache.org/job/beam_PostCommit_Java_MavenInstall/ws/examples/java/target/site/jacoco/jacoco.xml>
2017-02-28T18:40:49.603 [INFO] Processing coverage report from <https://builds.apache.org/job/beam_PostCommit_Java_MavenInstall/ws/examples/java8/target/site/jacoco/jacoco.xml>
2017-02-28T18:40:49.661 [INFO] Successfully wrote Coveralls data in 2004ms
2017-02-28T18:40:49.662 [INFO] Gathered code coverage metrics for 511 source files with 121126
lines of code:
2017-02-28T18:40:49.662 [INFO] - 30283 relevant lines
2017-02-28T18:40:49.662 [INFO] - 20954 covered lines
2017-02-28T18:40:49.662 [INFO] - 9329 missed lines
2017-02-28T18:40:49.662 [INFO] Submitting Coveralls data to API
2017-02-28T18:41:49.892 [ERROR] Submission failed in 60230ms while handling I/O operations
[JENKINS] Archiving disabled
[JENKINS] Archiving disabled
[JENKINS] Archiving disabled
[JENKINS] Archiving disabled
[JENKINS] Archiving disabled
[JENKINS] Archiving disabled
[JENKINS] Archiving disabled
[JENKINS] Archiving disabled
[JENKINS] Archiving disabled
[JENKINS] Archiving disabled
[JENKINS] Archiving disabled
[JENKINS] Archiving disabled
[JENKINS] Archiving disabled
[JENKINS] Archiving disabled
[JENKINS] Archiving disabled
[JENKINS] Archiving disabled
[JENKINS] Archiving disabled
[JENKINS] Archiving disabled
[JENKINS] Archiving disabled
[JENKINS] Archiving disabled
[JENKINS] Archiving disabled
[JENKINS] Archiving disabled
[JENKINS] Archiving disabled
[JENKINS] Archiving disabled
[JENKINS] Archiving disabled
[JENKINS] Archiving disabled
[JENKINS] Archiving disabled
[JENKINS] Archiving disabled
[JENKINS] Archiving disabled
[JENKINS] Archiving disabled
[JENKINS] Archiving disabled
[JENKINS] Archiving disabled
[JENKINS] Archiving disabled
[JENKINS] Archiving disabled
[JENKINS] Archiving disabled
[JENKINS] Archiving disabled
[JENKINS] Archiving disabled
[JENKINS] Archiving disabled
[JENKINS] Archiving disabled
[JENKINS] Archiving disabled
[JENKINS] Archiving disabled
[JENKINS] Archiving disabled
[JENKINS] Archiving disabled2017-02-28T18:42:09.385 [INFO] ------------------------------------------------------------------------
2017-02-28T18:42:09.385 [INFO] Reactor Summary:
2017-02-28T18:42:09.385 [INFO] 
2017-02-28T18:42:09.386 [INFO] Apache Beam :: Parent .............................. FAILURE
[01:04 min]
2017-02-28T18:42:09.386 [INFO] Apache Beam :: SDKs :: Java :: Build Tools ......... SUCCESS
[  3.204 s]
2017-02-28T18:42:09.386 [INFO] Apache Beam :: SDKs ................................ SUCCESS
[  5.737 s]
2017-02-28T18:42:09.386 [INFO] Apache Beam :: SDKs :: Common ...................... SUCCESS
[  2.229 s]
2017-02-28T18:42:09.386 [INFO] Apache Beam :: SDKs :: Common :: Fn API ............ SUCCESS
[ 15.764 s]
2017-02-28T18:42:09.386 [INFO] Apache Beam :: SDKs :: Common :: Runner API ........ SUCCESS
[ 10.774 s]
2017-02-28T18:42:09.386 [INFO] Apache Beam :: SDKs :: Java ........................ SUCCESS
[  1.520 s]
2017-02-28T18:42:09.386 [INFO] Apache Beam :: SDKs :: Java :: Core ................ SUCCESS
[02:35 min]
2017-02-28T18:42:09.386 [INFO] Apache Beam :: Runners ............................. SUCCESS
[  1.520 s]
2017-02-28T18:42:09.386 [INFO] Apache Beam :: Runners :: Core Java Construction ... SUCCESS
[ 11.652 s]
2017-02-28T18:42:09.386 [INFO] Apache Beam :: Runners :: Core Java ................ SUCCESS
[ 45.188 s]
2017-02-28T18:42:09.386 [INFO] Apache Beam :: Runners :: Direct Java .............. SUCCESS
[03:25 min]
2017-02-28T18:42:09.386 [INFO] Apache Beam :: SDKs :: Java :: IO .................. SUCCESS
[  1.188 s]
2017-02-28T18:42:09.386 [INFO] Apache Beam :: SDKs :: Java :: IO :: Elasticsearch . SUCCESS
[ 35.740 s]
2017-02-28T18:42:09.386 [INFO] Apache Beam :: Runners :: Google Cloud Dataflow .... SUCCESS
[ 34.743 s]
2017-02-28T18:42:09.386 [INFO] Apache Beam :: SDKs :: Java :: IO :: Google Cloud Platform
SUCCESS [05:18 min]
2017-02-28T18:42:09.386 [INFO] Apache Beam :: SDKs :: Java :: IO :: Hadoop Common . SUCCESS
[ 13.296 s]
2017-02-28T18:42:09.386 [INFO] Apache Beam :: SDKs :: Java :: IO :: HBase ......... SUCCESS
[ 20.484 s]
2017-02-28T18:42:09.386 [INFO] Apache Beam :: SDKs :: Java :: IO :: HDFS .......... SUCCESS
[ 21.990 s]
2017-02-28T18:42:09.386 [INFO] Apache Beam :: SDKs :: Java :: IO :: JDBC .......... SUCCESS
[ 18.868 s]
2017-02-28T18:42:09.386 [INFO] Apache Beam :: SDKs :: Java :: IO :: JMS ........... SUCCESS
[ 15.745 s]
2017-02-28T18:42:09.386 [INFO] Apache Beam :: SDKs :: Java :: IO :: Kafka ......... SUCCESS
[ 18.546 s]
2017-02-28T18:42:09.386 [INFO] Apache Beam :: SDKs :: Java :: IO :: Kinesis ....... SUCCESS
[ 18.379 s]
2017-02-28T18:42:09.386 [INFO] Apache Beam :: SDKs :: Java :: IO :: MongoDB ....... SUCCESS
[ 27.164 s]
2017-02-28T18:42:09.386 [INFO] Apache Beam :: SDKs :: Java :: IO :: MQTT .......... SUCCESS
[ 14.779 s]
2017-02-28T18:42:09.386 [INFO] Apache Beam :: SDKs :: Java :: Maven Archetypes .... SUCCESS
[  1.308 s]
2017-02-28T18:42:09.386 [INFO] Apache Beam :: SDKs :: Java :: Maven Archetypes :: Starter
SUCCESS [ 12.801 s]
2017-02-28T18:42:09.386 [INFO] Apache Beam :: SDKs :: Java :: Maven Archetypes :: Examples
SUCCESS [ 13.556 s]
2017-02-28T18:42:09.386 [INFO] Apache Beam :: SDKs :: Java :: Maven Archetypes :: Examples
- Java 8 SUCCESS [ 16.018 s]
2017-02-28T18:42:09.386 [INFO] Apache Beam :: SDKs :: Java :: Extensions .......... SUCCESS
[  1.267 s]
2017-02-28T18:42:09.386 [INFO] Apache Beam :: SDKs :: Java :: Extensions :: Jackson SUCCESS
[ 13.346 s]
2017-02-28T18:42:09.386 [INFO] Apache Beam :: SDKs :: Java :: Extensions :: Join library SUCCESS
[ 13.380 s]
2017-02-28T18:42:09.386 [INFO] Apache Beam :: SDKs :: Java :: Extensions :: Sorter  SUCCESS
[ 26.979 s]
2017-02-28T18:42:09.386 [INFO] Apache Beam :: SDKs :: Java :: Harness ............. SUCCESS
[ 28.765 s]
2017-02-28T18:42:09.386 [INFO] Apache Beam :: SDKs :: Java :: Java 8 Tests ........ SUCCESS
[  9.221 s]
2017-02-28T18:42:09.386 [INFO] Apache Beam :: SDKs :: Python ...................... SUCCESS
[03:23 min]
2017-02-28T18:42:09.386 [INFO] Apache Beam :: Runners :: Flink .................... SUCCESS
[  1.396 s]
2017-02-28T18:42:09.386 [INFO] Apache Beam :: Runners :: Flink :: Core ............ SUCCESS
[ 45.772 s]
2017-02-28T18:42:09.386 [INFO] Apache Beam :: Runners :: Flink :: Examples ........ SUCCESS
[ 14.914 s]
2017-02-28T18:42:09.386 [INFO] Apache Beam :: Runners :: Spark .................... SUCCESS
[03:27 min]
2017-02-28T18:42:09.386 [INFO] Apache Beam :: Runners :: Apex ..................... SUCCESS
[ 54.833 s]
2017-02-28T18:42:09.386 [INFO] Apache Beam :: Examples ............................ SUCCESS
[  1.231 s]
2017-02-28T18:42:09.386 [INFO] Apache Beam :: Examples :: Java .................... SUCCESS
[05:55 min]
2017-02-28T18:42:09.386 [INFO] Apache Beam :: Examples :: Java 8 .................. SUCCESS
[ 22.295 s]
2017-02-28T18:42:09.386 [INFO] Apache Beam :: SDKs :: Java :: Aggregated Javadoc .. SUCCESS
[ 21.664 s]
2017-02-28T18:42:09.386 [INFO] ------------------------------------------------------------------------
2017-02-28T18:42:09.386 [INFO] BUILD FAILURE
2017-02-28T18:42:09.386 [INFO] ------------------------------------------------------------------------
2017-02-28T18:42:09.386 [INFO] Total time: 37:11 min
2017-02-28T18:42:09.386 [INFO] Finished at: 2017-02-28T18:42:09+00:00

2017-02-28T18:42:10.309 [INFO] Final Memory: 278M/1474M
2017-02-28T18:42:10.309 [INFO] ------------------------------------------------------------------------
Waiting for Jenkins to finish collecting data
2017-02-28T18:42:41.511 [ERROR] Failed to execute goal org.eluder.coveralls:coveralls-maven-plugin:4.3.0:report
(default-cli) on project beam-parent: I/O operation failed: Read timed out -> [Help 1]
org.apache.maven.lifecycle.LifecycleExecutionException: Failed to execute goal org.eluder.coveralls:coveralls-maven-plugin:4.3.0:report
(default-cli) on project beam-parent: I/O operation failed
	at org.apache.maven.lifecycle.internal.MojoExecutor.execute(MojoExecutor.java:212)
	at org.apache.maven.lifecycle.internal.MojoExecutor.execute(MojoExecutor.java:153)
	at org.apache.maven.lifecycle.internal.MojoExecutor.execute(MojoExecutor.java:145)
	at org.apache.maven.lifecycle.internal.LifecycleModuleBuilder.buildProject(LifecycleModuleBuilder.java:116)
	at org.apache.maven.lifecycle.internal.LifecycleModuleBuilder.buildProject(LifecycleModuleBuilder.java:80)
	at org.apache.maven.lifecycle.internal.builder.singlethreaded.SingleThreadedBuilder.build(SingleThreadedBuilder.java:51)
	at org.apache.maven.lifecycle.internal.LifecycleStarter.execute(LifecycleStarter.java:128)
	at org.apache.maven.DefaultMaven.doExecute(DefaultMaven.java:307)
	at org.apache.maven.DefaultMaven.doExecute(DefaultMaven.java:193)
	at org.apache.maven.DefaultMaven.execute(DefaultMaven.java:106)
	at org.jvnet.hudson.maven3.launcher.Maven33Launcher.main(Maven33Launcher.java:129)
	at sun.reflect.NativeMethodAccessorImpl.invoke0(Native Method)
	at sun.reflect.NativeMethodAccessorImpl.invoke(NativeMethodAccessorImpl.java:62)
	at sun.reflect.DelegatingMethodAccessorImpl.invoke(DelegatingMethodAccessorImpl.java:43)
	at java.lang.reflect.Method.invoke(Method.java:498)
	at org.codehaus.plexus.classworlds.launcher.Launcher.launchStandard(Launcher.java:330)
	at org.codehaus.plexus.classworlds.launcher.Launcher.launch(Launcher.java:238)
	at jenkins.maven3.agent.Maven33Main.launch(Maven33Main.java:176)
	at sun.reflect.NativeMethodAccessorImpl.invoke0(Native Method)
	at sun.reflect.NativeMethodAccessorImpl.invoke(NativeMethodAccessorImpl.java:62)
	at sun.reflect.DelegatingMethodAccessorImpl.invoke(DelegatingMethodAccessorImpl.java:43)
	at java.lang.reflect.Method.invoke(Method.java:498)
	at hudson.maven.Maven3Builder.call(Maven3Builder.java:139)
	at hudson.maven.Maven3Builder.call(Maven3Builder.java:70)
	at hudson.remoting.UserRequest.perform(UserRequest.java:153)
	at hudson.remoting.UserRequest.perform(UserRequest.java:50)
	at hudson.remoting.Request$2.run(Request.java:336)
	at hudson.remoting.InterceptingExecutorService$1.call(InterceptingExecutorService.java:68)
	at java.util.concurrent.FutureTask.run(FutureTask.java:266)
	at java.util.concurrent.ThreadPoolExecutor.runWorker(ThreadPoolExecutor.java:1142)
	at java.util.concurrent.ThreadPoolExecutor$Worker.run(ThreadPoolExecutor.java:617)
	at java.lang.Thread.run(Thread.java:745)
Caused by: org.apache.maven.plugin.MojoFailureException: I/O operation failed
	at org.eluder.coveralls.maven.plugin.CoverallsReportMojo.execute(CoverallsReportMojo.java:259)
	at org.apache.maven.plugin.DefaultBuildPluginManager.executeMojo(DefaultBuildPluginManager.java:134)
	at org.apache.maven.lifecycle.internal.MojoExecutor.execute(MojoExecutor.java:208)
	... 31 more
Caused by: java.net.SocketTimeoutException: Read timed out
	at java.net.SocketInputStream.socketRead0(Native Method)
	at java.net.SocketInputStream.socketRead(SocketInputStream.java:116)
	at java.net.SocketInputStream.read(SocketInputStream.java:171)
	at java.net.SocketInputStream.read(SocketInputStream.java:141)
	at sun.security.ssl.InputRecord.readFully(InputRecord.java:465)
	at sun.security.ssl.InputRecord.read(InputRecord.java:503)
	at sun.security.ssl.SSLSocketImpl.readRecord(SSLSocketImpl.java:973)
	at sun.security.ssl.SSLSocketImpl.readDataRecord(SSLSocketImpl.java:930)
	at sun.security.ssl.AppInputStream.read(AppInputStream.java:105)
	at org.apache.http.impl.io.SessionInputBufferImpl.streamRead(SessionInputBufferImpl.java:139)
	at org.apache.http.impl.io.SessionInputBufferImpl.fillBuffer(SessionInputBufferImpl.java:155)
	at org.apache.http.impl.io.SessionInputBufferImpl.readLine(SessionInputBufferImpl.java:284)
	at org.apache.http.impl.conn.DefaultHttpResponseParser.parseHead(DefaultHttpResponseParser.java:140)
	at org.apache.http.impl.conn.DefaultHttpResponseParser.parseHead(DefaultHttpResponseParser.java:57)
	at org.apache.http.impl.io.AbstractMessageParser.parse(AbstractMessageParser.java:261)
	at org.apache.http.impl.DefaultBHttpClientConnection.receiveResponseHeader(DefaultBHttpClientConnection.java:165)
	at org.apache.http.impl.conn.CPoolProxy.receiveResponseHeader(CPoolProxy.java:167)
	at org.apache.http.protocol.HttpRequestExecutor.doReceiveResponse(HttpRequestExecutor.java:272)
	at org.apache.http.protocol.HttpRequestExecutor.execute(HttpRequestExecutor.java:124)
	at org.apache.http.impl.execchain.MainClientExec.execute(MainClientExec.java:271)
	at org.apache.http.impl.execchain.ProtocolExec.execute(ProtocolExec.java:184)
	at org.apache.http.impl.execchain.RetryExec.execute(RetryExec.java:88)
	at org.apache.http.impl.execchain.RedirectExec.execute(RedirectExec.java:110)
	at org.apache.http.impl.client.InternalHttpClient.doExecute(InternalHttpClient.java:184)
	at org.apache.http.impl.client.CloseableHttpClient.execute(CloseableHttpClient.java:82)
	at org.apache.http.impl.client.CloseableHttpClient.execute(CloseableHttpClient.java:107)
	at org.apache.http.impl.client.CloseableHttpClient.execute(CloseableHttpClient.java:55)
	at org.eluder.coveralls.maven.plugin.httpclient.CoverallsClient.submit(CoverallsClient.java:84)
	at org.eluder.coveralls.maven.plugin.CoverallsReportMojo.submitData(CoverallsReportMojo.java:400)
	at org.eluder.coveralls.maven.plugin.CoverallsReportMojo.execute(CoverallsReportMojo.java:254)
	... 33 more
2017-02-28T18:42:41.513 [ERROR] 
2017-02-28T18:42:41.513 [ERROR] Re-run Maven using the -X switch to enable full debug logging.
2017-02-28T18:42:41.513 [ERROR] 
2017-02-28T18:42:41.513 [ERROR] For more information about the errors and possible solutions,
please read the following articles:
2017-02-28T18:42:41.513 [ERROR] [Help 1] http://cwiki.apache.org/confluence/display/MAVEN/MojoFailureException
channel stopped

Mime
View raw message