beam-commits mailing list archives

Site index · List index
Message view « Date » · « Thread »
Top « Date » · « Thread »
From Apache Jenkins Server <jenk...@builds.apache.org>
Subject Build failed in Jenkins: beam_PostCommit_Java_MavenInstall #2776
Date Tue, 28 Feb 2017 19:32:09 GMT
See <https://builds.apache.org/job/beam_PostCommit_Java_MavenInstall/2776/display/redirect?page=changes>

Changes:

[altay] Emit a warning when no SDK is provided. We set sdk_location to empty

------------------------------------------
[...truncated 1.75 MB...]
2017-02-28T19:29:18.892 [INFO] Installing <https://builds.apache.org/job/beam_PostCommit_Java_MavenInstall/ws/sdks/java/javadoc/target/javadoc.jar>
to <https://builds.apache.org/job/beam_PostCommit_Java_MavenInstall/ws/.repository/org/apache/beam/beam-sdks-java-javadoc/0.6.0-SNAPSHOT/beam-sdks-java-javadoc-0.6.0-SNAPSHOT.jar>
[JENKINS] Archiving disabled
2017-02-28T19:29:24.512 [INFO]                                                           
             
2017-02-28T19:29:24.512 [INFO] ------------------------------------------------------------------------
2017-02-28T19:29:24.512 [INFO] Building Apache Beam :: Parent 0.6.0-SNAPSHOT
2017-02-28T19:29:24.512 [INFO] ------------------------------------------------------------------------
2017-02-28T19:29:24.514 [WARNING] The POM for org.eclipse.m2e:lifecycle-mapping:jar:1.0.0
is missing, no dependency information available
2017-02-28T19:29:24.514 [WARNING] Failed to retrieve plugin descriptor for org.eclipse.m2e:lifecycle-mapping:1.0.0:
Plugin org.eclipse.m2e:lifecycle-mapping:1.0.0 or one of its dependencies could not be resolved:
Failure to find org.eclipse.m2e:lifecycle-mapping:jar:1.0.0 in https://repo.maven.apache.org/maven2
was cached in the local repository, resolution will not be reattempted until the update interval
of central has elapsed or updates are forced
2017-02-28T19:29:24.515 [INFO] 
2017-02-28T19:29:24.515 [INFO] --- coveralls-maven-plugin:4.3.0:report (default-cli) @ beam-parent
---
2017-02-28T19:29:24.517 [INFO] Downloading: https://repo.maven.apache.org/maven2/org/apache/httpcomponents/httpmime/4.5.2/httpmime-4.5.2.pom
2017-02-28T19:29:24.544 [INFO] Downloaded: https://repo.maven.apache.org/maven2/org/apache/httpcomponents/httpmime/4.5.2/httpmime-4.5.2.pom
(5 KB at 173.0 KB/sec)
2017-02-28T19:29:24.547 [INFO] Downloading: https://repo.maven.apache.org/maven2/com/fasterxml/jackson/core/jackson-core/2.8.3/jackson-core-2.8.3.pom
2017-02-28T19:29:24.574 [INFO] Downloaded: https://repo.maven.apache.org/maven2/com/fasterxml/jackson/core/jackson-core/2.8.3/jackson-core-2.8.3.pom
(6 KB at 195.9 KB/sec)
2017-02-28T19:29:24.577 [INFO] Downloading: https://repo.maven.apache.org/maven2/com/fasterxml/jackson/core/jackson-annotations/2.8.3/jackson-annotations-2.8.3.pom
2017-02-28T19:29:24.602 [INFO] Downloaded: https://repo.maven.apache.org/maven2/com/fasterxml/jackson/core/jackson-annotations/2.8.3/jackson-annotations-2.8.3.pom
(2 KB at 72.2 KB/sec)
2017-02-28T19:29:24.605 [INFO] Downloading: https://repo.maven.apache.org/maven2/com/fasterxml/jackson/core/jackson-databind/2.8.3/jackson-databind-2.8.3.pom
2017-02-28T19:29:24.631 [INFO] Downloaded: https://repo.maven.apache.org/maven2/com/fasterxml/jackson/core/jackson-databind/2.8.3/jackson-databind-2.8.3.pom
(6 KB at 203.8 KB/sec)
2017-02-28T19:29:24.633 [INFO] Downloading: https://repo.maven.apache.org/maven2/org/eclipse/jgit/org.eclipse.jgit/4.5.0.201609210915-r/org.eclipse.jgit-4.5.0.201609210915-r.pom
2017-02-28T19:29:24.660 [INFO] Downloaded: https://repo.maven.apache.org/maven2/org/eclipse/jgit/org.eclipse.jgit/4.5.0.201609210915-r/org.eclipse.jgit-4.5.0.201609210915-r.pom
(10 KB at 343.7 KB/sec)
2017-02-28T19:29:24.662 [INFO] Downloading: https://repo.maven.apache.org/maven2/org/eclipse/jgit/org.eclipse.jgit-parent/4.5.0.201609210915-r/org.eclipse.jgit-parent-4.5.0.201609210915-r.pom
2017-02-28T19:29:24.690 [INFO] Downloaded: https://repo.maven.apache.org/maven2/org/eclipse/jgit/org.eclipse.jgit-parent/4.5.0.201609210915-r/org.eclipse.jgit-parent-4.5.0.201609210915-r.pom
(27 KB at 943.7 KB/sec)
2017-02-28T19:29:24.693 [INFO] Downloading: https://repo.maven.apache.org/maven2/com/jcraft/jsch/0.1.53/jsch-0.1.53.pom
2017-02-28T19:29:24.719 [INFO] Downloaded: https://repo.maven.apache.org/maven2/com/jcraft/jsch/0.1.53/jsch-0.1.53.pom
(4 KB at 121.5 KB/sec)
2017-02-28T19:29:24.720 [INFO] Downloading: https://repo.maven.apache.org/maven2/org/sonatype/oss/oss-parent/6/oss-parent-6.pom
2017-02-28T19:29:24.744 [INFO] Downloaded: https://repo.maven.apache.org/maven2/org/sonatype/oss/oss-parent/6/oss-parent-6.pom
(5 KB at 196.6 KB/sec)
2017-02-28T19:29:24.746 [INFO] Downloading: https://repo.maven.apache.org/maven2/com/googlecode/javaewah/JavaEWAH/0.7.9/JavaEWAH-0.7.9.pom
2017-02-28T19:29:24.772 [INFO] Downloaded: https://repo.maven.apache.org/maven2/com/googlecode/javaewah/JavaEWAH/0.7.9/JavaEWAH-0.7.9.pom
(5 KB at 163.2 KB/sec)
2017-02-28T19:29:24.774 [INFO] Downloading: https://repo.maven.apache.org/maven2/org/slf4j/slf4j-api/1.7.21/slf4j-api-1.7.21.pom
2017-02-28T19:29:24.800 [INFO] Downloaded: https://repo.maven.apache.org/maven2/org/slf4j/slf4j-api/1.7.21/slf4j-api-1.7.21.pom
(3 KB at 104.2 KB/sec)
2017-02-28T19:29:24.801 [INFO] Downloading: https://repo.maven.apache.org/maven2/org/slf4j/slf4j-parent/1.7.21/slf4j-parent-1.7.21.pom
2017-02-28T19:29:24.829 [INFO] Downloaded: https://repo.maven.apache.org/maven2/org/slf4j/slf4j-parent/1.7.21/slf4j-parent-1.7.21.pom
(14 KB at 471.0 KB/sec)
2017-02-28T19:29:24.831 [INFO] Downloading: https://repo.maven.apache.org/maven2/org/codehaus/plexus/plexus-utils/2.0.7/plexus-utils-2.0.7.pom
2017-02-28T19:29:24.858 [INFO] Downloaded: https://repo.maven.apache.org/maven2/org/codehaus/plexus/plexus-utils/2.0.7/plexus-utils-2.0.7.pom
(3 KB at 101.7 KB/sec)
2017-02-28T19:29:24.860 [INFO] Downloading: https://repo.maven.apache.org/maven2/org/sonatype/sisu/sisu-inject-plexus/1.4.3.2/sisu-inject-plexus-1.4.3.2.pom
2017-02-28T19:29:24.886 [INFO] Downloaded: https://repo.maven.apache.org/maven2/org/sonatype/sisu/sisu-inject-plexus/1.4.3.2/sisu-inject-plexus-1.4.3.2.pom
(6 KB at 195.7 KB/sec)
2017-02-28T19:29:24.887 [INFO] Downloading: https://repo.maven.apache.org/maven2/org/sonatype/sisu/inject/guice-plexus/1.4.3.2/guice-plexus-1.4.3.2.pom
2017-02-28T19:29:24.914 [INFO] Downloaded: https://repo.maven.apache.org/maven2/org/sonatype/sisu/inject/guice-plexus/1.4.3.2/guice-plexus-1.4.3.2.pom
(3 KB at 109.7 KB/sec)
2017-02-28T19:29:24.915 [INFO] Downloading: https://repo.maven.apache.org/maven2/org/sonatype/sisu/inject/guice-bean/1.4.3.2/guice-bean-1.4.3.2.pom
2017-02-28T19:29:24.939 [INFO] Downloaded: https://repo.maven.apache.org/maven2/org/sonatype/sisu/inject/guice-bean/1.4.3.2/guice-bean-1.4.3.2.pom
(3 KB at 102.8 KB/sec)
2017-02-28T19:29:24.940 [INFO] Downloading: https://repo.maven.apache.org/maven2/org/sonatype/sisu/sisu-inject/1.4.3.2/sisu-inject-1.4.3.2.pom
2017-02-28T19:29:24.966 [INFO] Downloaded: https://repo.maven.apache.org/maven2/org/sonatype/sisu/sisu-inject/1.4.3.2/sisu-inject-1.4.3.2.pom
(2 KB at 45.2 KB/sec)
2017-02-28T19:29:24.966 [INFO] Downloading: https://repo.maven.apache.org/maven2/org/sonatype/sisu/sisu-parent/1.4.3.2/sisu-parent-1.4.3.2.pom
2017-02-28T19:29:24.991 [INFO] Downloaded: https://repo.maven.apache.org/maven2/org/sonatype/sisu/sisu-parent/1.4.3.2/sisu-parent-1.4.3.2.pom
(8 KB at 315.7 KB/sec)
2017-02-28T19:29:24.993 [INFO] Downloading: https://repo.maven.apache.org/maven2/org/sonatype/sisu/sisu-inject-bean/1.4.3.2/sisu-inject-bean-1.4.3.2.pom
2017-02-28T19:29:25.018 [INFO] Downloaded: https://repo.maven.apache.org/maven2/org/sonatype/sisu/sisu-inject-bean/1.4.3.2/sisu-inject-bean-1.4.3.2.pom
(6 KB at 207.0 KB/sec)
2017-02-28T19:29:25.019 [INFO] Downloading: https://repo.maven.apache.org/maven2/org/sonatype/sisu/sisu-guice/2.9.2/sisu-guice-2.9.2.pom
2017-02-28T19:29:25.044 [INFO] Downloaded: https://repo.maven.apache.org/maven2/org/sonatype/sisu/sisu-guice/2.9.2/sisu-guice-2.9.2.pom
(8 KB at 287.1 KB/sec)
2017-02-28T19:29:25.045 [INFO] Downloading: https://repo.maven.apache.org/maven2/org/sonatype/sisu/inject/guice-parent/2.9.2/guice-parent-2.9.2.pom
2017-02-28T19:29:25.070 [INFO] Downloaded: https://repo.maven.apache.org/maven2/org/sonatype/sisu/inject/guice-parent/2.9.2/guice-parent-2.9.2.pom
(12 KB at 478.3 KB/sec)
2017-02-28T19:29:25.071 [INFO] Downloading: https://repo.maven.apache.org/maven2/org/slf4j/jcl-over-slf4j/1.7.21/jcl-over-slf4j-1.7.21.pom
2017-02-28T19:29:25.097 [INFO] Downloaded: https://repo.maven.apache.org/maven2/org/slf4j/jcl-over-slf4j/1.7.21/jcl-over-slf4j-1.7.21.pom
(963 B at 36.2 KB/sec)
2017-02-28T19:29:25.101 [INFO] Downloading: https://repo.maven.apache.org/maven2/org/apache/httpcomponents/httpmime/4.5.2/httpmime-4.5.2.jar
2017-02-28T19:29:25.101 [INFO] Downloading: https://repo.maven.apache.org/maven2/com/fasterxml/jackson/core/jackson-core/2.8.3/jackson-core-2.8.3.jar
2017-02-28T19:29:25.101 [INFO] Downloading: https://repo.maven.apache.org/maven2/com/fasterxml/jackson/core/jackson-databind/2.8.3/jackson-databind-2.8.3.jar
2017-02-28T19:29:25.101 [INFO] Downloading: https://repo.maven.apache.org/maven2/com/fasterxml/jackson/core/jackson-annotations/2.8.3/jackson-annotations-2.8.3.jar
2017-02-28T19:29:25.102 [INFO] Downloading: https://repo.maven.apache.org/maven2/org/eclipse/jgit/org.eclipse.jgit/4.5.0.201609210915-r/org.eclipse.jgit-4.5.0.201609210915-r.jar
2017-02-28T19:29:25.129 [INFO] Downloaded: https://repo.maven.apache.org/maven2/org/apache/httpcomponents/httpmime/4.5.2/httpmime-4.5.2.jar
(41 KB at 1431.0 KB/sec)
2017-02-28T19:29:25.129 [INFO] Downloading: https://repo.maven.apache.org/maven2/com/jcraft/jsch/0.1.53/jsch-0.1.53.jar
2017-02-28T19:29:25.132 [INFO] Downloaded: https://repo.maven.apache.org/maven2/com/fasterxml/jackson/core/jackson-annotations/2.8.3/jackson-annotations-2.8.3.jar
(55 KB at 1753.1 KB/sec)
2017-02-28T19:29:25.132 [INFO] Downloading: https://repo.maven.apache.org/maven2/com/googlecode/javaewah/JavaEWAH/0.7.9/JavaEWAH-0.7.9.jar
2017-02-28T19:29:25.139 [INFO] Downloaded: https://repo.maven.apache.org/maven2/com/fasterxml/jackson/core/jackson-core/2.8.3/jackson-core-2.8.3.jar
(275 KB at 7223.4 KB/sec)
2017-02-28T19:29:25.139 [INFO] Downloading: https://repo.maven.apache.org/maven2/org/codehaus/plexus/plexus-utils/2.0.7/plexus-utils-2.0.7.jar
2017-02-28T19:29:25.166 [INFO] Downloaded: https://repo.maven.apache.org/maven2/com/googlecode/javaewah/JavaEWAH/0.7.9/JavaEWAH-0.7.9.jar
(123 KB at 1880.2 KB/sec)
2017-02-28T19:29:25.166 [INFO] Downloading: https://repo.maven.apache.org/maven2/org/sonatype/sisu/sisu-inject-plexus/1.4.3.2/sisu-inject-plexus-1.4.3.2.jar
2017-02-28T19:29:25.171 [INFO] Downloaded: https://repo.maven.apache.org/maven2/com/jcraft/jsch/0.1.53/jsch-0.1.53.jar
(274 KB at 3909.1 KB/sec)
2017-02-28T19:29:25.171 [INFO] Downloading: https://repo.maven.apache.org/maven2/org/sonatype/sisu/sisu-inject-bean/1.4.3.2/sisu-inject-bean-1.4.3.2.jar
2017-02-28T19:29:25.174 [INFO] Downloaded: https://repo.maven.apache.org/maven2/org/codehaus/plexus/plexus-utils/2.0.7/plexus-utils-2.0.7.jar
(219 KB at 2995.8 KB/sec)
2017-02-28T19:29:25.174 [INFO] Downloading: https://repo.maven.apache.org/maven2/org/sonatype/sisu/sisu-guice/2.9.2/sisu-guice-2.9.2-no_aop.jar
2017-02-28T19:29:25.184 [INFO] Downloaded: https://repo.maven.apache.org/maven2/com/fasterxml/jackson/core/jackson-databind/2.8.3/jackson-databind-2.8.3.jar
(1205 KB at 14515.5 KB/sec)
2017-02-28T19:29:25.184 [INFO] Downloading: https://repo.maven.apache.org/maven2/org/slf4j/slf4j-api/1.7.21/slf4j-api-1.7.21.jar
2017-02-28T19:29:25.206 [INFO] Downloaded: https://repo.maven.apache.org/maven2/org/sonatype/sisu/sisu-inject-bean/1.4.3.2/sisu-inject-bean-1.4.3.2.jar
(157 KB at 1492.1 KB/sec)
2017-02-28T19:29:25.206 [INFO] Downloading: https://repo.maven.apache.org/maven2/org/slf4j/jcl-over-slf4j/1.7.21/jcl-over-slf4j-1.7.21.jar
2017-02-28T19:29:25.207 [INFO] Downloaded: https://repo.maven.apache.org/maven2/org/sonatype/sisu/sisu-inject-plexus/1.4.3.2/sisu-inject-plexus-1.4.3.2.jar
(201 KB at 1887.4 KB/sec)
2017-02-28T19:29:25.211 [INFO] Downloaded: https://repo.maven.apache.org/maven2/org/slf4j/slf4j-api/1.7.21/slf4j-api-1.7.21.jar
(41 KB at 364.6 KB/sec)
2017-02-28T19:29:25.219 [INFO] Downloaded: https://repo.maven.apache.org/maven2/org/sonatype/sisu/sisu-guice/2.9.2/sisu-guice-2.9.2-no_aop.jar
(469 KB at 3971.0 KB/sec)
2017-02-28T19:29:25.226 [INFO] Downloaded: https://repo.maven.apache.org/maven2/org/eclipse/jgit/org.eclipse.jgit/4.5.0.201609210915-r/org.eclipse.jgit-4.5.0.201609210915-r.jar
(2324 KB at 18586.8 KB/sec)
2017-02-28T19:29:25.233 [INFO] Downloaded: https://repo.maven.apache.org/maven2/org/slf4j/jcl-over-slf4j/1.7.21/jcl-over-slf4j-1.7.21.jar
(17 KB at 121.6 KB/sec)
2017-02-28T19:29:25.688 [INFO] Starting Coveralls job for jenkins (2776 / https://builds.apache.org/job/beam_PostCommit_Java_MavenInstall/2776/)
2017-02-28T19:29:25.688 [INFO] Using repository token <secret>
2017-02-28T19:29:25.688 [INFO] Git commit 466599d in master
2017-02-28T19:29:25.688 [INFO] Writing Coveralls data to <https://builds.apache.org/job/beam_PostCommit_Java_MavenInstall/ws/target/coveralls.json...>
2017-02-28T19:29:25.738 [INFO] Processing coverage report from <https://builds.apache.org/job/beam_PostCommit_Java_MavenInstall/ws/sdks/java/core/target/site/jacoco/jacoco.xml>
2017-02-28T19:29:26.146 [INFO] Processing coverage report from <https://builds.apache.org/job/beam_PostCommit_Java_MavenInstall/ws/sdks/java/java8tests/target/site/jacoco/jacoco.xml>
2017-02-28T19:29:26.148 [INFO] Processing coverage report from <https://builds.apache.org/job/beam_PostCommit_Java_MavenInstall/ws/runners/core-java/target/site/jacoco/jacoco.xml>
2017-02-28T19:29:26.254 [INFO] Processing coverage report from <https://builds.apache.org/job/beam_PostCommit_Java_MavenInstall/ws/runners/direct-java/target/site/jacoco/jacoco.xml>
2017-02-28T19:29:26.376 [INFO] Processing coverage report from <https://builds.apache.org/job/beam_PostCommit_Java_MavenInstall/ws/runners/google-cloud-dataflow-java/target/site/jacoco/jacoco.xml>
2017-02-28T19:29:26.441 [INFO] Processing coverage report from <https://builds.apache.org/job/beam_PostCommit_Java_MavenInstall/ws/examples/java/target/site/jacoco/jacoco.xml>
2017-02-28T19:29:26.480 [INFO] Processing coverage report from <https://builds.apache.org/job/beam_PostCommit_Java_MavenInstall/ws/examples/java8/target/site/jacoco/jacoco.xml>
2017-02-28T19:29:26.554 [INFO] Successfully wrote Coveralls data in 866ms
2017-02-28T19:29:26.554 [INFO] Gathered code coverage metrics for 511 source files with 121126
lines of code:
2017-02-28T19:29:26.554 [INFO] - 30283 relevant lines
2017-02-28T19:29:26.554 [INFO] - 20951 covered lines
2017-02-28T19:29:26.554 [INFO] - 9332 missed lines
2017-02-28T19:29:26.554 [INFO] Submitting Coveralls data to API
2017-02-28T19:30:27.087 [ERROR] Submission failed in 60532ms while handling I/O operations
[JENKINS] Archiving disabled
[JENKINS] Archiving disabled
[JENKINS] Archiving disabled
[JENKINS] Archiving disabled
[JENKINS] Archiving disabled
[JENKINS] Archiving disabled
[JENKINS] Archiving disabled
[JENKINS] Archiving disabled
[JENKINS] Archiving disabled
[JENKINS] Archiving disabled
[JENKINS] Archiving disabled
[JENKINS] Archiving disabled
[JENKINS] Archiving disabled
[JENKINS] Archiving disabled
[JENKINS] Archiving disabled
[JENKINS] Archiving disabled
[JENKINS] Archiving disabled
[JENKINS] Archiving disabled
[JENKINS] Archiving disabled
[JENKINS] Archiving disabled
[JENKINS] Archiving disabled
[JENKINS] Archiving disabled
[JENKINS] Archiving disabled
[JENKINS] Archiving disabled
[JENKINS] Archiving disabled
[JENKINS] Archiving disabled
[JENKINS] Archiving disabled
[JENKINS] Archiving disabled
[JENKINS] Archiving disabled
[JENKINS] Archiving disabled
[JENKINS] Archiving disabled
[JENKINS] Archiving disabled
[JENKINS] Archiving disabled
[JENKINS] Archiving disabled
[JENKINS] Archiving disabled
[JENKINS] Archiving disabled
[JENKINS] Archiving disabled
[JENKINS] Archiving disabled
[JENKINS] Archiving disabled
[JENKINS] Archiving disabled
[JENKINS] Archiving disabled
[JENKINS] Archiving disabled
[JENKINS] Archiving disabled
2017-02-28T19:30:46.318 [INFO] ------------------------------------------------------------------------
2017-02-28T19:30:46.318 [INFO] Reactor Summary:
2017-02-28T19:30:46.318 [INFO] 
2017-02-28T19:30:46.319 [INFO] Apache Beam :: Parent .............................. FAILURE
[01:04 min]
2017-02-28T19:30:46.319 [INFO] Apache Beam :: SDKs :: Java :: Build Tools ......... SUCCESS
[  3.268 s]
2017-02-28T19:30:46.319 [INFO] Apache Beam :: SDKs ................................ SUCCESS
[  5.986 s]
2017-02-28T19:30:46.319 [INFO] Apache Beam :: SDKs :: Common ...................... SUCCESS
[  1.422 s]
2017-02-28T19:30:46.319 [INFO] Apache Beam :: SDKs :: Common :: Fn API ............ SUCCESS
[ 16.407 s]
2017-02-28T19:30:46.319 [INFO] Apache Beam :: SDKs :: Common :: Runner API ........ SUCCESS
[ 11.725 s]
2017-02-28T19:30:46.319 [INFO] Apache Beam :: SDKs :: Java ........................ SUCCESS
[  1.917 s]
2017-02-28T19:30:46.319 [INFO] Apache Beam :: SDKs :: Java :: Core ................ SUCCESS
[02:48 min]
2017-02-28T19:30:46.319 [INFO] Apache Beam :: Runners ............................. SUCCESS
[  1.523 s]
2017-02-28T19:30:46.319 [INFO] Apache Beam :: Runners :: Core Java Construction ... SUCCESS
[ 12.115 s]
2017-02-28T19:30:46.319 [INFO] Apache Beam :: Runners :: Core Java ................ SUCCESS
[ 43.109 s]
2017-02-28T19:30:46.320 [INFO] Apache Beam :: Runners :: Direct Java .............. SUCCESS
[02:30 min]
2017-02-28T19:30:46.320 [INFO] Apache Beam :: SDKs :: Java :: IO .................. SUCCESS
[  1.793 s]
2017-02-28T19:30:46.320 [INFO] Apache Beam :: SDKs :: Java :: IO :: Elasticsearch . SUCCESS
[ 31.149 s]
2017-02-28T19:30:46.320 [INFO] Apache Beam :: Runners :: Google Cloud Dataflow .... SUCCESS
[ 26.266 s]
2017-02-28T19:30:46.320 [INFO] Apache Beam :: SDKs :: Java :: IO :: Google Cloud Platform
SUCCESS [06:28 min]
2017-02-28T19:30:46.320 [INFO] Apache Beam :: SDKs :: Java :: IO :: Hadoop Common . SUCCESS
[ 13.723 s]
2017-02-28T19:30:46.320 [INFO] Apache Beam :: SDKs :: Java :: IO :: HBase ......... SUCCESS
[ 22.352 s]
2017-02-28T19:30:46.320 [INFO] Apache Beam :: SDKs :: Java :: IO :: HDFS .......... SUCCESS
[ 20.845 s]
2017-02-28T19:30:46.320 [INFO] Apache Beam :: SDKs :: Java :: IO :: JDBC .......... SUCCESS
[ 18.723 s]
2017-02-28T19:30:46.320 [INFO] Apache Beam :: SDKs :: Java :: IO :: JMS ........... SUCCESS
[ 15.080 s]
2017-02-28T19:30:46.320 [INFO] Apache Beam :: SDKs :: Java :: IO :: Kafka ......... SUCCESS
[ 17.729 s]
2017-02-28T19:30:46.320 [INFO] Apache Beam :: SDKs :: Java :: IO :: Kinesis ....... SUCCESS
[ 17.178 s]
2017-02-28T19:30:46.320 [INFO] Apache Beam :: SDKs :: Java :: IO :: MongoDB ....... SUCCESS
[ 29.814 s]
2017-02-28T19:30:46.320 [INFO] Apache Beam :: SDKs :: Java :: IO :: MQTT .......... SUCCESS
[ 14.021 s]
2017-02-28T19:30:46.321 [INFO] Apache Beam :: SDKs :: Java :: Maven Archetypes .... SUCCESS
[  1.279 s]
2017-02-28T19:30:46.321 [INFO] Apache Beam :: SDKs :: Java :: Maven Archetypes :: Starter
SUCCESS [ 14.678 s]
2017-02-28T19:30:46.321 [INFO] Apache Beam :: SDKs :: Java :: Maven Archetypes :: Examples
SUCCESS [ 13.208 s]
2017-02-28T19:30:46.321 [INFO] Apache Beam :: SDKs :: Java :: Maven Archetypes :: Examples
- Java 8 SUCCESS [ 15.831 s]
2017-02-28T19:30:46.321 [INFO] Apache Beam :: SDKs :: Java :: Extensions .......... SUCCESS
[  1.246 s]
2017-02-28T19:30:46.321 [INFO] Apache Beam :: SDKs :: Java :: Extensions :: Jackson SUCCESS
[ 12.723 s]
2017-02-28T19:30:46.321 [INFO] Apache Beam :: SDKs :: Java :: Extensions :: Join library SUCCESS
[ 12.354 s]
2017-02-28T19:30:46.321 [INFO] Apache Beam :: SDKs :: Java :: Extensions :: Sorter  SUCCESS
[ 25.889 s]
2017-02-28T19:30:46.321 [INFO] Apache Beam :: SDKs :: Java :: Harness ............. SUCCESS
[ 30.392 s]
2017-02-28T19:30:46.321 [INFO] Apache Beam :: SDKs :: Java :: Java 8 Tests ........ SUCCESS
[ 10.405 s]
2017-02-28T19:30:46.321 [INFO] Apache Beam :: SDKs :: Python ...................... SUCCESS
[03:30 min]
2017-02-28T19:30:46.321 [INFO] Apache Beam :: Runners :: Flink .................... SUCCESS
[  1.292 s]
2017-02-28T19:30:46.321 [INFO] Apache Beam :: Runners :: Flink :: Core ............ SUCCESS
[ 41.285 s]
2017-02-28T19:30:46.322 [INFO] Apache Beam :: Runners :: Flink :: Examples ........ SUCCESS
[ 14.628 s]
2017-02-28T19:30:46.322 [INFO] Apache Beam :: Runners :: Spark .................... SUCCESS
[03:21 min]
2017-02-28T19:30:46.322 [INFO] Apache Beam :: Runners :: Apex ..................... SUCCESS
[ 55.761 s]
2017-02-28T19:30:46.322 [INFO] Apache Beam :: Examples ............................ SUCCESS
[  1.109 s]
2017-02-28T19:30:46.322 [INFO] Apache Beam :: Examples :: Java .................... SUCCESS
[05:26 min]
2017-02-28T19:30:46.322 [INFO] Apache Beam :: Examples :: Java 8 .................. SUCCESS
[ 21.235 s]
2017-02-28T19:30:46.322 [INFO] Apache Beam :: SDKs :: Java :: Aggregated Javadoc .. SUCCESS
[ 18.740 s]
2017-02-28T19:30:46.322 [INFO] ------------------------------------------------------------------------
2017-02-28T19:30:46.322 [INFO] BUILD FAILURE
2017-02-28T19:30:46.322 [INFO] ------------------------------------------------------------------------
2017-02-28T19:30:46.322 [INFO] Total time: 37:01 min
2017-02-28T19:30:46.323 [INFO] Finished at: 2017-02-28T19:30:46+00:00
2017-02-28T19:30:48.026 [INFO] Final Memory: 271M/1473M
2017-02-28T19:30:48.026 [INFO] ------------------------------------------------------------------------
Waiting for Jenkins to finish collecting data
2017-02-28T19:31:51.020 [ERROR] Failed to execute goal org.eluder.coveralls:coveralls-maven-plugin:4.3.0:report
(default-cli) on project beam-parent: I/O operation failed: Report submission to Coveralls
API failed with HTTP status 504: Gateway Time-out (Coveralls API internal error) -> [Help
1]
org.apache.maven.lifecycle.LifecycleExecutionException: Failed to execute goal org.eluder.coveralls:coveralls-maven-plugin:4.3.0:report
(default-cli) on project beam-parent: I/O operation failed
	at org.apache.maven.lifecycle.internal.MojoExecutor.execute(MojoExecutor.java:212)
	at org.apache.maven.lifecycle.internal.MojoExecutor.execute(MojoExecutor.java:153)
	at org.apache.maven.lifecycle.internal.MojoExecutor.execute(MojoExecutor.java:145)
	at org.apache.maven.lifecycle.internal.LifecycleModuleBuilder.buildProject(LifecycleModuleBuilder.java:116)
	at org.apache.maven.lifecycle.internal.LifecycleModuleBuilder.buildProject(LifecycleModuleBuilder.java:80)
	at org.apache.maven.lifecycle.internal.builder.singlethreaded.SingleThreadedBuilder.build(SingleThreadedBuilder.java:51)
	at org.apache.maven.lifecycle.internal.LifecycleStarter.execute(LifecycleStarter.java:128)
	at org.apache.maven.DefaultMaven.doExecute(DefaultMaven.java:307)
	at org.apache.maven.DefaultMaven.doExecute(DefaultMaven.java:193)
	at org.apache.maven.DefaultMaven.execute(DefaultMaven.java:106)
	at org.jvnet.hudson.maven3.launcher.Maven33Launcher.main(Maven33Launcher.java:129)
	at sun.reflect.NativeMethodAccessorImpl.invoke0(Native Method)
	at sun.reflect.NativeMethodAccessorImpl.invoke(NativeMethodAccessorImpl.java:62)
	at sun.reflect.DelegatingMethodAccessorImpl.invoke(DelegatingMethodAccessorImpl.java:43)
	at java.lang.reflect.Method.invoke(Method.java:498)
	at org.codehaus.plexus.classworlds.launcher.Launcher.launchStandard(Launcher.java:330)
	at org.codehaus.plexus.classworlds.launcher.Launcher.launch(Launcher.java:238)
	at jenkins.maven3.agent.Maven33Main.launch(Maven33Main.java:176)
	at sun.reflect.NativeMethodAccessorImpl.invoke0(Native Method)
	at sun.reflect.NativeMethodAccessorImpl.invoke(NativeMethodAccessorImpl.java:62)
	at sun.reflect.DelegatingMethodAccessorImpl.invoke(DelegatingMethodAccessorImpl.java:43)
	at java.lang.reflect.Method.invoke(Method.java:498)
	at hudson.maven.Maven3Builder.call(Maven3Builder.java:139)
	at hudson.maven.Maven3Builder.call(Maven3Builder.java:70)
	at hudson.remoting.UserRequest.perform(UserRequest.java:153)
	at hudson.remoting.UserRequest.perform(UserRequest.java:50)
	at hudson.remoting.Request$2.run(Request.java:336)
	at hudson.remoting.InterceptingExecutorService$1.call(InterceptingExecutorService.java:68)
	at java.util.concurrent.FutureTask.run(FutureTask.java:266)
	at java.util.concurrent.ThreadPoolExecutor.runWorker(ThreadPoolExecutor.java:1142)
	at java.util.concurrent.ThreadPoolExecutor$Worker.run(ThreadPoolExecutor.java:617)
	at java.lang.Thread.run(Thread.java:745)
Caused by: org.apache.maven.plugin.MojoFailureException: I/O operation failed
	at org.eluder.coveralls.maven.plugin.CoverallsReportMojo.execute(CoverallsReportMojo.java:259)
	at org.apache.maven.plugin.DefaultBuildPluginManager.executeMojo(DefaultBuildPluginManager.java:134)
	at org.apache.maven.lifecycle.internal.MojoExecutor.execute(MojoExecutor.java:208)
	... 31 more
Caused by: java.io.IOException: Report submission to Coveralls API failed with HTTP status
504: Gateway Time-out (Coveralls API internal error)
	at org.eluder.coveralls.maven.plugin.httpclient.CoverallsClient.parseResponse(CoverallsClient.java:108)
	at org.eluder.coveralls.maven.plugin.httpclient.CoverallsClient.submit(CoverallsClient.java:85)
	at org.eluder.coveralls.maven.plugin.CoverallsReportMojo.submitData(CoverallsReportMojo.java:400)
	at org.eluder.coveralls.maven.plugin.CoverallsReportMojo.execute(CoverallsReportMojo.java:254)
	... 33 more
Caused by: java.io.IOException: Coveralls API internal error
	at org.eluder.coveralls.maven.plugin.httpclient.CoverallsClient.parseResponse(CoverallsClient.java:97)
	... 36 more
2017-02-28T19:31:51.026 [ERROR] 
2017-02-28T19:31:51.026 [ERROR] Re-run Maven using the -X switch to enable full debug logging.
2017-02-28T19:31:51.027 [ERROR] 
2017-02-28T19:31:51.027 [ERROR] For more information about the errors and possible solutions,
please read the following articles:
2017-02-28T19:31:51.027 [ERROR] [Help 1] http://cwiki.apache.org/confluence/display/MAVEN/MojoFailureException
channel stopped

Mime
View raw message