beam-commits mailing list archives

Site index · List index
Message view « Date » · « Thread »
Top « Date » · « Thread »
From Apache Jenkins Server <jenk...@builds.apache.org>
Subject Build failed in Jenkins: beam_PostCommit_Python_Verify #1383
Date Tue, 28 Feb 2017 09:24:02 GMT
See <https://builds.apache.org/job/beam_PostCommit_Python_Verify/1383/display/redirect?page=changes>

Changes:

[dhalperi] Support unkown length iterables for IterableCoder in python SDK

------------------------------------------
[...truncated 1.36 MB...]
  File "dataflow_worker/opcounters.py", line 57, in dataflow_worker.opcounters.OperationCounters.update_from
(dataflow_worker/opcounters.c:2396)
    self.do_sample(windowed_value)
  File "dataflow_worker/opcounters.py", line 75, in dataflow_worker.opcounters.OperationCounters.do_sample
(dataflow_worker/opcounters.c:3017)
    self.coder_impl.get_estimated_size_and_observables(windowed_value))
  File "apache_beam/coders/coder_impl.py", line 695, in apache_beam.coders.coder_impl.WindowedValueCoderImpl.get_estimated_size_and_observables
(apache_beam/coders/coder_impl.c:22894)
    def get_estimated_size_and_observables(self, value, nested=False):
  File "apache_beam/coders/coder_impl.py", line 704, in apache_beam.coders.coder_impl.WindowedValueCoderImpl.get_estimated_size_and_observables
(apache_beam/coders/coder_impl.c:22613)
    self._value_coder.get_estimated_size_and_observables(
  File "apache_beam/coders/coder_impl.py", line 247, in apache_beam.coders.coder_impl.FastPrimitivesCoderImpl.get_estimated_size_and_observables
(apache_beam/coders/coder_impl.c:9564)
    out = ByteCountingOutputStream()
  File "apache_beam/coders/stream.pyx", line 28, in apache_beam.coders.stream.OutputStream.__cinit__
(apache_beam/coders/stream.c:1241)
    self.buffer_size = 1024
AttributeError: 'apache_beam.coders.stream.ByteCountingOutputStream' object has no attribute
'buffer_size' [while running 'compute']

root: INFO: 2017-02-28_01_18_14-9192084589241424159_0000015a8406b4c3: 2017-02-28T09:21:56.419Z:
JOB_MESSAGE_ERROR: (d33171c20546a291): Traceback (most recent call last):
  File "/usr/local/lib/python2.7/dist-packages/dataflow_worker/batchworker.py", line 544,
in do_work
    work_executor.execute()
  File "dataflow_worker/executor.py", line 971, in dataflow_worker.executor.MapTaskExecutor.execute
(dataflow_worker/executor.c:30533)
    with op.scoped_metrics_container:
  File "dataflow_worker/executor.py", line 972, in dataflow_worker.executor.MapTaskExecutor.execute
(dataflow_worker/executor.c:30481)
    op.start()
  File "dataflow_worker/executor.py", line 207, in dataflow_worker.executor.ReadOperation.start
(dataflow_worker/executor.c:8758)
    def start(self):
  File "dataflow_worker/executor.py", line 208, in dataflow_worker.executor.ReadOperation.start
(dataflow_worker/executor.c:8663)
    with self.scoped_start_state:
  File "dataflow_worker/executor.py", line 213, in dataflow_worker.executor.ReadOperation.start
(dataflow_worker/executor.c:8579)
    with self.spec.source.reader() as reader:
  File "dataflow_worker/executor.py", line 223, in dataflow_worker.executor.ReadOperation.start
(dataflow_worker/executor.c:8524)
    self.output(windowed_value)
  File "dataflow_worker/executor.py", line 151, in dataflow_worker.executor.Operation.output
(dataflow_worker/executor.c:6317)
    cython.cast(Receiver, self.receivers[output_index]).receive(windowed_value)
  File "dataflow_worker/executor.py", line 84, in dataflow_worker.executor.ConsumerSet.receive
(dataflow_worker/executor.c:4021)
    cython.cast(Operation, consumer).process(windowed_value)
  File "dataflow_worker/executor.py", line 544, in dataflow_worker.executor.DoOperation.process
(dataflow_worker/executor.c:18474)
    with self.scoped_process_state:
  File "dataflow_worker/executor.py", line 545, in dataflow_worker.executor.DoOperation.process
(dataflow_worker/executor.c:18428)
    self.dofn_receiver.receive(o)
  File "apache_beam/runners/common.py", line 195, in apache_beam.runners.common.DoFnRunner.receive
(apache_beam/runners/common.c:5142)
    self.process(windowed_value)
  File "apache_beam/runners/common.py", line 267, in apache_beam.runners.common.DoFnRunner.process
(apache_beam/runners/common.c:7201)
    self.reraise_augmented(exn)
  File "apache_beam/runners/common.py", line 279, in apache_beam.runners.common.DoFnRunner.reraise_augmented
(apache_beam/runners/common.c:7590)
    raise type(exn), args, sys.exc_info()[2]
  File "apache_beam/runners/common.py", line 265, in apache_beam.runners.common.DoFnRunner.process
(apache_beam/runners/common.c:7112)
    self._dofn_invoker(element)
  File "apache_beam/runners/common.py", line 232, in apache_beam.runners.common.DoFnRunner._dofn_invoker
(apache_beam/runners/common.c:6131)
    self._dofn_per_window_invoker(element)
  File "apache_beam/runners/common.py", line 218, in apache_beam.runners.common.DoFnRunner._dofn_per_window_invoker
(apache_beam/runners/common.c:5877)
    self._process_outputs(element, self.dofn_process(*args))
  File "apache_beam/runners/common.py", line 326, in apache_beam.runners.common.DoFnRunner._process_outputs
(apache_beam/runners/common.c:8563)
    self.main_receivers.receive(windowed_value)
  File "dataflow_worker/executor.py", line 82, in dataflow_worker.executor.ConsumerSet.receive
(dataflow_worker/executor.c:3987)
    self.update_counters_start(windowed_value)
  File "dataflow_worker/executor.py", line 88, in dataflow_worker.executor.ConsumerSet.update_counters_start
(dataflow_worker/executor.c:4207)
    self.opcounter.update_from(windowed_value)
  File "dataflow_worker/opcounters.py", line 57, in dataflow_worker.opcounters.OperationCounters.update_from
(dataflow_worker/opcounters.c:2396)
    self.do_sample(windowed_value)
  File "dataflow_worker/opcounters.py", line 75, in dataflow_worker.opcounters.OperationCounters.do_sample
(dataflow_worker/opcounters.c:3017)
    self.coder_impl.get_estimated_size_and_observables(windowed_value))
  File "apache_beam/coders/coder_impl.py", line 695, in apache_beam.coders.coder_impl.WindowedValueCoderImpl.get_estimated_size_and_observables
(apache_beam/coders/coder_impl.c:22894)
    def get_estimated_size_and_observables(self, value, nested=False):
  File "apache_beam/coders/coder_impl.py", line 704, in apache_beam.coders.coder_impl.WindowedValueCoderImpl.get_estimated_size_and_observables
(apache_beam/coders/coder_impl.c:22613)
    self._value_coder.get_estimated_size_and_observables(
  File "apache_beam/coders/coder_impl.py", line 247, in apache_beam.coders.coder_impl.FastPrimitivesCoderImpl.get_estimated_size_and_observables
(apache_beam/coders/coder_impl.c:9564)
    out = ByteCountingOutputStream()
  File "apache_beam/coders/stream.pyx", line 28, in apache_beam.coders.stream.OutputStream.__cinit__
(apache_beam/coders/stream.c:1241)
    self.buffer_size = 1024
AttributeError: 'apache_beam.coders.stream.ByteCountingOutputStream' object has no attribute
'buffer_size' [while running 'compute']

root: INFO: 2017-02-28_01_18_14-9192084589241424159_0000015a8406c0f1: 2017-02-28T09:21:59.537Z:
JOB_MESSAGE_ERROR: (d33171c20546abe6): Traceback (most recent call last):
  File "/usr/local/lib/python2.7/dist-packages/dataflow_worker/batchworker.py", line 544,
in do_work
    work_executor.execute()
  File "dataflow_worker/executor.py", line 971, in dataflow_worker.executor.MapTaskExecutor.execute
(dataflow_worker/executor.c:30533)
    with op.scoped_metrics_container:
  File "dataflow_worker/executor.py", line 972, in dataflow_worker.executor.MapTaskExecutor.execute
(dataflow_worker/executor.c:30481)
    op.start()
  File "dataflow_worker/executor.py", line 207, in dataflow_worker.executor.ReadOperation.start
(dataflow_worker/executor.c:8758)
    def start(self):
  File "dataflow_worker/executor.py", line 208, in dataflow_worker.executor.ReadOperation.start
(dataflow_worker/executor.c:8663)
    with self.scoped_start_state:
  File "dataflow_worker/executor.py", line 213, in dataflow_worker.executor.ReadOperation.start
(dataflow_worker/executor.c:8579)
    with self.spec.source.reader() as reader:
  File "dataflow_worker/executor.py", line 223, in dataflow_worker.executor.ReadOperation.start
(dataflow_worker/executor.c:8524)
    self.output(windowed_value)
  File "dataflow_worker/executor.py", line 151, in dataflow_worker.executor.Operation.output
(dataflow_worker/executor.c:6317)
    cython.cast(Receiver, self.receivers[output_index]).receive(windowed_value)
  File "dataflow_worker/executor.py", line 84, in dataflow_worker.executor.ConsumerSet.receive
(dataflow_worker/executor.c:4021)
    cython.cast(Operation, consumer).process(windowed_value)
  File "dataflow_worker/executor.py", line 544, in dataflow_worker.executor.DoOperation.process
(dataflow_worker/executor.c:18474)
    with self.scoped_process_state:
  File "dataflow_worker/executor.py", line 545, in dataflow_worker.executor.DoOperation.process
(dataflow_worker/executor.c:18428)
    self.dofn_receiver.receive(o)
  File "apache_beam/runners/common.py", line 195, in apache_beam.runners.common.DoFnRunner.receive
(apache_beam/runners/common.c:5142)
    self.process(windowed_value)
  File "apache_beam/runners/common.py", line 267, in apache_beam.runners.common.DoFnRunner.process
(apache_beam/runners/common.c:7201)
    self.reraise_augmented(exn)
  File "apache_beam/runners/common.py", line 279, in apache_beam.runners.common.DoFnRunner.reraise_augmented
(apache_beam/runners/common.c:7590)
    raise type(exn), args, sys.exc_info()[2]
  File "apache_beam/runners/common.py", line 265, in apache_beam.runners.common.DoFnRunner.process
(apache_beam/runners/common.c:7112)
    self._dofn_invoker(element)
  File "apache_beam/runners/common.py", line 232, in apache_beam.runners.common.DoFnRunner._dofn_invoker
(apache_beam/runners/common.c:6131)
    self._dofn_per_window_invoker(element)
  File "apache_beam/runners/common.py", line 218, in apache_beam.runners.common.DoFnRunner._dofn_per_window_invoker
(apache_beam/runners/common.c:5877)
    self._process_outputs(element, self.dofn_process(*args))
  File "apache_beam/runners/common.py", line 326, in apache_beam.runners.common.DoFnRunner._process_outputs
(apache_beam/runners/common.c:8563)
    self.main_receivers.receive(windowed_value)
  File "dataflow_worker/executor.py", line 82, in dataflow_worker.executor.ConsumerSet.receive
(dataflow_worker/executor.c:3987)
    self.update_counters_start(windowed_value)
  File "dataflow_worker/executor.py", line 88, in dataflow_worker.executor.ConsumerSet.update_counters_start
(dataflow_worker/executor.c:4207)
    self.opcounter.update_from(windowed_value)
  File "dataflow_worker/opcounters.py", line 57, in dataflow_worker.opcounters.OperationCounters.update_from
(dataflow_worker/opcounters.c:2396)
    self.do_sample(windowed_value)
  File "dataflow_worker/opcounters.py", line 75, in dataflow_worker.opcounters.OperationCounters.do_sample
(dataflow_worker/opcounters.c:3017)
    self.coder_impl.get_estimated_size_and_observables(windowed_value))
  File "apache_beam/coders/coder_impl.py", line 695, in apache_beam.coders.coder_impl.WindowedValueCoderImpl.get_estimated_size_and_observables
(apache_beam/coders/coder_impl.c:22894)
    def get_estimated_size_and_observables(self, value, nested=False):
  File "apache_beam/coders/coder_impl.py", line 704, in apache_beam.coders.coder_impl.WindowedValueCoderImpl.get_estimated_size_and_observables
(apache_beam/coders/coder_impl.c:22613)
    self._value_coder.get_estimated_size_and_observables(
  File "apache_beam/coders/coder_impl.py", line 247, in apache_beam.coders.coder_impl.FastPrimitivesCoderImpl.get_estimated_size_and_observables
(apache_beam/coders/coder_impl.c:9564)
    out = ByteCountingOutputStream()
  File "apache_beam/coders/stream.pyx", line 28, in apache_beam.coders.stream.OutputStream.__cinit__
(apache_beam/coders/stream.c:1241)
    self.buffer_size = 1024
AttributeError: 'apache_beam.coders.stream.ByteCountingOutputStream' object has no attribute
'buffer_size' [while running 'compute']

root: INFO: 2017-02-28_01_18_14-9192084589241424159_0000015a8406cd26: 2017-02-28T09:22:02.662Z:
JOB_MESSAGE_ERROR: (d33171c20546a53b): Traceback (most recent call last):
  File "/usr/local/lib/python2.7/dist-packages/dataflow_worker/batchworker.py", line 544,
in do_work
    work_executor.execute()
  File "dataflow_worker/executor.py", line 971, in dataflow_worker.executor.MapTaskExecutor.execute
(dataflow_worker/executor.c:30533)
    with op.scoped_metrics_container:
  File "dataflow_worker/executor.py", line 972, in dataflow_worker.executor.MapTaskExecutor.execute
(dataflow_worker/executor.c:30481)
    op.start()
  File "dataflow_worker/executor.py", line 207, in dataflow_worker.executor.ReadOperation.start
(dataflow_worker/executor.c:8758)
    def start(self):
  File "dataflow_worker/executor.py", line 208, in dataflow_worker.executor.ReadOperation.start
(dataflow_worker/executor.c:8663)
    with self.scoped_start_state:
  File "dataflow_worker/executor.py", line 213, in dataflow_worker.executor.ReadOperation.start
(dataflow_worker/executor.c:8579)
    with self.spec.source.reader() as reader:
  File "dataflow_worker/executor.py", line 223, in dataflow_worker.executor.ReadOperation.start
(dataflow_worker/executor.c:8524)
    self.output(windowed_value)
  File "dataflow_worker/executor.py", line 151, in dataflow_worker.executor.Operation.output
(dataflow_worker/executor.c:6317)
    cython.cast(Receiver, self.receivers[output_index]).receive(windowed_value)
  File "dataflow_worker/executor.py", line 84, in dataflow_worker.executor.ConsumerSet.receive
(dataflow_worker/executor.c:4021)
    cython.cast(Operation, consumer).process(windowed_value)
  File "dataflow_worker/executor.py", line 544, in dataflow_worker.executor.DoOperation.process
(dataflow_worker/executor.c:18474)
    with self.scoped_process_state:
  File "dataflow_worker/executor.py", line 545, in dataflow_worker.executor.DoOperation.process
(dataflow_worker/executor.c:18428)
    self.dofn_receiver.receive(o)
  File "apache_beam/runners/common.py", line 195, in apache_beam.runners.common.DoFnRunner.receive
(apache_beam/runners/common.c:5142)
    self.process(windowed_value)
  File "apache_beam/runners/common.py", line 267, in apache_beam.runners.common.DoFnRunner.process
(apache_beam/runners/common.c:7201)
    self.reraise_augmented(exn)
  File "apache_beam/runners/common.py", line 279, in apache_beam.runners.common.DoFnRunner.reraise_augmented
(apache_beam/runners/common.c:7590)
    raise type(exn), args, sys.exc_info()[2]
  File "apache_beam/runners/common.py", line 265, in apache_beam.runners.common.DoFnRunner.process
(apache_beam/runners/common.c:7112)
    self._dofn_invoker(element)
  File "apache_beam/runners/common.py", line 232, in apache_beam.runners.common.DoFnRunner._dofn_invoker
(apache_beam/runners/common.c:6131)
    self._dofn_per_window_invoker(element)
  File "apache_beam/runners/common.py", line 218, in apache_beam.runners.common.DoFnRunner._dofn_per_window_invoker
(apache_beam/runners/common.c:5877)
    self._process_outputs(element, self.dofn_process(*args))
  File "apache_beam/runners/common.py", line 326, in apache_beam.runners.common.DoFnRunner._process_outputs
(apache_beam/runners/common.c:8563)
    self.main_receivers.receive(windowed_value)
  File "dataflow_worker/executor.py", line 82, in dataflow_worker.executor.ConsumerSet.receive
(dataflow_worker/executor.c:3987)
    self.update_counters_start(windowed_value)
  File "dataflow_worker/executor.py", line 88, in dataflow_worker.executor.ConsumerSet.update_counters_start
(dataflow_worker/executor.c:4207)
    self.opcounter.update_from(windowed_value)
  File "dataflow_worker/opcounters.py", line 57, in dataflow_worker.opcounters.OperationCounters.update_from
(dataflow_worker/opcounters.c:2396)
    self.do_sample(windowed_value)
  File "dataflow_worker/opcounters.py", line 75, in dataflow_worker.opcounters.OperationCounters.do_sample
(dataflow_worker/opcounters.c:3017)
    self.coder_impl.get_estimated_size_and_observables(windowed_value))
  File "apache_beam/coders/coder_impl.py", line 695, in apache_beam.coders.coder_impl.WindowedValueCoderImpl.get_estimated_size_and_observables
(apache_beam/coders/coder_impl.c:22894)
    def get_estimated_size_and_observables(self, value, nested=False):
  File "apache_beam/coders/coder_impl.py", line 704, in apache_beam.coders.coder_impl.WindowedValueCoderImpl.get_estimated_size_and_observables
(apache_beam/coders/coder_impl.c:22613)
    self._value_coder.get_estimated_size_and_observables(
  File "apache_beam/coders/coder_impl.py", line 247, in apache_beam.coders.coder_impl.FastPrimitivesCoderImpl.get_estimated_size_and_observables
(apache_beam/coders/coder_impl.c:9564)
    out = ByteCountingOutputStream()
  File "apache_beam/coders/stream.pyx", line 28, in apache_beam.coders.stream.OutputStream.__cinit__
(apache_beam/coders/stream.c:1241)
    self.buffer_size = 1024
AttributeError: 'apache_beam.coders.stream.ByteCountingOutputStream' object has no attribute
'buffer_size' [while running 'compute']

root: INFO: 2017-02-28_01_18_14-9192084589241424159_0000015a8406d94f: 2017-02-28T09:22:05.775Z:
JOB_MESSAGE_ERROR: (d33171c20546ae90): Traceback (most recent call last):
  File "/usr/local/lib/python2.7/dist-packages/dataflow_worker/batchworker.py", line 544,
in do_work
    work_executor.execute()
  File "dataflow_worker/executor.py", line 971, in dataflow_worker.executor.MapTaskExecutor.execute
(dataflow_worker/executor.c:30533)
    with op.scoped_metrics_container:
  File "dataflow_worker/executor.py", line 972, in dataflow_worker.executor.MapTaskExecutor.execute
(dataflow_worker/executor.c:30481)
    op.start()
  File "dataflow_worker/executor.py", line 207, in dataflow_worker.executor.ReadOperation.start
(dataflow_worker/executor.c:8758)
    def start(self):
  File "dataflow_worker/executor.py", line 208, in dataflow_worker.executor.ReadOperation.start
(dataflow_worker/executor.c:8663)
    with self.scoped_start_state:
  File "dataflow_worker/executor.py", line 213, in dataflow_worker.executor.ReadOperation.start
(dataflow_worker/executor.c:8579)
    with self.spec.source.reader() as reader:
  File "dataflow_worker/executor.py", line 223, in dataflow_worker.executor.ReadOperation.start
(dataflow_worker/executor.c:8524)
    self.output(windowed_value)
  File "dataflow_worker/executor.py", line 151, in dataflow_worker.executor.Operation.output
(dataflow_worker/executor.c:6317)
    cython.cast(Receiver, self.receivers[output_index]).receive(windowed_value)
  File "dataflow_worker/executor.py", line 84, in dataflow_worker.executor.ConsumerSet.receive
(dataflow_worker/executor.c:4021)
    cython.cast(Operation, consumer).process(windowed_value)
  File "dataflow_worker/executor.py", line 544, in dataflow_worker.executor.DoOperation.process
(dataflow_worker/executor.c:18474)
    with self.scoped_process_state:
  File "dataflow_worker/executor.py", line 545, in dataflow_worker.executor.DoOperation.process
(dataflow_worker/executor.c:18428)
    self.dofn_receiver.receive(o)
  File "apache_beam/runners/common.py", line 195, in apache_beam.runners.common.DoFnRunner.receive
(apache_beam/runners/common.c:5142)
    self.process(windowed_value)
  File "apache_beam/runners/common.py", line 267, in apache_beam.runners.common.DoFnRunner.process
(apache_beam/runners/common.c:7201)
    self.reraise_augmented(exn)
  File "apache_beam/runners/common.py", line 279, in apache_beam.runners.common.DoFnRunner.reraise_augmented
(apache_beam/runners/common.c:7590)
    raise type(exn), args, sys.exc_info()[2]
  File "apache_beam/runners/common.py", line 265, in apache_beam.runners.common.DoFnRunner.process
(apache_beam/runners/common.c:7112)
    self._dofn_invoker(element)
  File "apache_beam/runners/common.py", line 232, in apache_beam.runners.common.DoFnRunner._dofn_invoker
(apache_beam/runners/common.c:6131)
    self._dofn_per_window_invoker(element)
  File "apache_beam/runners/common.py", line 218, in apache_beam.runners.common.DoFnRunner._dofn_per_window_invoker
(apache_beam/runners/common.c:5877)
    self._process_outputs(element, self.dofn_process(*args))
  File "apache_beam/runners/common.py", line 326, in apache_beam.runners.common.DoFnRunner._process_outputs
(apache_beam/runners/common.c:8563)
    self.main_receivers.receive(windowed_value)
  File "dataflow_worker/executor.py", line 82, in dataflow_worker.executor.ConsumerSet.receive
(dataflow_worker/executor.c:3987)
    self.update_counters_start(windowed_value)
  File "dataflow_worker/executor.py", line 88, in dataflow_worker.executor.ConsumerSet.update_counters_start
(dataflow_worker/executor.c:4207)
    self.opcounter.update_from(windowed_value)
  File "dataflow_worker/opcounters.py", line 57, in dataflow_worker.opcounters.OperationCounters.update_from
(dataflow_worker/opcounters.c:2396)
    self.do_sample(windowed_value)
  File "dataflow_worker/opcounters.py", line 75, in dataflow_worker.opcounters.OperationCounters.do_sample
(dataflow_worker/opcounters.c:3017)
    self.coder_impl.get_estimated_size_and_observables(windowed_value))
  File "apache_beam/coders/coder_impl.py", line 695, in apache_beam.coders.coder_impl.WindowedValueCoderImpl.get_estimated_size_and_observables
(apache_beam/coders/coder_impl.c:22894)
    def get_estimated_size_and_observables(self, value, nested=False):
  File "apache_beam/coders/coder_impl.py", line 704, in apache_beam.coders.coder_impl.WindowedValueCoderImpl.get_estimated_size_and_observables
(apache_beam/coders/coder_impl.c:22613)
    self._value_coder.get_estimated_size_and_observables(
  File "apache_beam/coders/coder_impl.py", line 247, in apache_beam.coders.coder_impl.FastPrimitivesCoderImpl.get_estimated_size_and_observables
(apache_beam/coders/coder_impl.c:9564)
    out = ByteCountingOutputStream()
  File "apache_beam/coders/stream.pyx", line 28, in apache_beam.coders.stream.OutputStream.__cinit__
(apache_beam/coders/stream.c:1241)
    self.buffer_size = 1024
AttributeError: 'apache_beam.coders.stream.ByteCountingOutputStream' object has no attribute
'buffer_size' [while running 'compute']

root: INFO: 2017-02-28_01_18_14-9192084589241424159_0000015a8406d9f7: 2017-02-28T09:22:05.943Z:
JOB_MESSAGE_DEBUG: (4f67e81e4d08f280): Executing failure step failure12
root: INFO: 2017-02-28_01_18_14-9192084589241424159_0000015a8406d9fa: 2017-02-28T09:22:05.946Z:
JOB_MESSAGE_ERROR: (4f67e81e4d08f216): Workflow failed. Causes: (4f67e81e4d08f3be): S03:compute+assert_that/WindowInto(WindowIntoFn)+assert_that/ToVoidKey+assert_that/Group/Reify+assert_that/Group/Write
failed.
root: INFO: 2017-02-28_01_18_14-9192084589241424159_0000015a8406da33: 2017-02-28T09:22:06.003Z:
JOB_MESSAGE_DETAILED: (307149f5d9843f3c): Cleaning up.
root: INFO: 2017-02-28_01_18_14-9192084589241424159_0000015a8406dab5: 2017-02-28T09:22:06.133Z:
JOB_MESSAGE_DEBUG: (307149f5d9843542): Starting worker pool teardown.
root: INFO: 2017-02-28_01_18_14-9192084589241424159_0000015a8406dab7: 2017-02-28T09:22:06.135Z:
JOB_MESSAGE_BASIC: (307149f5d9843b48): Stopping worker pool...
root: INFO: 2017-02-28_01_18_14-9192084589241424159_0000015a8408615f: 2017-02-28T09:23:46.143Z:
JOB_MESSAGE_BASIC: (307149f5d9843c51): Worker pool stopped.
root: INFO: 2017-02-28_01_18_14-9192084589241424159_0000015a84086177: 2017-02-28T09:23:46.167Z:
JOB_MESSAGE_DEBUG: (307149f5d9843e63): Tearing down pending resources...
root: INFO: Job 2017-02-28_01_18_14-9192084589241424159 is in state JOB_STATE_FAILED
--------------------- >> end captured logging << ---------------------

----------------------------------------------------------------------
Ran 14 tests in 4229.352s

FAILED (errors=13)
Build step 'Execute shell' marked build as failure

Mime
View raw message