beam-commits mailing list archives

Site index · List index
Message view « Date » · « Thread »
Top « Date » · « Thread »
From Apache Jenkins Server <jenk...@builds.apache.org>
Subject Build failed in Jenkins: beam_PostCommit_Java_MavenInstall #2851
Date Thu, 09 Mar 2017 00:53:05 GMT
See <https://builds.apache.org/job/beam_PostCommit_Java_MavenInstall/2851/display/redirect?page=changes>

Changes:

[klk] Jdbc k8 & data loading: add teardown and update names/docs

[klk] Jdbc k8 script: postgres data store only accessible inside test project

------------------------------------------
[...truncated 326.48 KB...]
2017-03-09T00:47:32.435 [INFO] Downloading: https://repo.maven.apache.org/maven2/org/apache/maven/maven-settings/3.0/maven-settings-3.0.jar
2017-03-09T00:47:32.443 [INFO] Downloaded: https://repo.maven.apache.org/maven2/org/apache/maven/maven-model/3.0/maven-model-3.0.jar
(161 KB at 3922.6 KB/sec)
2017-03-09T00:47:32.443 [INFO] Downloading: https://repo.maven.apache.org/maven2/org/apache/maven/maven-settings-builder/3.0/maven-settings-builder-3.0.jar
2017-03-09T00:47:32.444 [INFO] Downloaded: https://repo.maven.apache.org/maven2/org/xolstice/maven/plugins/protobuf-maven-plugin/0.5.0/protobuf-maven-plugin-0.5.0.jar
(176 KB at 4184.9 KB/sec)
2017-03-09T00:47:32.444 [INFO] Downloading: https://repo.maven.apache.org/maven2/org/apache/maven/maven-repository-metadata/3.0/maven-repository-metadata-3.0.jar
2017-03-09T00:47:32.464 [INFO] Downloaded: https://repo.maven.apache.org/maven2/org/apache/maven/maven-settings/3.0/maven-settings-3.0.jar
(46 KB at 747.1 KB/sec)
2017-03-09T00:47:32.464 [INFO] Downloading: https://repo.maven.apache.org/maven2/org/apache/maven/maven-model-builder/3.0/maven-model-builder-3.0.jar
2017-03-09T00:47:32.471 [INFO] Downloaded: https://repo.maven.apache.org/maven2/org/apache/maven/maven-settings-builder/3.0/maven-settings-builder-3.0.jar
(37 KB at 542.6 KB/sec)
2017-03-09T00:47:32.471 [INFO] Downloading: https://repo.maven.apache.org/maven2/org/apache/maven/maven-aether-provider/3.0/maven-aether-provider-3.0.jar
2017-03-09T00:47:32.473 [INFO] Downloaded: https://repo.maven.apache.org/maven2/org/apache/maven/maven-repository-metadata/3.0/maven-repository-metadata-3.0.jar
(30 KB at 419.7 KB/sec)
2017-03-09T00:47:32.473 [INFO] Downloading: https://repo.maven.apache.org/maven2/org/apache/maven/maven-artifact/3.0/maven-artifact-3.0.jar
2017-03-09T00:47:32.494 [INFO] Downloaded: https://repo.maven.apache.org/maven2/org/apache/maven/maven-core/3.0/maven-core-3.0.jar
(515 KB at 5655.9 KB/sec)
2017-03-09T00:47:32.494 [INFO] Downloading: https://repo.maven.apache.org/maven2/org/apache/maven/maven-compat/3.0/maven-compat-3.0.jar
2017-03-09T00:47:32.501 [INFO] Downloaded: https://repo.maven.apache.org/maven2/org/apache/maven/maven-aether-provider/3.0/maven-aether-provider-3.0.jar
(50 KB at 510.1 KB/sec)
2017-03-09T00:47:32.501 [INFO] Downloading: https://repo.maven.apache.org/maven2/org/apache/maven/wagon/wagon-provider-api/1.0-beta-6/wagon-provider-api-1.0-beta-6.jar
2017-03-09T00:47:32.505 [INFO] Downloaded: https://repo.maven.apache.org/maven2/org/apache/maven/maven-artifact/3.0/maven-artifact-3.0.jar
(51 KB at 497.0 KB/sec)
2017-03-09T00:47:32.505 [INFO] Downloaded: https://repo.maven.apache.org/maven2/org/apache/maven/maven-model-builder/3.0/maven-model-builder-3.0.jar
(145 KB at 1416.7 KB/sec)
2017-03-09T00:47:32.530 [INFO] Downloaded: https://repo.maven.apache.org/maven2/org/apache/maven/wagon/wagon-provider-api/1.0-beta-6/wagon-provider-api-1.0-beta-6.jar
(52 KB at 409.0 KB/sec)
2017-03-09T00:47:32.540 [INFO] Downloaded: https://repo.maven.apache.org/maven2/org/apache/maven/maven-compat/3.0/maven-compat-3.0.jar
(279 KB at 2030.7 KB/sec)
2017-03-09T00:47:32.585 [INFO] Downloaded: https://repo.maven.apache.org/maven2/com/google/guava/guava/18.0/guava-18.0.jar
(2204 KB at 12040.1 KB/sec)
2017-03-09T00:47:32.649 [INFO] Downloading: https://repo.maven.apache.org/maven2/com/google/protobuf/protoc/3.1.0/protoc-3.1.0.pom
2017-03-09T00:47:32.679 [INFO] Downloaded: https://repo.maven.apache.org/maven2/com/google/protobuf/protoc/3.1.0/protoc-3.1.0.pom
(5 KB at 147.8 KB/sec)
2017-03-09T00:47:32.692 [INFO] Downloading: https://repo.maven.apache.org/maven2/com/google/protobuf/protoc/3.1.0/protoc-3.1.0-linux-x86_64.exe
[WARNING] Cannot calculate digest of mojo class, because mojo wasn't loaded from a jar, but
from: <https://builds.apache.org/job/beam_PostCommit_Java_MavenInstall/ws/.repository/org/xolstice/maven/plugins/protobuf-maven-plugin/0.5.0/protobuf-maven-plugin-0.5.0.jar>
[JENKINS] Archiving disabled
2017-03-09T00:47:41.455 [INFO]                                                           
             
2017-03-09T00:47:41.455 [INFO] ------------------------------------------------------------------------
2017-03-09T00:47:41.455 [INFO] Skipping Apache Beam :: Parent
2017-03-09T00:47:41.455 [INFO] This project has been banned from the build due to previous
failures.
2017-03-09T00:47:41.455 [INFO] ------------------------------------------------------------------------
[JENKINS] Archiving disabled
[JENKINS] Archiving disabled
[JENKINS] Archiving disabled
[JENKINS] Archiving disabled
[JENKINS] Archiving disabled
[JENKINS] Archiving disabled
[JENKINS] Archiving disabled
[JENKINS] Archiving disabled
[JENKINS] Archiving disabled
[JENKINS] Archiving disabled
[JENKINS] Archiving disabled
[JENKINS] Archiving disabled
[JENKINS] Archiving disabled
[JENKINS] Archiving disabled
[JENKINS] Archiving disabled
[JENKINS] Archiving disabled
[JENKINS] Archiving disabled
[JENKINS] Archiving disabled
[JENKINS] Archiving disabled
[JENKINS] Archiving disabled
[JENKINS] Archiving disabled
[JENKINS] Archiving disabled
[JENKINS] Archiving disabled
[JENKINS] Archiving disabled
[JENKINS] Archiving disabled
[JENKINS] Archiving disabled
[JENKINS] Archiving disabled
[JENKINS] Archiving disabled
[JENKINS] Archiving disabled
[JENKINS] Archiving disabled
[JENKINS] Archiving disabled
[JENKINS] Archiving disabled
[JENKINS] Archiving disabled
[JENKINS] Archiving disabled
[JENKINS] Archiving disabled
[JENKINS] Archiving disabled
[JENKINS] Archiving disabled
[JENKINS] Archiving disabled
[JENKINS] Archiving disabled
[JENKINS] Archiving disabled
[JENKINS] Archiving disabled
[JENKINS] Archiving disabled
2017-03-09T00:48:28.212 [INFO] ------------------------------------------------------------------------
2017-03-09T00:48:28.212 [INFO] Reactor Summary:
2017-03-09T00:48:28.212 [INFO] 
2017-03-09T00:48:28.212 [INFO] Apache Beam :: Parent .............................. SUCCESS
[01:18 min]
2017-03-09T00:48:28.212 [INFO] Apache Beam :: SDKs :: Java :: Build Tools ......... SUCCESS
[ 16.247 s]
2017-03-09T00:48:28.212 [INFO] Apache Beam :: SDKs ................................ SUCCESS
[ 21.553 s]
2017-03-09T00:48:28.212 [INFO] Apache Beam :: SDKs :: Common ...................... SUCCESS
[  6.663 s]
2017-03-09T00:48:28.212 [INFO] Apache Beam :: SDKs :: Common :: Fn API ............ FAILURE
[  6.086 s]
2017-03-09T00:48:28.213 [INFO] Apache Beam :: SDKs :: Common :: Runner API ........ SKIPPED
2017-03-09T00:48:28.213 [INFO] Apache Beam :: SDKs :: Java ........................ SKIPPED
2017-03-09T00:48:28.213 [INFO] Apache Beam :: SDKs :: Java :: Core ................ SKIPPED
2017-03-09T00:48:28.213 [INFO] Apache Beam :: Runners ............................. SKIPPED
2017-03-09T00:48:28.213 [INFO] Apache Beam :: Runners :: Core Java Construction ... SKIPPED
2017-03-09T00:48:28.213 [INFO] Apache Beam :: Runners :: Core Java ................ SKIPPED
2017-03-09T00:48:28.213 [INFO] Apache Beam :: Runners :: Direct Java .............. SKIPPED
2017-03-09T00:48:28.213 [INFO] Apache Beam :: SDKs :: Java :: IO .................. SKIPPED
2017-03-09T00:48:28.213 [INFO] Apache Beam :: SDKs :: Java :: IO :: Elasticsearch . SKIPPED
2017-03-09T00:48:28.213 [INFO] Apache Beam :: Runners :: Google Cloud Dataflow .... SKIPPED
2017-03-09T00:48:28.213 [INFO] Apache Beam :: SDKs :: Java :: IO :: Google Cloud Platform
SKIPPED
2017-03-09T00:48:28.213 [INFO] Apache Beam :: SDKs :: Java :: IO :: Hadoop Common . SKIPPED
2017-03-09T00:48:28.213 [INFO] Apache Beam :: SDKs :: Java :: IO :: HBase ......... SKIPPED
2017-03-09T00:48:28.213 [INFO] Apache Beam :: SDKs :: Java :: IO :: HDFS .......... SKIPPED
2017-03-09T00:48:28.213 [INFO] Apache Beam :: SDKs :: Java :: IO :: JDBC .......... SKIPPED
2017-03-09T00:48:28.213 [INFO] Apache Beam :: SDKs :: Java :: IO :: JMS ........... SKIPPED
2017-03-09T00:48:28.213 [INFO] Apache Beam :: SDKs :: Java :: IO :: Kafka ......... SKIPPED
2017-03-09T00:48:28.213 [INFO] Apache Beam :: SDKs :: Java :: IO :: Kinesis ....... SKIPPED
2017-03-09T00:48:28.213 [INFO] Apache Beam :: SDKs :: Java :: IO :: MongoDB ....... SKIPPED
2017-03-09T00:48:28.213 [INFO] Apache Beam :: SDKs :: Java :: IO :: MQTT .......... SKIPPED
2017-03-09T00:48:28.213 [INFO] Apache Beam :: SDKs :: Java :: Maven Archetypes .... SKIPPED
2017-03-09T00:48:28.213 [INFO] Apache Beam :: SDKs :: Java :: Maven Archetypes :: Starter
SKIPPED
2017-03-09T00:48:28.213 [INFO] Apache Beam :: SDKs :: Java :: Maven Archetypes :: Examples
SKIPPED
2017-03-09T00:48:28.213 [INFO] Apache Beam :: SDKs :: Java :: Maven Archetypes :: Examples
- Java 8 SKIPPED
2017-03-09T00:48:28.213 [INFO] Apache Beam :: SDKs :: Java :: Extensions .......... SKIPPED
2017-03-09T00:48:28.213 [INFO] Apache Beam :: SDKs :: Java :: Extensions :: Jackson SKIPPED
2017-03-09T00:48:28.213 [INFO] Apache Beam :: SDKs :: Java :: Extensions :: Join library SKIPPED
2017-03-09T00:48:28.213 [INFO] Apache Beam :: SDKs :: Java :: Extensions :: Sorter  SKIPPED
2017-03-09T00:48:28.213 [INFO] Apache Beam :: SDKs :: Java :: Harness ............. SKIPPED
2017-03-09T00:48:28.213 [INFO] Apache Beam :: SDKs :: Java :: Java 8 Tests ........ SKIPPED
2017-03-09T00:48:28.213 [INFO] Apache Beam :: SDKs :: Python ...................... SKIPPED
2017-03-09T00:48:28.213 [INFO] Apache Beam :: Runners :: Flink .................... SKIPPED
2017-03-09T00:48:28.213 [INFO] Apache Beam :: Runners :: Flink :: Core ............ SKIPPED
2017-03-09T00:48:28.213 [INFO] Apache Beam :: Runners :: Flink :: Examples ........ SKIPPED
2017-03-09T00:48:28.213 [INFO] Apache Beam :: Runners :: Spark .................... SKIPPED
2017-03-09T00:48:28.213 [INFO] Apache Beam :: Runners :: Apex ..................... SKIPPED
2017-03-09T00:48:28.213 [INFO] Apache Beam :: Examples ............................ SKIPPED
2017-03-09T00:48:28.213 [INFO] Apache Beam :: Examples :: Java .................... SKIPPED
2017-03-09T00:48:28.213 [INFO] Apache Beam :: Examples :: Java 8 .................. SKIPPED
2017-03-09T00:48:28.213 [INFO] Apache Beam :: SDKs :: Java :: Aggregated Javadoc .. SKIPPED
2017-03-09T00:48:28.213 [INFO] ------------------------------------------------------------------------
2017-03-09T00:48:28.214 [INFO] BUILD FAILURE
2017-03-09T00:48:28.214 [INFO] ------------------------------------------------------------------------
2017-03-09T00:48:28.214 [INFO] Total time: 03:53 min
2017-03-09T00:48:28.214 [INFO] Finished at: 2017-03-09T00:48:28+00:00
2017-03-09T00:48:28.570 [INFO] Final Memory: 83M/939M
2017-03-09T00:48:28.570 [INFO] ------------------------------------------------------------------------
Waiting for Jenkins to finish collecting data
2017-03-09T00:48:30.277 [ERROR] Failed to execute goal org.xolstice.maven.plugins:protobuf-maven-plugin:0.5.0:compile
(default) on project beam-sdks-common-fn-api: Could not transfer artifact com.google.protobuf:protoc:exe:linux-x86_64:3.1.0
from/to central (https://repo.maven.apache.org/maven2): <https://builds.apache.org/job/beam_PostCommit_Java_MavenInstall/ws/.repository/com/google/protobuf/protoc/3.1.0/protoc-3.1.0-linux-x86_64.exe.part>
(No such file or directory)
2017-03-09T00:48:30.277 [ERROR] com.google.protobuf:protoc:exe:3.1.0
2017-03-09T00:48:30.277 [ERROR] 
2017-03-09T00:48:30.277 [ERROR] from the specified remote repositories:
2017-03-09T00:48:30.277 [ERROR] Nexus (http://repository.apache.org/snapshots, releases=false,
snapshots=true),
2017-03-09T00:48:30.277 [ERROR] central (https://repo.maven.apache.org/maven2, releases=true,
snapshots=false)
2017-03-09T00:48:30.277 [ERROR] Path to dependency:
2017-03-09T00:48:30.277 [ERROR] 1) org.apache.beam:beam-sdks-common-fn-api:jar:0.7.0-SNAPSHOT
2017-03-09T00:48:30.277 [ERROR] 2) com.google.protobuf:protoc:exe:linux-x86_64:3.1.0
2017-03-09T00:48:30.277 [ERROR] -> [Help 1]
org.apache.maven.lifecycle.LifecycleExecutionException: Failed to execute goal org.xolstice.maven.plugins:protobuf-maven-plugin:0.5.0:compile
(default) on project beam-sdks-common-fn-api: Could not transfer artifact com.google.protobuf:protoc:exe:linux-x86_64:3.1.0
from/to central (https://repo.maven.apache.org/maven2): <https://builds.apache.org/job/beam_PostCommit_Java_MavenInstall/ws/.repository/com/google/protobuf/protoc/3.1.0/protoc-3.1.0-linux-x86_64.exe.part>
(No such file or directory)
  com.google.protobuf:protoc:exe:3.1.0

from the specified remote repositories:
  Nexus (http://repository.apache.org/snapshots, releases=false, snapshots=true),
  central (https://repo.maven.apache.org/maven2, releases=true, snapshots=false)
Path to dependency: 
	1) org.apache.beam:beam-sdks-common-fn-api:jar:0.7.0-SNAPSHOT
	2) com.google.protobuf:protoc:exe:linux-x86_64:3.1.0


	at org.apache.maven.lifecycle.internal.MojoExecutor.execute(MojoExecutor.java:216)
	at org.apache.maven.lifecycle.internal.MojoExecutor.execute(MojoExecutor.java:153)
	at org.apache.maven.lifecycle.internal.MojoExecutor.execute(MojoExecutor.java:145)
	at org.apache.maven.lifecycle.internal.LifecycleModuleBuilder.buildProject(LifecycleModuleBuilder.java:116)
	at org.apache.maven.lifecycle.internal.LifecycleModuleBuilder.buildProject(LifecycleModuleBuilder.java:80)
	at org.apache.maven.lifecycle.internal.builder.singlethreaded.SingleThreadedBuilder.build(SingleThreadedBuilder.java:51)
	at org.apache.maven.lifecycle.internal.LifecycleStarter.execute(LifecycleStarter.java:128)
	at org.apache.maven.DefaultMaven.doExecute(DefaultMaven.java:307)
	at org.apache.maven.DefaultMaven.doExecute(DefaultMaven.java:193)
	at org.apache.maven.DefaultMaven.execute(DefaultMaven.java:106)
	at org.jvnet.hudson.maven3.launcher.Maven33Launcher.main(Maven33Launcher.java:129)
	at sun.reflect.NativeMethodAccessorImpl.invoke0(Native Method)
	at sun.reflect.NativeMethodAccessorImpl.invoke(NativeMethodAccessorImpl.java:62)
	at sun.reflect.DelegatingMethodAccessorImpl.invoke(DelegatingMethodAccessorImpl.java:43)
	at java.lang.reflect.Method.invoke(Method.java:498)
	at org.codehaus.plexus.classworlds.launcher.Launcher.launchStandard(Launcher.java:330)
	at org.codehaus.plexus.classworlds.launcher.Launcher.launch(Launcher.java:238)
	at jenkins.maven3.agent.Maven33Main.launch(Maven33Main.java:176)
	at sun.reflect.NativeMethodAccessorImpl.invoke0(Native Method)
	at sun.reflect.NativeMethodAccessorImpl.invoke(NativeMethodAccessorImpl.java:62)
	at sun.reflect.DelegatingMethodAccessorImpl.invoke(DelegatingMethodAccessorImpl.java:43)
	at java.lang.reflect.Method.invoke(Method.java:498)
	at hudson.maven.Maven3Builder.call(Maven3Builder.java:139)
	at hudson.maven.Maven3Builder.call(Maven3Builder.java:70)
	at hudson.remoting.UserRequest.perform(UserRequest.java:153)
	at hudson.remoting.UserRequest.perform(UserRequest.java:50)
	at hudson.remoting.Request$2.run(Request.java:336)
	at hudson.remoting.InterceptingExecutorService$1.call(InterceptingExecutorService.java:68)
	at java.util.concurrent.FutureTask.run(FutureTask.java:266)
	at java.util.concurrent.ThreadPoolExecutor.runWorker(ThreadPoolExecutor.java:1142)
	at java.util.concurrent.ThreadPoolExecutor$Worker.run(ThreadPoolExecutor.java:617)
	at java.lang.Thread.run(Thread.java:745)
Caused by: org.apache.maven.plugin.MojoExecutionException: Could not transfer artifact com.google.protobuf:protoc:exe:linux-x86_64:3.1.0
from/to central (https://repo.maven.apache.org/maven2): <https://builds.apache.org/job/beam_PostCommit_Java_MavenInstall/ws/.repository/com/google/protobuf/protoc/3.1.0/protoc-3.1.0-linux-x86_64.exe.part>
(No such file or directory)
  com.google.protobuf:protoc:exe:3.1.0

from the specified remote repositories:
  Nexus (http://repository.apache.org/snapshots, releases=false, snapshots=true),
  central (https://repo.maven.apache.org/maven2, releases=true, snapshots=false)
Path to dependency: 
	1) org.apache.beam:beam-sdks-common-fn-api:jar:0.7.0-SNAPSHOT
	2) com.google.protobuf:protoc:exe:linux-x86_64:3.1.0


	at org.xolstice.maven.plugin.protobuf.AbstractProtocMojo.resolveBinaryArtifact(AbstractProtocMojo.java:962)
	at org.xolstice.maven.plugin.protobuf.AbstractProtocMojo.execute(AbstractProtocMojo.java:489)
	at org.xolstice.maven.plugin.protobuf.AbstractProtocCompileMojo.execute(AbstractProtocCompileMojo.java:31)
	at org.apache.maven.plugin.DefaultBuildPluginManager.executeMojo(DefaultBuildPluginManager.java:134)
	at org.apache.maven.lifecycle.internal.MojoExecutor.execute(MojoExecutor.java:208)
	... 31 more
Caused by: org.apache.maven.artifact.resolver.ArtifactResolutionException: Could not transfer
artifact com.google.protobuf:protoc:exe:linux-x86_64:3.1.0 from/to central (https://repo.maven.apache.org/maven2):
<https://builds.apache.org/job/beam_PostCommit_Java_MavenInstall/ws/.repository/com/google/protobuf/protoc/3.1.0/protoc-3.1.0-linux-x86_64.exe.part>
(No such file or directory)
  com.google.protobuf:protoc:exe:3.1.0

from the specified remote repositories:
  Nexus (http://repository.apache.org/snapshots, releases=false, snapshots=true),
  central (https://repo.maven.apache.org/maven2, releases=true, snapshots=false)
Path to dependency: 
	1) org.apache.beam:beam-sdks-common-fn-api:jar:0.7.0-SNAPSHOT
	2) com.google.protobuf:protoc:exe:linux-x86_64:3.1.0


	at org.apache.maven.artifact.resolver.DefaultArtifactResolver.resolve(DefaultArtifactResolver.java:222)
	at org.apache.maven.artifact.resolver.DefaultArtifactResolver.access$000(DefaultArtifactResolver.java:74)
	at org.apache.maven.artifact.resolver.DefaultArtifactResolver$ResolveTask.run(DefaultArtifactResolver.java:602)
	... 3 more
Caused by: org.eclipse.aether.resolution.ArtifactResolutionException: Could not transfer artifact
com.google.protobuf:protoc:exe:linux-x86_64:3.1.0 from/to central (https://repo.maven.apache.org/maven2):
<https://builds.apache.org/job/beam_PostCommit_Java_MavenInstall/ws/.repository/com/google/protobuf/protoc/3.1.0/protoc-3.1.0-linux-x86_64.exe.part>
(No such file or directory)
	at org.eclipse.aether.internal.impl.DefaultArtifactResolver.resolve(DefaultArtifactResolver.java:444)
	at org.eclipse.aether.internal.impl.DefaultArtifactResolver.resolveArtifacts(DefaultArtifactResolver.java:246)
	at org.eclipse.aether.internal.impl.DefaultArtifactResolver.resolveArtifact(DefaultArtifactResolver.java:223)
	at org.eclipse.aether.internal.impl.DefaultRepositorySystem.resolveArtifact(DefaultRepositorySystem.java:294)
	at org.apache.maven.artifact.resolver.DefaultArtifactResolver.resolve(DefaultArtifactResolver.java:212)
	... 5 more
Caused by: org.eclipse.aether.transfer.ArtifactTransferException: Could not transfer artifact
com.google.protobuf:protoc:exe:linux-x86_64:3.1.0 from/to central (https://repo.maven.apache.org/maven2):
<https://builds.apache.org/job/beam_PostCommit_Java_MavenInstall/ws/.repository/com/google/protobuf/protoc/3.1.0/protoc-3.1.0-linux-x86_64.exe.part>
(No such file or directory)
	at org.eclipse.aether.connector.basic.ArtifactTransportListener.transferFailed(ArtifactTransportListener.java:43)
	at org.eclipse.aether.connector.basic.BasicRepositoryConnector$TaskRunner.run(BasicRepositoryConnector.java:355)
	at org.eclipse.aether.util.concurrency.RunnableErrorForwarder$1.run(RunnableErrorForwarder.java:67)
	at org.eclipse.aether.connector.basic.BasicRepositoryConnector$DirectExecutor.execute(BasicRepositoryConnector.java:581)
	at org.eclipse.aether.connector.basic.BasicRepositoryConnector.get(BasicRepositoryConnector.java:249)
	at org.eclipse.aether.internal.impl.DefaultArtifactResolver.performDownloads(DefaultArtifactResolver.java:520)
	at org.eclipse.aether.internal.impl.DefaultArtifactResolver.resolve(DefaultArtifactResolver.java:421)
	... 9 more
Caused by: java.io.FileNotFoundException: <https://builds.apache.org/job/beam_PostCommit_Java_MavenInstall/ws/.repository/com/google/protobuf/protoc/3.1.0/protoc-3.1.0-linux-x86_64.exe.part>
(No such file or directory)
	at java.io.FileOutputStream.open0(Native Method)
	at java.io.FileOutputStream.open(FileOutputStream.java:270)
	at java.io.FileOutputStream.<init>(FileOutputStream.java:213)
	at java.io.FileOutputStream.<init>(FileOutputStream.java:162)
	at org.eclipse.aether.transport.wagon.WagonTransporter$GetTaskRunner.run(WagonTransporter.java:568)
	at org.eclipse.aether.transport.wagon.WagonTransporter.execute(WagonTransporter.java:427)
	at org.eclipse.aether.transport.wagon.WagonTransporter.get(WagonTransporter.java:404)
	at org.eclipse.aether.connector.basic.BasicRepositoryConnector$GetTaskRunner.runTask(BasicRepositoryConnector.java:447)
	at org.eclipse.aether.connector.basic.BasicRepositoryConnector$TaskRunner.run(BasicRepositoryConnector.java:350)
	... 14 more
2017-03-09T00:48:30.279 [ERROR] 
2017-03-09T00:48:30.279 [ERROR] Re-run Maven using the -X switch to enable full debug logging.
2017-03-09T00:48:30.279 [ERROR] 
2017-03-09T00:48:30.279 [ERROR] For more information about the errors and possible solutions,
please read the following articles:
2017-03-09T00:48:30.279 [ERROR] [Help 1] http://cwiki.apache.org/confluence/display/MAVEN/MojoExecutionException
2017-03-09T00:48:30.279 [ERROR] 
2017-03-09T00:48:30.279 [ERROR] After correcting the problems, you can resume the build with
the command
2017-03-09T00:48:30.279 [ERROR]   mvn <goals> -rf :beam-sdks-common-fn-api
channel stopped

Mime
View raw message