beam-commits mailing list archives

Site index · List index
Message view « Date » · « Thread »
Top « Date » · « Thread »
From Apache Jenkins Server <jenk...@builds.apache.org>
Subject Build failed in Jenkins: beam_PostCommit_Java_RunnableOnService_Gearpump #161
Date Fri, 10 Mar 2017 10:16:22 GMT
See <https://builds.apache.org/job/beam_PostCommit_Java_RunnableOnService_Gearpump/161/display/redirect>

------------------------------------------
GitHub pull request #2109 of commit 3c802bac098849c6f9c91dfbada887e25e302b3b, no merge conflicts.
Setting status of 3c802bac098849c6f9c91dfbada887e25e302b3b to PENDING with url https://builds.apache.org/job/beam_PostCommit_Java_RunnableOnService_Gearpump/161/
and message: 'Build started sha1 is merged.'
Using context: Jenkins: Apache Gearpump Runner RunnableOnService Tests
[EnvInject] - Loading node environment variables.
Building remotely on beam6 (beam) in workspace <https://builds.apache.org/job/beam_PostCommit_Java_RunnableOnService_Gearpump/ws/>
Cloning the remote Git repository
Cloning repository https://github.com/apache/beam.git
 > git init <https://builds.apache.org/job/beam_PostCommit_Java_RunnableOnService_Gearpump/ws/>
# timeout=10
Fetching upstream changes from https://github.com/apache/beam.git
 > git --version # timeout=10
 > git fetch --tags --progress https://github.com/apache/beam.git +refs/heads/*:refs/remotes/origin/*
 > git config remote.origin.url https://github.com/apache/beam.git # timeout=10
 > git config --add remote.origin.fetch +refs/heads/*:refs/remotes/origin/* # timeout=10
 > git config remote.origin.url https://github.com/apache/beam.git # timeout=10
Fetching upstream changes from https://github.com/apache/beam.git
 > git fetch --tags --progress https://github.com/apache/beam.git +refs/heads/*:refs/remotes/origin/*
+refs/pull/*:refs/remotes/origin/pr/*
 > git rev-parse refs/remotes/origin/pr/2109/merge^{commit} # timeout=10
 > git rev-parse refs/remotes/origin/origin/pr/2109/merge^{commit} # timeout=10
Checking out Revision 19e26f0b87c3c5bb4c33121f234cb5bb12b65d31 (refs/remotes/origin/pr/2109/merge)
 > git config core.sparsecheckout # timeout=10
 > git checkout -f 19e26f0b87c3c5bb4c33121f234cb5bb12b65d31
First time build. Skipping changelog.
Cleaning workspace
 > git rev-parse --verify HEAD # timeout=10
Resetting working tree
 > git reset --hard # timeout=10
 > git clean -fdx # timeout=10
[EnvInject] - Executing scripts and injecting environment variables after the SCM step.
[EnvInject] - Injecting as environment variables the properties content 
SPARK_LOCAL_IP=127.0.0.1

[EnvInject] - Variables injected successfully.
Parsing POMs
Downloaded artifact http://repo.maven.apache.org/maven2/org/apache/apache/18/apache-18.pom
Discovered a new module org.apache.beam:beam-sdks-common-parent Apache Beam :: SDKs :: Common
Discovered a new module org.apache.beam:beam-sdks-common-fn-api Apache Beam :: SDKs :: Common
:: Fn API
Discovered a new module org.apache.beam:beam-sdks-common-runner-api Apache Beam :: SDKs ::
Common :: Runner API
Discovered a new module org.apache.beam:beam-sdks-java-io-elasticsearch Apache Beam :: SDKs
:: Java :: IO :: Elasticsearch
Discovered a new module org.apache.beam:beam-sdks-java-io-hadoop-common Apache Beam :: SDKs
:: Java :: IO :: Hadoop Common
Discovered a new module org.apache.beam:beam-sdks-java-io-hbase Apache Beam :: SDKs :: Java
:: IO :: HBase
Discovered a new module org.apache.beam:beam-sdks-java-io-mqtt Apache Beam :: SDKs :: Java
:: IO :: MQTT
Discovered a new module org.apache.beam:beam-sdks-java-extensions-json-jackson Apache Beam
:: SDKs :: Java :: Extensions :: Jackson
Discovered a new module org.apache.beam:beam-sdks-python Apache Beam :: SDKs :: Python
Discovered a new module org.apache.beam:beam-runners-core-construction-java Apache Beam ::
Runners :: Core Java Construction
Discovered a new module org.apache.beam:beam-sdks-java-javadoc Apache Beam :: SDKs :: Java
:: Aggregated Javadoc
Modules changed, recalculating dependency graph
Established TCP socket on 39807
maven33-agent.jar already up to date
maven33-interceptor.jar already up to date
maven3-interceptor-commons.jar already up to date
[beam_PostCommit_Java_RunnableOnService_Gearpump] $ /home/jenkins/tools/java/latest1.8/bin/java
-Dorg.slf4j.simpleLogger.showDateTime=true -Dorg.slf4j.simpleLogger.dateTimeFormat=yyyy-MM-dd'T'HH:mm:ss.SSS
-XX:+TieredCompilation -XX:TieredStopAtLevel=1 -cp /home/jenkins/jenkins-slave/maven33-agent.jar:/home/jenkins/tools/maven/apache-maven-3.3.3/boot/plexus-classworlds-2.5.2.jar:/home/jenkins/tools/maven/apache-maven-3.3.3/conf/logging
jenkins.maven3.agent.Maven33Main /home/jenkins/tools/maven/apache-maven-3.3.3 /home/jenkins/jenkins-slave/slave.jar
/home/jenkins/jenkins-slave/maven33-interceptor.jar /home/jenkins/jenkins-slave/maven3-interceptor-commons.jar
39807
<===[JENKINS REMOTING CAPACITY]===>   channel started
Executing Maven:  -B -f <https://builds.apache.org/job/beam_PostCommit_Java_RunnableOnService_Gearpump/ws/pom.xml>
-Dmaven.repo.local=<https://builds.apache.org/job/beam_PostCommit_Java_RunnableOnService_Gearpump/ws/.repository>
-B -e clean verify -am -pl runners/gearpump -DforkCount=0 -DrunnableOnServicePipelineOptions=[
"--runner=TestGearpumpRunner", "--streaming=false" ]
2017-03-10T10:16:10.513 [INFO] Error stacktraces are turned on.
2017-03-10T10:16:10.572 [INFO] Scanning for projects...
2017-03-10T10:16:11.160 [INFO] Downloading: https://repo.maven.apache.org/maven2/kr/motd/maven/os-maven-plugin/1.4.0.Final/os-maven-plugin-1.4.0.Final.pom
2017-03-10T10:16:11.518 [INFO] Downloaded: https://repo.maven.apache.org/maven2/kr/motd/maven/os-maven-plugin/1.4.0.Final/os-maven-plugin-1.4.0.Final.pom
(7 KB at 16.7 KB/sec)
2017-03-10T10:16:11.525 [INFO] Downloading: https://repo.maven.apache.org/maven2/org/sonatype/oss/oss-parent/9/oss-parent-9.pom
2017-03-10T10:16:11.554 [INFO] Downloaded: https://repo.maven.apache.org/maven2/org/sonatype/oss/oss-parent/9/oss-parent-9.pom
(7 KB at 221.2 KB/sec)
2017-03-10T10:16:11.562 [INFO] Downloading: https://repo.maven.apache.org/maven2/org/apache/maven/maven-plugin-api/3.2.1/maven-plugin-api-3.2.1.pom
2017-03-10T10:16:11.591 [INFO] Downloaded: https://repo.maven.apache.org/maven2/org/apache/maven/maven-plugin-api/3.2.1/maven-plugin-api-3.2.1.pom
(4 KB at 113.9 KB/sec)
2017-03-10T10:16:11.593 [INFO] Downloading: https://repo.maven.apache.org/maven2/org/apache/maven/maven/3.2.1/maven-3.2.1.pom
2017-03-10T10:16:11.632 [INFO] Downloaded: https://repo.maven.apache.org/maven2/org/apache/maven/maven/3.2.1/maven-3.2.1.pom
(23 KB at 565.6 KB/sec)
2017-03-10T10:16:11.634 [INFO] Downloading: https://repo.maven.apache.org/maven2/org/apache/maven/maven-parent/23/maven-parent-23.pom
2017-03-10T10:16:11.666 [INFO] Downloaded: https://repo.maven.apache.org/maven2/org/apache/maven/maven-parent/23/maven-parent-23.pom
(32 KB at 994.4 KB/sec)
2017-03-10T10:16:11.669 [INFO] Downloading: https://repo.maven.apache.org/maven2/org/apache/apache/13/apache-13.pom
2017-03-10T10:16:11.696 [INFO] Downloaded: https://repo.maven.apache.org/maven2/org/apache/apache/13/apache-13.pom
(14 KB at 505.4 KB/sec)
2017-03-10T10:16:11.702 [INFO] Downloading: https://repo.maven.apache.org/maven2/org/apache/maven/maven-model/3.2.1/maven-model-3.2.1.pom
2017-03-10T10:16:11.729 [INFO] Downloaded: https://repo.maven.apache.org/maven2/org/apache/maven/maven-model/3.2.1/maven-model-3.2.1.pom
(5 KB at 149.8 KB/sec)
2017-03-10T10:16:11.732 [INFO] Downloading: https://repo.maven.apache.org/maven2/org/codehaus/plexus/plexus-utils/3.0.17/plexus-utils-3.0.17.pom
2017-03-10T10:16:11.759 [INFO] Downloaded: https://repo.maven.apache.org/maven2/org/codehaus/plexus/plexus-utils/3.0.17/plexus-utils-3.0.17.pom
(4 KB at 122.8 KB/sec)
2017-03-10T10:16:11.760 [INFO] Downloading: https://repo.maven.apache.org/maven2/org/codehaus/plexus/plexus/3.3.1/plexus-3.3.1.pom
2017-03-10T10:16:11.788 [INFO] Downloaded: https://repo.maven.apache.org/maven2/org/codehaus/plexus/plexus/3.3.1/plexus-3.3.1.pom
(20 KB at 713.1 KB/sec)
2017-03-10T10:16:11.790 [INFO] Downloading: https://repo.maven.apache.org/maven2/org/sonatype/spice/spice-parent/17/spice-parent-17.pom
2017-03-10T10:16:11.817 [INFO] Downloaded: https://repo.maven.apache.org/maven2/org/sonatype/spice/spice-parent/17/spice-parent-17.pom
(7 KB at 244.5 KB/sec)
2017-03-10T10:16:11.818 [INFO] Downloading: https://repo.maven.apache.org/maven2/org/sonatype/forge/forge-parent/10/forge-parent-10.pom
2017-03-10T10:16:11.846 [INFO] Downloaded: https://repo.maven.apache.org/maven2/org/sonatype/forge/forge-parent/10/forge-parent-10.pom
(14 KB at 490.5 KB/sec)
2017-03-10T10:16:11.848 [INFO] Downloading: https://repo.maven.apache.org/maven2/org/apache/maven/maven-artifact/3.2.1/maven-artifact-3.2.1.pom
2017-03-10T10:16:11.875 [INFO] Downloaded: https://repo.maven.apache.org/maven2/org/apache/maven/maven-artifact/3.2.1/maven-artifact-3.2.1.pom
(2 KB at 71.3 KB/sec)
2017-03-10T10:16:11.879 [INFO] Downloading: https://repo.maven.apache.org/maven2/org/eclipse/sisu/org.eclipse.sisu.plexus/0.0.0.M5/org.eclipse.sisu.plexus-0.0.0.M5.pom
2017-03-10T10:16:11.906 [INFO] Downloaded: https://repo.maven.apache.org/maven2/org/eclipse/sisu/org.eclipse.sisu.plexus/0.0.0.M5/org.eclipse.sisu.plexus-0.0.0.M5.pom
(5 KB at 174.7 KB/sec)
2017-03-10T10:16:11.907 [INFO] Downloading: https://repo.maven.apache.org/maven2/org/eclipse/sisu/sisu-plexus/0.0.0.M5/sisu-plexus-0.0.0.M5.pom
2017-03-10T10:16:11.936 [INFO] Downloaded: https://repo.maven.apache.org/maven2/org/eclipse/sisu/sisu-plexus/0.0.0.M5/sisu-plexus-0.0.0.M5.pom
(13 KB at 444.6 KB/sec)
2017-03-10T10:16:11.938 [INFO] Downloading: https://repo.maven.apache.org/maven2/org/sonatype/oss/oss-parent/7/oss-parent-7.pom
2017-03-10T10:16:11.964 [INFO] Downloaded: https://repo.maven.apache.org/maven2/org/sonatype/oss/oss-parent/7/oss-parent-7.pom
(5 KB at 181.2 KB/sec)
2017-03-10T10:16:11.967 [INFO] Downloading: https://repo.maven.apache.org/maven2/javax/enterprise/cdi-api/1.0/cdi-api-1.0.pom
2017-03-10T10:16:11.993 [INFO] Downloaded: https://repo.maven.apache.org/maven2/javax/enterprise/cdi-api/1.0/cdi-api-1.0.pom
(2 KB at 53.9 KB/sec)
2017-03-10T10:16:11.995 [INFO] Downloading: https://repo.maven.apache.org/maven2/org/jboss/weld/weld-api-parent/1.0/weld-api-parent-1.0.pom
2017-03-10T10:16:12.022 [INFO] Downloaded: https://repo.maven.apache.org/maven2/org/jboss/weld/weld-api-parent/1.0/weld-api-parent-1.0.pom
(3 KB at 88.5 KB/sec)
2017-03-10T10:16:12.023 [INFO] Downloading: https://repo.maven.apache.org/maven2/org/jboss/weld/weld-api-bom/1.0/weld-api-bom-1.0.pom
2017-03-10T10:16:12.051 [INFO] Downloaded: https://repo.maven.apache.org/maven2/org/jboss/weld/weld-api-bom/1.0/weld-api-bom-1.0.pom
(8 KB at 286.0 KB/sec)
2017-03-10T10:16:12.052 [INFO] Downloading: https://repo.maven.apache.org/maven2/org/jboss/weld/weld-parent/6/weld-parent-6.pom
2017-03-10T10:16:12.081 [INFO] Downloaded: https://repo.maven.apache.org/maven2/org/jboss/weld/weld-parent/6/weld-parent-6.pom
(21 KB at 696.8 KB/sec)
2017-03-10T10:16:12.085 [INFO] Downloading: https://repo.maven.apache.org/maven2/javax/annotation/jsr250-api/1.0/jsr250-api-1.0.pom
2017-03-10T10:16:12.111 [INFO] Downloaded: https://repo.maven.apache.org/maven2/javax/annotation/jsr250-api/1.0/jsr250-api-1.0.pom
(1023 B at 38.4 KB/sec)
2017-03-10T10:16:12.113 [INFO] Downloading: https://repo.maven.apache.org/maven2/javax/inject/javax.inject/1/javax.inject-1.pom
2017-03-10T10:16:12.138 [INFO] Downloaded: https://repo.maven.apache.org/maven2/javax/inject/javax.inject/1/javax.inject-1.pom
(612 B at 23.9 KB/sec)
2017-03-10T10:16:12.140 [INFO] Downloading: https://repo.maven.apache.org/maven2/com/google/guava/guava/10.0.1/guava-10.0.1.pom
2017-03-10T10:16:12.167 [INFO] Downloaded: https://repo.maven.apache.org/maven2/com/google/guava/guava/10.0.1/guava-10.0.1.pom
(6 KB at 194.8 KB/sec)
2017-03-10T10:16:12.168 [INFO] Downloading: https://repo.maven.apache.org/maven2/com/google/guava/guava-parent/10.0.1/guava-parent-10.0.1.pom
2017-03-10T10:16:12.194 [INFO] Downloaded: https://repo.maven.apache.org/maven2/com/google/guava/guava-parent/10.0.1/guava-parent-10.0.1.pom
(2 KB at 73.6 KB/sec)
2017-03-10T10:16:12.197 [INFO] Downloading: https://repo.maven.apache.org/maven2/com/google/code/findbugs/jsr305/1.3.9/jsr305-1.3.9.pom
2017-03-10T10:16:12.222 [INFO] Downloaded: https://repo.maven.apache.org/maven2/com/google/code/findbugs/jsr305/1.3.9/jsr305-1.3.9.pom
(965 B at 37.7 KB/sec)
2017-03-10T10:16:12.224 [INFO] Downloading: https://repo.maven.apache.org/maven2/org/sonatype/sisu/sisu-guice/3.1.0/sisu-guice-3.1.0.pom
2017-03-10T10:16:12.250 [INFO] Downloaded: https://repo.maven.apache.org/maven2/org/sonatype/sisu/sisu-guice/3.1.0/sisu-guice-3.1.0.pom
(10 KB at 381.2 KB/sec)
2017-03-10T10:16:12.252 [INFO] Downloading: https://repo.maven.apache.org/maven2/org/sonatype/sisu/inject/guice-parent/3.1.0/guice-parent-3.1.0.pom
2017-03-10T10:16:12.279 [INFO] Downloaded: https://repo.maven.apache.org/maven2/org/sonatype/sisu/inject/guice-parent/3.1.0/guice-parent-3.1.0.pom
(11 KB at 395.2 KB/sec)
2017-03-10T10:16:12.283 [INFO] Downloading: https://repo.maven.apache.org/maven2/aopalliance/aopalliance/1.0/aopalliance-1.0.pom
2017-03-10T10:16:12.308 [INFO] Downloaded: https://repo.maven.apache.org/maven2/aopalliance/aopalliance/1.0/aopalliance-1.0.pom
(363 B at 14.2 KB/sec)
2017-03-10T10:16:12.309 [INFO] Downloading: https://repo.maven.apache.org/maven2/org/eclipse/sisu/org.eclipse.sisu.inject/0.0.0.M5/org.eclipse.sisu.inject-0.0.0.M5.pom
2017-03-10T10:16:12.336 [INFO] Downloaded: https://repo.maven.apache.org/maven2/org/eclipse/sisu/org.eclipse.sisu.inject/0.0.0.M5/org.eclipse.sisu.inject-0.0.0.M5.pom
(3 KB at 91.1 KB/sec)
2017-03-10T10:16:12.337 [INFO] Downloading: https://repo.maven.apache.org/maven2/org/eclipse/sisu/sisu-inject/0.0.0.M5/sisu-inject-0.0.0.M5.pom
2017-03-10T10:16:12.365 [INFO] Downloaded: https://repo.maven.apache.org/maven2/org/eclipse/sisu/sisu-inject/0.0.0.M5/sisu-inject-0.0.0.M5.pom
(14 KB at 488.1 KB/sec)
2017-03-10T10:16:12.367 [INFO] Downloading: https://repo.maven.apache.org/maven2/org/codehaus/plexus/plexus-component-annotations/1.5.5/plexus-component-annotations-1.5.5.pom
2017-03-10T10:16:12.392 [INFO] Downloaded: https://repo.maven.apache.org/maven2/org/codehaus/plexus/plexus-component-annotations/1.5.5/plexus-component-annotations-1.5.5.pom
(815 B at 31.8 KB/sec)
2017-03-10T10:16:12.394 [INFO] Downloading: https://repo.maven.apache.org/maven2/org/codehaus/plexus/plexus-containers/1.5.5/plexus-containers-1.5.5.pom
2017-03-10T10:16:12.419 [INFO] Downloaded: https://repo.maven.apache.org/maven2/org/codehaus/plexus/plexus-containers/1.5.5/plexus-containers-1.5.5.pom
(5 KB at 165.6 KB/sec)
2017-03-10T10:16:12.420 [INFO] Downloading: https://repo.maven.apache.org/maven2/org/codehaus/plexus/plexus/2.0.7/plexus-2.0.7.pom
2017-03-10T10:16:12.449 [INFO] Downloaded: https://repo.maven.apache.org/maven2/org/codehaus/plexus/plexus/2.0.7/plexus-2.0.7.pom
(17 KB at 582.4 KB/sec)
2017-03-10T10:16:12.452 [INFO] Downloading: https://repo.maven.apache.org/maven2/org/codehaus/plexus/plexus-classworlds/2.4/plexus-classworlds-2.4.pom
2017-03-10T10:16:12.480 [INFO] Downloaded: https://repo.maven.apache.org/maven2/org/codehaus/plexus/plexus-classworlds/2.4/plexus-classworlds-2.4.pom
(4 KB at 135.4 KB/sec)
2017-03-10T10:16:12.484 [INFO] Downloading: https://repo.maven.apache.org/maven2/org/codehaus/plexus/plexus-utils/2.1/plexus-utils-2.1.pom
2017-03-10T10:16:12.511 [INFO] Downloaded: https://repo.maven.apache.org/maven2/org/codehaus/plexus/plexus-utils/2.1/plexus-utils-2.1.pom
(4 KB at 145.9 KB/sec)
2017-03-10T10:16:12.513 [INFO] Downloading: https://repo.maven.apache.org/maven2/org/sonatype/spice/spice-parent/16/spice-parent-16.pom
2017-03-10T10:16:12.541 [INFO] Downloaded: https://repo.maven.apache.org/maven2/org/sonatype/spice/spice-parent/16/spice-parent-16.pom
(9 KB at 291.5 KB/sec)
2017-03-10T10:16:12.543 [INFO] Downloading: https://repo.maven.apache.org/maven2/org/sonatype/forge/forge-parent/5/forge-parent-5.pom
2017-03-10T10:16:12.571 [INFO] Downloaded: https://repo.maven.apache.org/maven2/org/sonatype/forge/forge-parent/5/forge-parent-5.pom
(9 KB at 302.5 KB/sec)
2017-03-10T10:16:12.586 [INFO] Downloading: https://repo.maven.apache.org/maven2/kr/motd/maven/os-maven-plugin/1.4.0.Final/os-maven-plugin-1.4.0.Final.jar
2017-03-10T10:16:12.593 [INFO] Downloading: https://repo.maven.apache.org/maven2/org/apache/maven/maven-plugin-api/3.2.1/maven-plugin-api-3.2.1.jar
2017-03-10T10:16:12.593 [INFO] Downloading: https://repo.maven.apache.org/maven2/org/apache/maven/maven-model/3.2.1/maven-model-3.2.1.jar
2017-03-10T10:16:12.594 [INFO] Downloading: https://repo.maven.apache.org/maven2/org/apache/maven/maven-artifact/3.2.1/maven-artifact-3.2.1.jar
2017-03-10T10:16:12.596 [INFO] Downloading: https://repo.maven.apache.org/maven2/org/eclipse/sisu/org.eclipse.sisu.plexus/0.0.0.M5/org.eclipse.sisu.plexus-0.0.0.M5.jar
2017-03-10T10:16:12.629 [INFO] Downloaded: https://repo.maven.apache.org/maven2/kr/motd/maven/os-maven-plugin/1.4.0.Final/os-maven-plugin-1.4.0.Final.jar
(29 KB at 651.8 KB/sec)
2017-03-10T10:16:12.629 [INFO] Downloading: https://repo.maven.apache.org/maven2/javax/enterprise/cdi-api/1.0/cdi-api-1.0.jar
2017-03-10T10:16:12.665 [INFO] Downloaded: https://repo.maven.apache.org/maven2/javax/enterprise/cdi-api/1.0/cdi-api-1.0.jar
(44 KB at 626.5 KB/sec)
2017-03-10T10:16:12.665 [INFO] Downloading: https://repo.maven.apache.org/maven2/javax/annotation/jsr250-api/1.0/jsr250-api-1.0.jar
2017-03-10T10:16:12.675 [INFO] Downloaded: https://repo.maven.apache.org/maven2/org/apache/maven/maven-artifact/3.2.1/maven-artifact-3.2.1.jar
(53 KB at 638.9 KB/sec)
2017-03-10T10:16:12.675 [INFO] Downloaded: https://repo.maven.apache.org/maven2/org/apache/maven/maven-plugin-api/3.2.1/maven-plugin-api-3.2.1.jar
(45 KB at 502.9 KB/sec)
2017-03-10T10:16:12.675 [INFO] Downloading: https://repo.maven.apache.org/maven2/javax/inject/javax.inject/1/javax.inject-1.jar
2017-03-10T10:16:12.675 [INFO] Downloading: https://repo.maven.apache.org/maven2/com/google/guava/guava/10.0.1/guava-10.0.1.jar
2017-03-10T10:16:12.688 [INFO] Downloaded: https://repo.maven.apache.org/maven2/org/apache/maven/maven-model/3.2.1/maven-model-3.2.1.jar
(157 KB at 1530.5 KB/sec)
2017-03-10T10:16:12.689 [INFO] Downloading: https://repo.maven.apache.org/maven2/com/google/code/findbugs/jsr305/1.3.9/jsr305-1.3.9.jar
2017-03-10T10:16:12.693 [INFO] Downloaded: https://repo.maven.apache.org/maven2/org/eclipse/sisu/org.eclipse.sisu.plexus/0.0.0.M5/org.eclipse.sisu.plexus-0.0.0.M5.jar
(192 KB at 1938.8 KB/sec)
2017-03-10T10:16:12.693 [INFO] Downloading: https://repo.maven.apache.org/maven2/org/sonatype/sisu/sisu-guice/3.1.0/sisu-guice-3.1.0-no_aop.jar
2017-03-10T10:16:12.693 [INFO] Downloaded: https://repo.maven.apache.org/maven2/javax/annotation/jsr250-api/1.0/jsr250-api-1.0.jar
(6 KB at 58.3 KB/sec)
2017-03-10T10:16:12.694 [INFO] Downloading: https://repo.maven.apache.org/maven2/aopalliance/aopalliance/1.0/aopalliance-1.0.jar
2017-03-10T10:16:12.704 [INFO] Downloaded: https://repo.maven.apache.org/maven2/javax/inject/javax.inject/1/javax.inject-1.jar
(3 KB at 22.6 KB/sec)
2017-03-10T10:16:12.704 [INFO] Downloading: https://repo.maven.apache.org/maven2/org/eclipse/sisu/org.eclipse.sisu.inject/0.0.0.M5/org.eclipse.sisu.inject-0.0.0.M5.jar
2017-03-10T10:16:12.720 [INFO] Downloaded: https://repo.maven.apache.org/maven2/aopalliance/aopalliance/1.0/aopalliance-1.0.jar
(5 KB at 34.9 KB/sec)
2017-03-10T10:16:12.720 [INFO] Downloading: https://repo.maven.apache.org/maven2/org/codehaus/plexus/plexus-component-annotations/1.5.5/plexus-component-annotations-1.5.5.jar
2017-03-10T10:16:12.721 [INFO] Downloaded: https://repo.maven.apache.org/maven2/com/google/code/findbugs/jsr305/1.3.9/jsr305-1.3.9.jar
(33 KB at 255.9 KB/sec)
2017-03-10T10:16:12.721 [INFO] Downloading: https://repo.maven.apache.org/maven2/org/codehaus/plexus/plexus-classworlds/2.4/plexus-classworlds-2.4.jar
2017-03-10T10:16:12.746 [INFO] Downloaded: https://repo.maven.apache.org/maven2/org/codehaus/plexus/plexus-component-annotations/1.5.5/plexus-component-annotations-1.5.5.jar
(5 KB at 27.2 KB/sec)
2017-03-10T10:16:12.746 [INFO] Downloading: https://repo.maven.apache.org/maven2/org/codehaus/plexus/plexus-utils/3.0.17/plexus-utils-3.0.17.jar
2017-03-10T10:16:12.753 [INFO] Downloaded: https://repo.maven.apache.org/maven2/org/codehaus/plexus/plexus-classworlds/2.4/plexus-classworlds-2.4.jar
(46 KB at 290.9 KB/sec)
2017-03-10T10:16:12.758 [INFO] Downloaded: https://repo.maven.apache.org/maven2/org/sonatype/sisu/sisu-guice/3.1.0/sisu-guice-3.1.0-no_aop.jar
(350 KB at 2141.4 KB/sec)
2017-03-10T10:16:12.759 [INFO] Downloaded: https://repo.maven.apache.org/maven2/org/eclipse/sisu/org.eclipse.sisu.inject/0.0.0.M5/org.eclipse.sisu.inject-0.0.0.M5.jar
(285 KB at 1735.2 KB/sec)
2017-03-10T10:16:12.794 [INFO] Downloaded: https://repo.maven.apache.org/maven2/org/codehaus/plexus/plexus-utils/3.0.17/plexus-utils-3.0.17.jar
(246 KB at 1235.6 KB/sec)
2017-03-10T10:16:12.835 [INFO] Downloaded: https://repo.maven.apache.org/maven2/com/google/guava/guava/10.0.1/guava-10.0.1.jar
(1467 KB at 6109.9 KB/sec)
2017-03-10T10:16:12.942 [INFO] Downloading: https://repo.maven.apache.org/maven2/org/apache/maven/archetype/archetype-packaging/2.4/archetype-packaging-2.4.pom
2017-03-10T10:16:12.970 [INFO] Downloaded: https://repo.maven.apache.org/maven2/org/apache/maven/archetype/archetype-packaging/2.4/archetype-packaging-2.4.pom
(2 KB at 54.7 KB/sec)
2017-03-10T10:16:12.972 [INFO] Downloading: https://repo.maven.apache.org/maven2/org/apache/maven/archetype/maven-archetype/2.4/maven-archetype-2.4.pom
2017-03-10T10:16:13.001 [INFO] Downloaded: https://repo.maven.apache.org/maven2/org/apache/maven/archetype/maven-archetype/2.4/maven-archetype-2.4.pom
(13 KB at 460.4 KB/sec)
2017-03-10T10:16:13.003 [INFO] Downloading: https://repo.maven.apache.org/maven2/org/apache/maven/maven-parent/26/maven-parent-26.pom
2017-03-10T10:16:13.034 [INFO] Downloaded: https://repo.maven.apache.org/maven2/org/apache/maven/maven-parent/26/maven-parent-26.pom
(39 KB at 1253.3 KB/sec)
2017-03-10T10:16:13.036 [INFO] Downloading: https://repo.maven.apache.org/maven2/org/apache/apache/16/apache-16.pom
2017-03-10T10:16:13.064 [INFO] Downloaded: https://repo.maven.apache.org/maven2/org/apache/apache/16/apache-16.pom
(16 KB at 537.0 KB/sec)
2017-03-10T10:16:13.068 [INFO] Downloading: https://repo.maven.apache.org/maven2/org/codehaus/plexus/plexus-utils/1.1/plexus-utils-1.1.jar
2017-03-10T10:16:13.068 [INFO] Downloading: https://repo.maven.apache.org/maven2/org/apache/maven/archetype/archetype-packaging/2.4/archetype-packaging-2.4.jar
2017-03-10T10:16:13.098 [INFO] Downloaded: https://repo.maven.apache.org/maven2/org/apache/maven/archetype/archetype-packaging/2.4/archetype-packaging-2.4.jar
(8 KB at 245.2 KB/sec)
2017-03-10T10:16:13.106 [INFO] Downloaded: https://repo.maven.apache.org/maven2/org/codehaus/plexus/plexus-utils/1.1/plexus-utils-1.1.jar
(165 KB at 4332.0 KB/sec)
2017-03-10T10:16:13.166 [WARNING] 
2017-03-10T10:16:13.166 [WARNING] Some problems were encountered while building the effective
model for org.apache.beam:beam-runners-google-cloud-dataflow-java:jar:0.7.0-SNAPSHOT
2017-03-10T10:16:13.166 [WARNING] 'dependencies.dependency.(groupId:artifactId:type:classifier)'
must be unique: org.apache.beam:beam-runners-core-construction-java:jar -> duplicate declaration
of version (?) @ org.apache.beam:beam-runners-google-cloud-dataflow-java:[unknown-version],
<https://builds.apache.org/job/beam_PostCommit_Java_RunnableOnService_Gearpump/ws/runners/google-cloud-dataflow-java/pom.xml,>
line 360, column 19
2017-03-10T10:16:13.166 [WARNING] 
2017-03-10T10:16:13.166 [WARNING] It is highly recommended to fix these problems because they
threaten the stability of your build.
2017-03-10T10:16:13.166 [WARNING] 
2017-03-10T10:16:13.166 [WARNING] For this reason, future Maven versions might no longer support
building such malformed projects.
2017-03-10T10:16:13.166 [WARNING] 
2017-03-10T10:16:13.189 [ERROR] [ERROR] Could not find the selected project in the reactor:
runners/gearpump @ 
2017-03-10T10:16:13.190 [ERROR] Could not find the selected project in the reactor: runners/gearpump
-> [Help 1]
org.apache.maven.MavenExecutionException: Could not find the selected project in the reactor:
runners/gearpump
	at org.apache.maven.graph.DefaultGraphBuilder.trimSelectedProjects(DefaultGraphBuilder.java:182)
	at org.apache.maven.graph.DefaultGraphBuilder.dependencyGraph(DefaultGraphBuilder.java:115)
	at org.apache.maven.graph.DefaultGraphBuilder.build(DefaultGraphBuilder.java:92)
	at org.apache.maven.DefaultMaven.buildGraph(DefaultMaven.java:491)
	at org.apache.maven.DefaultMaven.doExecute(DefaultMaven.java:219)
	at org.apache.maven.DefaultMaven.doExecute(DefaultMaven.java:193)
	at org.apache.maven.DefaultMaven.execute(DefaultMaven.java:106)
	at org.jvnet.hudson.maven3.launcher.Maven33Launcher.main(Maven33Launcher.java:129)
	at sun.reflect.NativeMethodAccessorImpl.invoke0(Native Method)
	at sun.reflect.NativeMethodAccessorImpl.invoke(NativeMethodAccessorImpl.java:62)
	at sun.reflect.DelegatingMethodAccessorImpl.invoke(DelegatingMethodAccessorImpl.java:43)
	at java.lang.reflect.Method.invoke(Method.java:498)
	at org.codehaus.plexus.classworlds.launcher.Launcher.launchStandard(Launcher.java:330)
	at org.codehaus.plexus.classworlds.launcher.Launcher.launch(Launcher.java:238)
	at jenkins.maven3.agent.Maven33Main.launch(Maven33Main.java:176)
	at sun.reflect.NativeMethodAccessorImpl.invoke0(Native Method)
	at sun.reflect.NativeMethodAccessorImpl.invoke(NativeMethodAccessorImpl.java:62)
	at sun.reflect.DelegatingMethodAccessorImpl.invoke(DelegatingMethodAccessorImpl.java:43)
	at java.lang.reflect.Method.invoke(Method.java:498)
	at hudson.maven.Maven3Builder.call(Maven3Builder.java:139)
	at hudson.maven.Maven3Builder.call(Maven3Builder.java:70)
	at hudson.remoting.UserRequest.perform(UserRequest.java:153)
	at hudson.remoting.UserRequest.perform(UserRequest.java:50)
	at hudson.remoting.Request$2.run(Request.java:336)
	at hudson.remoting.InterceptingExecutorService$1.call(InterceptingExecutorService.java:68)
	at java.util.concurrent.FutureTask.run(FutureTask.java:266)
	at java.util.concurrent.ThreadPoolExecutor.runWorker(ThreadPoolExecutor.java:1142)
	at java.util.concurrent.ThreadPoolExecutor$Worker.run(ThreadPoolExecutor.java:617)
	at java.lang.Thread.run(Thread.java:745)
2017-03-10T10:16:13.191 [ERROR] 
2017-03-10T10:16:13.191 [ERROR] Re-run Maven using the -X switch to enable full debug logging.
2017-03-10T10:16:13.191 [ERROR] 
2017-03-10T10:16:13.191 [ERROR] For more information about the errors and possible solutions,
please read the following articles:
2017-03-10T10:16:13.191 [ERROR] [Help 1] http://cwiki.apache.org/confluence/display/MAVEN/MavenExecutionException
channel stopped

Mime
View raw message