beam-commits mailing list archives

Site index · List index
Message view « Date » · « Thread »
Top « Date » · « Thread »
From Apache Jenkins Server <jenk...@builds.apache.org>
Subject Build failed in Jenkins: beam_PostCommit_Java_MavenInstall #2852
Date Thu, 09 Mar 2017 07:30:31 GMT
See <https://builds.apache.org/job/beam_PostCommit_Java_MavenInstall/2852/display/redirect>

------------------------------------------
[...truncated 674.65 KB...]
2017-03-09T06:55:06.349 [INFO] 
2017-03-09T06:55:06.350 [INFO] --- maven-compiler-plugin:3.6.1:testCompile (default-testCompile)
@ beam-sdks-java-io-google-cloud-platform ---
2017-03-09T06:55:06.371 [INFO] Changes detected - recompiling the module!
2017-03-09T06:55:06.372 [INFO] Compiling 19 source files to <https://builds.apache.org/job/beam_PostCommit_Java_MavenInstall/ws/sdks/java/io/google-cloud-platform/target/test-classes>
2017-03-09T06:55:07.917 [INFO] <https://builds.apache.org/job/beam_PostCommit_Java_MavenInstall/ws/sdks/java/io/google-cloud-platform/src/test/java/org/apache/beam/sdk/io/gcp/bigquery/BigQueryIOTest.java>:
Some input files use or override a deprecated API.
2017-03-09T06:55:07.917 [INFO] <https://builds.apache.org/job/beam_PostCommit_Java_MavenInstall/ws/sdks/java/io/google-cloud-platform/src/test/java/org/apache/beam/sdk/io/gcp/bigquery/BigQueryIOTest.java>:
Recompile with -Xlint:deprecation for details.
2017-03-09T06:55:07.918 [INFO] <https://builds.apache.org/job/beam_PostCommit_Java_MavenInstall/ws/sdks/java/io/google-cloud-platform/src/test/java/org/apache/beam/sdk/io/gcp/bigquery/BigQueryIOTest.java>:
<https://builds.apache.org/job/beam_PostCommit_Java_MavenInstall/ws/sdks/java/io/google-cloud-platform/src/test/java/org/apache/beam/sdk/io/gcp/bigquery/BigQueryIOTest.java>
uses unchecked or unsafe operations.
2017-03-09T06:55:07.918 [INFO] <https://builds.apache.org/job/beam_PostCommit_Java_MavenInstall/ws/sdks/java/io/google-cloud-platform/src/test/java/org/apache/beam/sdk/io/gcp/bigquery/BigQueryIOTest.java>:
Recompile with -Xlint:unchecked for details.
2017-03-09T06:55:08.053 [INFO] 
2017-03-09T06:55:08.054 [INFO] --- maven-checkstyle-plugin:2.17:check (default) @ beam-sdks-java-io-google-cloud-platform
---
2017-03-09T06:55:11.168 [INFO] Starting audit...
Audit done.
2017-03-09T06:55:11.525 [INFO] 
2017-03-09T06:55:11.525 [INFO] >>> findbugs-maven-plugin:3.0.4:check (default) >
:findbugs @ beam-sdks-java-io-google-cloud-platform >>>
2017-03-09T06:55:11.548 [INFO] 
2017-03-09T06:55:11.548 [INFO] --- findbugs-maven-plugin:3.0.4:findbugs (findbugs) @ beam-sdks-java-io-google-cloud-platform
---
2017-03-09T06:55:11.576 [INFO] Fork Value is true
2017-03-09T06:55:32.490 [INFO] Done FindBugs Analysis....
2017-03-09T06:55:33.192 [INFO] 
2017-03-09T06:55:33.192 [INFO] <<< findbugs-maven-plugin:3.0.4:check (default) <
:findbugs @ beam-sdks-java-io-google-cloud-platform <<<
2017-03-09T06:55:33.192 [INFO] 
2017-03-09T06:55:33.193 [INFO] --- findbugs-maven-plugin:3.0.4:check (default) @ beam-sdks-java-io-google-cloud-platform
---
2017-03-09T06:55:33.214 [INFO] BugInstance size is 0
2017-03-09T06:55:33.215 [INFO] Error size is 0
2017-03-09T06:55:33.228 [INFO] No errors/warnings found
2017-03-09T06:55:33.544 [INFO] 
2017-03-09T06:55:33.544 [INFO] --- maven-surefire-plugin:2.19.1:test (default-test) @ beam-sdks-java-io-google-cloud-platform
---
2017-03-09T06:55:33.554 [INFO] Surefire report directory: <https://builds.apache.org/job/beam_PostCommit_Java_MavenInstall/ws/sdks/java/io/google-cloud-platform/target/surefire-reports>
2017-03-09T06:55:33.578 [INFO] Using configured provider org.apache.maven.surefire.junitcore.JUnitCoreProvider
2017-03-09T06:55:33.579 [INFO] parallel='none', perCoreThreadCount=true, threadCount=0, useUnlimitedThreads=false,
threadCountSuites=0, threadCountClasses=0, threadCountMethods=0, parallelOptimized=true

-------------------------------------------------------
 T E S T S
-------------------------------------------------------
Running org.apache.beam.sdk.io.gcp.GcpApiSurfaceTest
Tests run: 1, Failures: 0, Errors: 0, Skipped: 0, Time elapsed: 6.775 sec - in org.apache.beam.sdk.io.gcp.GcpApiSurfaceTest
Running org.apache.beam.sdk.io.gcp.bigquery.BigQueryTableRowIteratorTest
Tests run: 3, Failures: 0, Errors: 0, Skipped: 0, Time elapsed: 6.719 sec - in org.apache.beam.sdk.io.gcp.bigquery.BigQueryTableRowIteratorTest
Running org.apache.beam.sdk.io.gcp.bigquery.BigQueryAvroUtilsTest
Tests run: 2, Failures: 0, Errors: 0, Skipped: 0, Time elapsed: 5.577 sec - in org.apache.beam.sdk.io.gcp.bigquery.BigQueryAvroUtilsTest
Running org.apache.beam.sdk.io.gcp.bigquery.BigQueryIOTest
Tests run: 76, Failures: 0, Errors: 0, Skipped: 4, Time elapsed: 13.95 sec - in org.apache.beam.sdk.io.gcp.bigquery.BigQueryIOTest
Running org.apache.beam.sdk.io.gcp.bigquery.BigQueryUtilTest
Tests run: 7, Failures: 0, Errors: 0, Skipped: 0, Time elapsed: 5.061 sec - in org.apache.beam.sdk.io.gcp.bigquery.BigQueryUtilTest
Running org.apache.beam.sdk.io.gcp.bigquery.BigQueryServicesImplTest
Tests run: 24, Failures: 0, Errors: 0, Skipped: 0, Time elapsed: 0.279 sec - in org.apache.beam.sdk.io.gcp.bigquery.BigQueryServicesImplTest
Running org.apache.beam.sdk.io.gcp.bigtable.BigtableIOTest
Tests run: 27, Failures: 0, Errors: 0, Skipped: 0, Time elapsed: 6.103 sec - in org.apache.beam.sdk.io.gcp.bigtable.BigtableIOTest
Running org.apache.beam.sdk.io.gcp.datastore.DatastoreV1Test
Tests run: 43, Failures: 0, Errors: 0, Skipped: 0, Time elapsed: 0.683 sec - in org.apache.beam.sdk.io.gcp.datastore.DatastoreV1Test
Running org.apache.beam.sdk.io.gcp.storage.GcsFileSystemRegistrarTest
Tests run: 1, Failures: 0, Errors: 0, Skipped: 0, Time elapsed: 0.007 sec - in org.apache.beam.sdk.io.gcp.storage.GcsFileSystemRegistrarTest
Running org.apache.beam.sdk.io.gcp.storage.GcsResourceIdTest
Tests run: 8, Failures: 0, Errors: 0, Skipped: 0, Time elapsed: 0.004 sec - in org.apache.beam.sdk.io.gcp.storage.GcsResourceIdTest
Running org.apache.beam.sdk.io.gcp.storage.GcsFileSystemTest
Tests run: 5, Failures: 0, Errors: 0, Skipped: 0, Time elapsed: 0.204 sec - in org.apache.beam.sdk.io.gcp.storage.GcsFileSystemTest

Results :

Tests run: 197, Failures: 0, Errors: 0, Skipped: 4

[JENKINS] Recording test results
2017-03-09T06:56:30.217 [INFO] 
2017-03-09T06:56:30.217 [INFO] --- maven-jar-plugin:3.0.2:jar (default-jar) @ beam-sdks-java-io-google-cloud-platform
---
2017-03-09T06:56:30.297 [INFO] Building jar: <https://builds.apache.org/job/beam_PostCommit_Java_MavenInstall/ws/sdks/java/io/google-cloud-platform/target/beam-sdks-java-io-google-cloud-platform-0.7.0-SNAPSHOT.jar>
2017-03-09T06:56:31.104 [INFO] 
2017-03-09T06:56:31.104 [INFO] --- maven-site-plugin:3.5.1:attach-descriptor (attach-descriptor)
@ beam-sdks-java-io-google-cloud-platform ---
2017-03-09T06:56:31.650 [INFO] 
2017-03-09T06:56:31.650 [INFO] --- maven-javadoc-plugin:2.10.4:jar (javadoc) @ beam-sdks-java-io-google-cloud-platform
---
2017-03-09T06:56:40.840 [INFO] Building jar: <https://builds.apache.org/job/beam_PostCommit_Java_MavenInstall/ws/sdks/java/io/google-cloud-platform/target/beam-sdks-java-io-google-cloud-platform-0.7.0-SNAPSHOT-javadoc.jar>
2017-03-09T06:56:40.955 [INFO] 
2017-03-09T06:56:40.955 [INFO] --- maven-source-plugin:3.0.1:jar-no-fork (attach-sources)
@ beam-sdks-java-io-google-cloud-platform ---
2017-03-09T06:56:40.964 [INFO] Building jar: <https://builds.apache.org/job/beam_PostCommit_Java_MavenInstall/ws/sdks/java/io/google-cloud-platform/target/beam-sdks-java-io-google-cloud-platform-0.7.0-SNAPSHOT-sources.jar>
2017-03-09T06:56:41.929 [INFO] 
2017-03-09T06:56:41.929 [INFO] --- maven-source-plugin:3.0.1:test-jar-no-fork (attach-test-sources)
@ beam-sdks-java-io-google-cloud-platform ---
2017-03-09T06:56:41.960 [INFO] Building jar: <https://builds.apache.org/job/beam_PostCommit_Java_MavenInstall/ws/sdks/java/io/google-cloud-platform/target/beam-sdks-java-io-google-cloud-platform-0.7.0-SNAPSHOT-test-sources.jar>
2017-03-09T06:56:42.406 [INFO] 
2017-03-09T06:56:42.406 [INFO] --- maven-jar-plugin:3.0.2:test-jar (default-test-jar) @ beam-sdks-java-io-google-cloud-platform
---
2017-03-09T06:56:42.491 [INFO] Building jar: <https://builds.apache.org/job/beam_PostCommit_Java_MavenInstall/ws/sdks/java/io/google-cloud-platform/target/beam-sdks-java-io-google-cloud-platform-0.7.0-SNAPSHOT-tests.jar>
2017-03-09T06:56:42.634 [INFO] 
2017-03-09T06:56:42.634 [INFO] --- maven-failsafe-plugin:2.19.1:integration-test (default)
@ beam-sdks-java-io-google-cloud-platform ---
2017-03-09T06:56:43.263 [INFO] Failsafe report directory: <https://builds.apache.org/job/beam_PostCommit_Java_MavenInstall/ws/sdks/java/io/google-cloud-platform/target/failsafe-reports>
2017-03-09T06:56:43.292 [INFO] parallel='all', perCoreThreadCount=true, threadCount=4, useUnlimitedThreads=false,
threadCountSuites=0, threadCountClasses=0, threadCountMethods=0, parallelOptimized=true

-------------------------------------------------------
 T E S T S
-------------------------------------------------------

Results :

Tests run: 0, Failures: 0, Errors: 0, Skipped: 0

[JENKINS] Recording test results
[JENKINS] Archiving disabled
2017-03-09T07:04:45.140 [INFO]                                                           
             
2017-03-09T07:04:45.140 [INFO] ------------------------------------------------------------------------
2017-03-09T07:04:45.140 [INFO] Skipping Apache Beam :: Parent
2017-03-09T07:04:45.140 [INFO] This project has been banned from the build due to previous
failures.
2017-03-09T07:04:45.140 [INFO] ------------------------------------------------------------------------
[JENKINS] Archiving disabled
[JENKINS] Archiving disabled
[JENKINS] Archiving disabled
[JENKINS] Archiving disabled
[JENKINS] Archiving disabled
[JENKINS] Archiving disabled
[JENKINS] Archiving disabled
[JENKINS] Archiving disabled
[JENKINS] Archiving disabled
[JENKINS] Archiving disabled
[JENKINS] Archiving disabled
[JENKINS] Archiving disabled
[JENKINS] Archiving disabled
[JENKINS] Archiving disabled
[JENKINS] Archiving disabled
[JENKINS] Archiving disabled
[JENKINS] Archiving disabled
[JENKINS] Archiving disabled
[JENKINS] Archiving disabled
[JENKINS] Archiving disabled
[JENKINS] Archiving disabled
[JENKINS] Archiving disabled
[JENKINS] Archiving disabled
[JENKINS] Archiving disabled
[JENKINS] Archiving disabled
[JENKINS] Archiving disabled
[JENKINS] Archiving disabled
[JENKINS] Archiving disabled
[JENKINS] Archiving disabled
[JENKINS] Archiving disabled
[JENKINS] Archiving disabled
[JENKINS] Archiving disabled
[JENKINS] Archiving disabled
[JENKINS] Archiving disabled
[JENKINS] Archiving disabled
[JENKINS] Archiving disabled
[JENKINS] Archiving disabled
[JENKINS] Archiving disabled
[JENKINS] Archiving disabled
[JENKINS] Archiving disabled
[JENKINS] Archiving disabled
[JENKINS] Archiving disabled
2017-03-09T07:05:57.589 [INFO] ------------------------------------------------------------------------
2017-03-09T07:05:57.589 [INFO] Reactor Summary:
2017-03-09T07:05:57.589 [INFO] 
2017-03-09T07:05:57.589 [INFO] Apache Beam :: Parent .............................. SUCCESS
[ 56.299 s]
2017-03-09T07:05:57.589 [INFO] Apache Beam :: SDKs :: Java :: Build Tools ......... SUCCESS
[ 13.577 s]
2017-03-09T07:05:57.589 [INFO] Apache Beam :: SDKs ................................ SUCCESS
[ 14.765 s]
2017-03-09T07:05:57.589 [INFO] Apache Beam :: SDKs :: Common ...................... SUCCESS
[ 10.173 s]
2017-03-09T07:05:57.589 [INFO] Apache Beam :: SDKs :: Common :: Fn API ............ SUCCESS
[ 27.762 s]
2017-03-09T07:05:57.589 [INFO] Apache Beam :: SDKs :: Common :: Runner API ........ SUCCESS
[ 21.967 s]
2017-03-09T07:05:57.590 [INFO] Apache Beam :: SDKs :: Java ........................ SUCCESS
[  8.129 s]
2017-03-09T07:05:57.590 [INFO] Apache Beam :: SDKs :: Java :: Core ................ SUCCESS
[07:14 min]
2017-03-09T07:05:57.590 [INFO] Apache Beam :: Runners ............................. SUCCESS
[ 20.954 s]
2017-03-09T07:05:57.590 [INFO] Apache Beam :: Runners :: Core Java Construction ... SUCCESS
[ 31.977 s]
2017-03-09T07:05:57.590 [INFO] Apache Beam :: Runners :: Core Java ................ SUCCESS
[01:24 min]
2017-03-09T07:05:57.590 [INFO] Apache Beam :: Runners :: Direct Java .............. SUCCESS
[05:22 min]
2017-03-09T07:05:57.590 [INFO] Apache Beam :: SDKs :: Java :: IO .................. SUCCESS
[ 10.340 s]
2017-03-09T07:05:57.590 [INFO] Apache Beam :: SDKs :: Java :: IO :: Elasticsearch . SUCCESS
[01:13 min]
2017-03-09T07:05:57.590 [INFO] Apache Beam :: Runners :: Google Cloud Dataflow .... SUCCESS
[01:24 min]
2017-03-09T07:05:57.590 [INFO] Apache Beam :: SDKs :: Java :: IO :: Google Cloud Platform
FAILURE [09:48 min]
2017-03-09T07:05:57.590 [INFO] Apache Beam :: SDKs :: Java :: IO :: Hadoop Common . SKIPPED
2017-03-09T07:05:57.590 [INFO] Apache Beam :: SDKs :: Java :: IO :: HBase ......... SKIPPED
2017-03-09T07:05:57.590 [INFO] Apache Beam :: SDKs :: Java :: IO :: HDFS .......... SKIPPED
2017-03-09T07:05:57.590 [INFO] Apache Beam :: SDKs :: Java :: IO :: JDBC .......... SKIPPED
2017-03-09T07:05:57.590 [INFO] Apache Beam :: SDKs :: Java :: IO :: JMS ........... SKIPPED
2017-03-09T07:05:57.590 [INFO] Apache Beam :: SDKs :: Java :: IO :: Kafka ......... SKIPPED
2017-03-09T07:05:57.590 [INFO] Apache Beam :: SDKs :: Java :: IO :: Kinesis ....... SKIPPED
2017-03-09T07:05:57.590 [INFO] Apache Beam :: SDKs :: Java :: IO :: MongoDB ....... SKIPPED
2017-03-09T07:05:57.590 [INFO] Apache Beam :: SDKs :: Java :: IO :: MQTT .......... SKIPPED
2017-03-09T07:05:57.590 [INFO] Apache Beam :: SDKs :: Java :: Maven Archetypes .... SKIPPED
2017-03-09T07:05:57.590 [INFO] Apache Beam :: SDKs :: Java :: Maven Archetypes :: Starter
SKIPPED
2017-03-09T07:05:57.590 [INFO] Apache Beam :: SDKs :: Java :: Maven Archetypes :: Examples
SKIPPED
2017-03-09T07:05:57.590 [INFO] Apache Beam :: SDKs :: Java :: Maven Archetypes :: Examples
- Java 8 SKIPPED
2017-03-09T07:05:57.590 [INFO] Apache Beam :: SDKs :: Java :: Extensions .......... SKIPPED
2017-03-09T07:05:57.591 [INFO] Apache Beam :: SDKs :: Java :: Extensions :: Jackson SKIPPED
2017-03-09T07:05:57.591 [INFO] Apache Beam :: SDKs :: Java :: Extensions :: Join library SKIPPED
2017-03-09T07:05:57.591 [INFO] Apache Beam :: SDKs :: Java :: Extensions :: Sorter  SKIPPED
2017-03-09T07:05:57.591 [INFO] Apache Beam :: SDKs :: Java :: Harness ............. SKIPPED
2017-03-09T07:05:57.591 [INFO] Apache Beam :: SDKs :: Java :: Java 8 Tests ........ SKIPPED
2017-03-09T07:05:57.591 [INFO] Apache Beam :: SDKs :: Python ...................... SKIPPED
2017-03-09T07:05:57.591 [INFO] Apache Beam :: Runners :: Flink .................... SKIPPED
2017-03-09T07:05:57.591 [INFO] Apache Beam :: Runners :: Flink :: Core ............ SKIPPED
2017-03-09T07:05:57.591 [INFO] Apache Beam :: Runners :: Flink :: Examples ........ SKIPPED
2017-03-09T07:05:57.591 [INFO] Apache Beam :: Runners :: Spark .................... SKIPPED
2017-03-09T07:05:57.591 [INFO] Apache Beam :: Runners :: Apex ..................... SKIPPED
2017-03-09T07:05:57.591 [INFO] Apache Beam :: Examples ............................ SKIPPED
2017-03-09T07:05:57.591 [INFO] Apache Beam :: Examples :: Java .................... SKIPPED
2017-03-09T07:05:57.591 [INFO] Apache Beam :: Examples :: Java 8 .................. SKIPPED
2017-03-09T07:05:57.591 [INFO] Apache Beam :: SDKs :: Java :: Aggregated Javadoc .. SKIPPED
2017-03-09T07:05:57.591 [INFO] ------------------------------------------------------------------------
2017-03-09T07:05:57.591 [INFO] BUILD FAILURE
2017-03-09T07:05:57.591 [INFO] ------------------------------------------------------------------------
2017-03-09T07:05:57.591 [INFO] Total time: 34:07 min
2017-03-09T07:05:57.591 [INFO] Finished at: 2017-03-09T07:05:57+00:00
2017-03-09T07:05:58.451 [INFO] Final Memory: 143M/1592M
2017-03-09T07:05:58.452 [INFO] ------------------------------------------------------------------------
Waiting for Jenkins to finish collecting data
ERROR: Failed to parse POMs
java.io.IOException: Backing channel 'beam1' is disconnected.
	at hudson.remoting.RemoteInvocationHandler.channelOrFail(RemoteInvocationHandler.java:191)
	at hudson.remoting.RemoteInvocationHandler.invoke(RemoteInvocationHandler.java:256)
	at com.sun.proxy.$Proxy104.isAlive(Unknown Source)
	at hudson.Launcher$RemoteLauncher$ProcImpl.isAlive(Launcher.java:1043)
	at hudson.maven.ProcessCache$MavenProcess.call(ProcessCache.java:166)
	at hudson.maven.MavenModuleSetBuild$MavenModuleSetBuildExecution.doRun(MavenModuleSetBuild.java:873)
	at hudson.model.AbstractBuild$AbstractBuildExecution.run(AbstractBuild.java:534)
	at hudson.model.Run.execute(Run.java:1728)
	at hudson.maven.MavenModuleSetBuild.run(MavenModuleSetBuild.java:544)
	at hudson.model.ResourceController.execute(ResourceController.java:98)
	at hudson.model.Executor.run(Executor.java:404)
Caused by: hudson.remoting.Channel$OrderlyShutdown: java.util.concurrent.TimeoutException:
Ping started at 1489043475453 hasn't completed by 1489043777247
	at hudson.remoting.Channel$CloseCommand.execute(Channel.java:1121)
	at hudson.remoting.Channel$1.handle(Channel.java:526)
	at hudson.remoting.SynchronousCommandTransport$ReaderThread.run(SynchronousCommandTransport.java:83)
Caused by: Command close created at
	at hudson.remoting.Command.<init>(Command.java:59)
	at hudson.remoting.Channel$CloseCommand.<init>(Channel.java:1115)
	at hudson.remoting.Channel$CloseCommand.<init>(Channel.java:1113)
	at hudson.remoting.Channel.close(Channel.java:1273)
	at hudson.slaves.ChannelPinger$1.onDead(ChannelPinger.java:115)
	at hudson.remoting.PingThread.ping(PingThread.java:130)
	at hudson.remoting.PingThread.run(PingThread.java:86)
Caused by: java.util.concurrent.TimeoutException: Ping started at 1489043475453 hasn't completed
by 1489043777247
	... 2 more
FATAL: channel is already closed
hudson.remoting.ChannelClosedException: channel is already closed
	at hudson.remoting.Channel.send(Channel.java:604)
	at hudson.remoting.Request.call(Request.java:130)
	at hudson.remoting.Channel.call(Channel.java:821)
	at hudson.Launcher$RemoteLauncher.kill(Launcher.java:984)
	at hudson.model.AbstractBuild$AbstractBuildExecution.run(AbstractBuild.java:540)
	at hudson.model.Run.execute(Run.java:1728)
	at hudson.maven.MavenModuleSetBuild.run(MavenModuleSetBuild.java:544)
	at hudson.model.ResourceController.execute(ResourceController.java:98)
	at hudson.model.Executor.run(Executor.java:404)
Caused by: hudson.remoting.Channel$OrderlyShutdown: java.util.concurrent.TimeoutException:
Ping started at 1489043475453 hasn't completed by 1489043777247
	at hudson.remoting.Channel$CloseCommand.execute(Channel.java:1121)
	at hudson.remoting.Channel$1.handle(Channel.java:526)
	at hudson.remoting.SynchronousCommandTransport$ReaderThread.run(SynchronousCommandTransport.java:83)
Caused by: Command close created at
	at hudson.remoting.Command.<init>(Command.java:59)
	at hudson.remoting.Channel$CloseCommand.<init>(Channel.java:1115)
	at hudson.remoting.Channel$CloseCommand.<init>(Channel.java:1113)
	at hudson.remoting.Channel.close(Channel.java:1273)
	at hudson.slaves.ChannelPinger$1.onDead(ChannelPinger.java:115)
	at hudson.remoting.PingThread.ping(PingThread.java:130)
	at hudson.remoting.PingThread.run(PingThread.java:86)
Caused by: java.util.concurrent.TimeoutException: Ping started at 1489043475453 hasn't completed
by 1489043777247
	... 2 more

Mime
View raw message