beam-commits mailing list archives

Site index · List index
Message view « Date » · « Thread »
Top « Date » · « Thread »
From Apache Jenkins Server <jenk...@builds.apache.org>
Subject Build failed in Jenkins: beam_PostCommit_Java_RunnableOnService_Dataflow #2509
Date Thu, 09 Mar 2017 20:13:45 GMT
See <https://builds.apache.org/job/beam_PostCommit_Java_RunnableOnService_Dataflow/2509/display/redirect>

------------------------------------------
[...truncated 993.91 KB...]
2017-03-09T20:12:06.350 [INFO] --- maven-site-plugin:3.5.1:attach-descriptor (attach-descriptor)
@ beam-runners-core-construction-java ---
2017-03-09T20:12:06.794 [INFO] 
2017-03-09T20:12:06.794 [INFO] --- maven-shade-plugin:3.0.0:shade (bundle-and-repackage) @
beam-runners-core-construction-java ---
2017-03-09T20:12:06.798 [INFO] Excluding org.apache.beam:beam-sdks-java-core:jar:0.7.0-SNAPSHOT
from the shaded jar.
2017-03-09T20:12:06.798 [INFO] Excluding org.apache.beam:beam-sdks-common-runner-api:jar:0.7.0-SNAPSHOT
from the shaded jar.
2017-03-09T20:12:06.798 [INFO] Excluding io.grpc:grpc-auth:jar:1.0.1 from the shaded jar.
2017-03-09T20:12:06.798 [INFO] Excluding io.grpc:grpc-core:jar:1.0.1 from the shaded jar.
2017-03-09T20:12:06.798 [INFO] Excluding io.grpc:grpc-context:jar:1.0.1 from the shaded jar.
2017-03-09T20:12:06.798 [INFO] Excluding io.grpc:grpc-netty:jar:1.0.1 from the shaded jar.
2017-03-09T20:12:06.798 [INFO] Excluding io.netty:netty-codec-http2:jar:4.1.3.Final from the
shaded jar.
2017-03-09T20:12:06.798 [INFO] Excluding io.netty:netty-codec-http:jar:4.1.3.Final from the
shaded jar.
2017-03-09T20:12:06.798 [INFO] Excluding io.grpc:grpc-stub:jar:1.0.1 from the shaded jar.
2017-03-09T20:12:06.798 [INFO] Excluding io.grpc:grpc-all:jar:1.0.1 from the shaded jar.
2017-03-09T20:12:06.798 [INFO] Excluding io.grpc:grpc-protobuf:jar:1.0.1 from the shaded jar.
2017-03-09T20:12:06.798 [INFO] Excluding com.google.protobuf:protobuf-java-util:jar:3.0.0
from the shaded jar.
2017-03-09T20:12:06.798 [INFO] Excluding com.google.code.gson:gson:jar:2.3 from the shaded
jar.
2017-03-09T20:12:06.798 [INFO] Excluding io.grpc:grpc-protobuf-nano:jar:1.0.1 from the shaded
jar.
2017-03-09T20:12:06.799 [INFO] Excluding com.google.protobuf.nano:protobuf-javanano:jar:3.0.0-alpha-5
from the shaded jar.
2017-03-09T20:12:06.799 [INFO] Excluding io.grpc:grpc-okhttp:jar:1.0.1 from the shaded jar.
2017-03-09T20:12:06.799 [INFO] Excluding com.squareup.okio:okio:jar:1.6.0 from the shaded
jar.
2017-03-09T20:12:06.799 [INFO] Excluding com.squareup.okhttp:okhttp:jar:2.5.0 from the shaded
jar.
2017-03-09T20:12:06.799 [INFO] Excluding io.grpc:grpc-protobuf-lite:jar:1.0.1 from the shaded
jar.
2017-03-09T20:12:06.799 [INFO] Excluding com.google.protobuf:protobuf-lite:jar:3.0.1 from
the shaded jar.
2017-03-09T20:12:06.799 [INFO] Excluding com.google.auth:google-auth-library-credentials:jar:0.6.0
from the shaded jar.
2017-03-09T20:12:06.799 [INFO] Excluding com.google.auth:google-auth-library-oauth2-http:jar:0.6.0
from the shaded jar.
2017-03-09T20:12:06.799 [INFO] Excluding io.netty:netty-handler:jar:4.1.3.Final from the shaded
jar.
2017-03-09T20:12:06.799 [INFO] Excluding io.netty:netty-buffer:jar:4.1.3.Final from the shaded
jar.
2017-03-09T20:12:06.799 [INFO] Excluding io.netty:netty-common:jar:4.1.3.Final from the shaded
jar.
2017-03-09T20:12:06.799 [INFO] Excluding io.netty:netty-transport:jar:4.1.3.Final from the
shaded jar.
2017-03-09T20:12:06.799 [INFO] Excluding io.netty:netty-resolver:jar:4.1.3.Final from the
shaded jar.
2017-03-09T20:12:06.799 [INFO] Excluding io.netty:netty-codec:jar:4.1.3.Final from the shaded
jar.
2017-03-09T20:12:06.799 [INFO] Excluding com.google.api.grpc:grpc-google-pubsub-v1:jar:0.1.0
from the shaded jar.
2017-03-09T20:12:06.799 [INFO] Excluding com.google.api.grpc:grpc-google-common-protos:jar:0.1.0
from the shaded jar.
2017-03-09T20:12:06.799 [INFO] Excluding com.google.api.grpc:grpc-google-iam-v1:jar:0.1.0
from the shaded jar.
2017-03-09T20:12:06.799 [INFO] Excluding com.google.api-client:google-api-client:jar:1.22.0
from the shaded jar.
2017-03-09T20:12:06.799 [INFO] Excluding com.google.apis:google-api-services-bigquery:jar:v2-rev295-1.22.0
from the shaded jar.
2017-03-09T20:12:06.799 [INFO] Excluding com.google.apis:google-api-services-cloudresourcemanager:jar:v1-rev6-1.22.0
from the shaded jar.
2017-03-09T20:12:06.799 [INFO] Excluding com.google.apis:google-api-services-pubsub:jar:v1-rev10-1.22.0
from the shaded jar.
2017-03-09T20:12:06.799 [INFO] Excluding com.google.apis:google-api-services-storage:jar:v1-rev71-1.22.0
from the shaded jar.
2017-03-09T20:12:06.799 [INFO] Excluding com.google.http-client:google-http-client:jar:1.22.0
from the shaded jar.
2017-03-09T20:12:06.799 [INFO] Excluding org.apache.httpcomponents:httpclient:jar:4.0.1 from
the shaded jar.
2017-03-09T20:12:06.799 [INFO] Excluding org.apache.httpcomponents:httpcore:jar:4.0.1 from
the shaded jar.
2017-03-09T20:12:06.799 [INFO] Excluding commons-logging:commons-logging:jar:1.1.1 from the
shaded jar.
2017-03-09T20:12:06.799 [INFO] Excluding commons-codec:commons-codec:jar:1.3 from the shaded
jar.
2017-03-09T20:12:06.799 [INFO] Excluding com.google.http-client:google-http-client-jackson:jar:1.22.0
from the shaded jar.
2017-03-09T20:12:06.799 [INFO] Excluding com.google.http-client:google-http-client-jackson2:jar:1.22.0
from the shaded jar.
2017-03-09T20:12:06.799 [INFO] Excluding com.google.http-client:google-http-client-protobuf:jar:1.22.0
from the shaded jar.
2017-03-09T20:12:06.799 [INFO] Excluding com.google.oauth-client:google-oauth-client:jar:1.22.0
from the shaded jar.
2017-03-09T20:12:06.799 [INFO] Excluding com.google.cloud.bigdataoss:gcsio:jar:1.4.5 from
the shaded jar.
2017-03-09T20:12:06.799 [INFO] Excluding com.google.api-client:google-api-client-java6:jar:1.22.0
from the shaded jar.
2017-03-09T20:12:06.799 [INFO] Excluding com.google.api-client:google-api-client-jackson2:jar:1.22.0
from the shaded jar.
2017-03-09T20:12:06.799 [INFO] Excluding com.google.oauth-client:google-oauth-client-java6:jar:1.22.0
from the shaded jar.
2017-03-09T20:12:06.799 [INFO] Excluding com.google.cloud.bigdataoss:util:jar:1.4.5 from the
shaded jar.
2017-03-09T20:12:06.799 [INFO] Excluding com.google.protobuf:protobuf-java:jar:3.1.0 from
the shaded jar.
2017-03-09T20:12:06.799 [INFO] Excluding com.google.code.findbugs:jsr305:jar:3.0.1 from the
shaded jar.
2017-03-09T20:12:06.799 [INFO] Excluding com.fasterxml.jackson.core:jackson-core:jar:2.7.2
from the shaded jar.
2017-03-09T20:12:06.799 [INFO] Excluding com.fasterxml.jackson.core:jackson-annotations:jar:2.7.2
from the shaded jar.
2017-03-09T20:12:06.799 [INFO] Excluding com.fasterxml.jackson.core:jackson-databind:jar:2.7.2
from the shaded jar.
2017-03-09T20:12:06.799 [INFO] Excluding org.slf4j:slf4j-api:jar:1.7.14 from the shaded jar.
2017-03-09T20:12:06.799 [INFO] Excluding net.bytebuddy:byte-buddy:jar:1.6.8 from the shaded
jar.
2017-03-09T20:12:06.799 [INFO] Excluding org.apache.avro:avro:jar:1.8.1 from the shaded jar.
2017-03-09T20:12:06.799 [INFO] Excluding org.codehaus.jackson:jackson-core-asl:jar:1.9.13
from the shaded jar.
2017-03-09T20:12:06.799 [INFO] Excluding org.codehaus.jackson:jackson-mapper-asl:jar:1.9.13
from the shaded jar.
2017-03-09T20:12:06.799 [INFO] Excluding com.thoughtworks.paranamer:paranamer:jar:2.7 from
the shaded jar.
2017-03-09T20:12:06.800 [INFO] Excluding org.tukaani:xz:jar:1.5 from the shaded jar.
2017-03-09T20:12:06.800 [INFO] Excluding org.xerial.snappy:snappy-java:jar:1.1.2.1 from the
shaded jar.
2017-03-09T20:12:06.800 [INFO] Excluding org.apache.commons:commons-compress:jar:1.9 from
the shaded jar.
2017-03-09T20:12:06.800 [INFO] Excluding org.apache.commons:commons-lang3:jar:3.5 from the
shaded jar.
2017-03-09T20:12:06.800 [INFO] Excluding joda-time:joda-time:jar:2.4 from the shaded jar.
2017-03-09T20:12:06.800 [INFO] Including com.google.guava:guava:jar:20.0 in the shaded jar.
2017-03-09T20:12:07.989 [INFO] Replacing original artifact with shaded artifact.
2017-03-09T20:12:07.990 [INFO] Replacing <https://builds.apache.org/job/beam_PostCommit_Java_RunnableOnService_Dataflow/ws/runners/core-construction-java/target/beam-runners-core-construction-java-0.7.0-SNAPSHOT.jar>
with <https://builds.apache.org/job/beam_PostCommit_Java_RunnableOnService_Dataflow/ws/runners/core-construction-java/target/beam-runners-core-construction-java-0.7.0-SNAPSHOT-shaded.jar>
2017-03-09T20:12:07.990 [INFO] Replacing original test artifact with shaded test artifact.
2017-03-09T20:12:07.990 [INFO] Replacing <https://builds.apache.org/job/beam_PostCommit_Java_RunnableOnService_Dataflow/ws/runners/core-construction-java/target/beam-runners-core-construction-java-0.7.0-SNAPSHOT-tests.jar>
with <https://builds.apache.org/job/beam_PostCommit_Java_RunnableOnService_Dataflow/ws/runners/core-construction-java/target/beam-runners-core-construction-java-0.7.0-SNAPSHOT-shaded-tests.jar>
2017-03-09T20:12:07.990 [INFO] Dependency-reduced POM written at: <https://builds.apache.org/job/beam_PostCommit_Java_RunnableOnService_Dataflow/ws/runners/core-construction-java/dependency-reduced-pom.xml>
2017-03-09T20:12:08.718 [INFO] 
2017-03-09T20:12:08.718 [INFO] --- maven-jar-plugin:3.0.2:test-jar (default-test-jar) @ beam-runners-core-construction-java
---
2017-03-09T20:12:08.727 [INFO] Building jar: <https://builds.apache.org/job/beam_PostCommit_Java_RunnableOnService_Dataflow/ws/runners/core-construction-java/target/beam-runners-core-construction-java-0.7.0-SNAPSHOT-tests.jar>
2017-03-09T20:12:09.041 [INFO] 
2017-03-09T20:12:09.041 [INFO] --- maven-surefire-plugin:2.19.1:test (runnable-on-service-tests)
@ beam-runners-core-construction-java ---
2017-03-09T20:12:09.046 [WARNING] useSystemClassloader setting has no effect when not forking
2017-03-09T20:12:09.079 [INFO] Surefire report directory: <https://builds.apache.org/job/beam_PostCommit_Java_RunnableOnService_Dataflow/ws/runners/core-construction-java/target/surefire-reports>
2017-03-09T20:12:09.080 [INFO] Using configured provider org.apache.maven.surefire.junitcore.JUnitCoreProvider
2017-03-09T20:12:09.080 [INFO] parallel='all', perCoreThreadCount=true, threadCount=4, useUnlimitedThreads=false,
threadCountSuites=0, threadCountClasses=0, threadCountMethods=0, parallelOptimized=true

Results :

Tests run: 0, Failures: 0, Errors: 0, Skipped: 0

2017-03-09T20:12:09.775 [INFO] 
2017-03-09T20:12:09.775 [INFO] --- maven-dependency-plugin:3.0.0:analyze-only (default) @
beam-runners-core-construction-java ---
[JENKINS] Recording test results2017-03-09T20:12:09.809 [INFO] No dependency problems found

[JENKINS] Archiving disabled
2017-03-09T20:12:20.264 [INFO]                                                           
             
2017-03-09T20:12:20.264 [INFO] ------------------------------------------------------------------------
2017-03-09T20:12:20.264 [INFO] Building Apache Beam :: Runners :: Google Cloud Dataflow 0.7.0-SNAPSHOT
2017-03-09T20:12:20.264 [INFO] ------------------------------------------------------------------------
2017-03-09T20:12:20.271 [INFO] Downloading: https://repo.maven.apache.org/maven2/com/google/apis/google-api-services-dataflow/v1b3-rev186-1.22.0/google-api-services-dataflow-v1b3-rev186-1.22.0.pom
2017-03-09T20:12:20.301 [INFO] Downloaded: https://repo.maven.apache.org/maven2/com/google/apis/google-api-services-dataflow/v1b3-rev186-1.22.0/google-api-services-dataflow-v1b3-rev186-1.22.0.pom
(3 KB at 85.9 KB/sec)
2017-03-09T20:12:20.304 [INFO] Downloading: https://repo.maven.apache.org/maven2/com/google/apis/google-api-services-clouddebugger/v2-rev8-1.22.0/google-api-services-clouddebugger-v2-rev8-1.22.0.pom
2017-03-09T20:12:20.331 [INFO] Downloaded: https://repo.maven.apache.org/maven2/com/google/apis/google-api-services-clouddebugger/v2-rev8-1.22.0/google-api-services-clouddebugger-v2-rev8-1.22.0.pom
(3 KB at 96.0 KB/sec)
2017-03-09T20:12:20.334 [INFO] Downloading: https://repo.maven.apache.org/maven2/com/google/cloud/datastore/datastore-v1-protos/1.3.0/datastore-v1-protos-1.3.0.pom
2017-03-09T20:12:20.363 [INFO] Downloaded: https://repo.maven.apache.org/maven2/com/google/cloud/datastore/datastore-v1-protos/1.3.0/datastore-v1-protos-1.3.0.pom
(16 KB at 529.3 KB/sec)
2017-03-09T20:12:20.374 [INFO] Downloading: https://repo.maven.apache.org/maven2/com/google/apis/google-api-services-dataflow/v1b3-rev186-1.22.0/google-api-services-dataflow-v1b3-rev186-1.22.0.jar
2017-03-09T20:12:20.375 [INFO] Downloading: https://repo.maven.apache.org/maven2/com/google/apis/google-api-services-clouddebugger/v2-rev8-1.22.0/google-api-services-clouddebugger-v2-rev8-1.22.0.jar
2017-03-09T20:12:20.375 [INFO] Downloading: https://repo.maven.apache.org/maven2/com/google/cloud/datastore/datastore-v1-protos/1.3.0/datastore-v1-protos-1.3.0.jar
2017-03-09T20:12:20.409 [INFO] Downloaded: https://repo.maven.apache.org/maven2/com/google/apis/google-api-services-clouddebugger/v2-rev8-1.22.0/google-api-services-clouddebugger-v2-rev8-1.22.0.jar
(52 KB at 1478.5 KB/sec)
2017-03-09T20:12:20.416 [INFO] Downloaded: https://repo.maven.apache.org/maven2/com/google/apis/google-api-services-dataflow/v1b3-rev186-1.22.0/google-api-services-dataflow-v1b3-rev186-1.22.0.jar
(154 KB at 3647.0 KB/sec)
2017-03-09T20:12:20.437 [INFO] Downloaded: https://repo.maven.apache.org/maven2/com/google/cloud/datastore/datastore-v1-protos/1.3.0/datastore-v1-protos-1.3.0.jar
(437 KB at 6935.2 KB/sec)
2017-03-09T20:12:20.440 [INFO] 
2017-03-09T20:12:20.440 [INFO] --- maven-clean-plugin:3.0.0:clean (default-clean) @ beam-runners-google-cloud-dataflow-java
---
2017-03-09T20:12:20.441 [INFO] Deleting <https://builds.apache.org/job/beam_PostCommit_Java_RunnableOnService_Dataflow/ws/runners/google-cloud-dataflow-java>
(includes = [**/*.pyc, **/*.egg-info/], excludes = [])
2017-03-09T20:12:21.077 [INFO] 
2017-03-09T20:12:21.077 [INFO] --- maven-enforcer-plugin:1.4.1:enforce (enforce) @ beam-runners-google-cloud-dataflow-java
---
2017-03-09T20:12:21.810 [INFO] 
2017-03-09T20:12:21.810 [INFO] --- jacoco-maven-plugin:0.7.8:prepare-agent (default) @ beam-runners-google-cloud-dataflow-java
---
2017-03-09T20:12:21.811 [INFO] argLine set to -javaagent:<https://builds.apache.org/job/beam_PostCommit_Java_RunnableOnService_Dataflow/ws/.repository/org/jacoco/org.jacoco.agent/0.7.8/org.jacoco.agent-0.7.8-runtime.jar=destfile=/home/jenkins/jenkins-slave/workspace/beam_PostCommit_Java_RunnableOnService_Dataflow/runners/google-cloud-dataflow-java/target/jacoco.exec,excludes=**/AutoValue_*.class,dumponexit=true,output=file>
2017-03-09T20:12:22.019 [INFO] 
2017-03-09T20:12:22.019 [INFO] --- maven-remote-resources-plugin:1.5:process (process-resource-bundles)
@ beam-runners-google-cloud-dataflow-java ---
2017-03-09T20:12:23.094 [INFO] 
2017-03-09T20:12:23.094 [INFO] --- maven-resources-plugin:2.7:resources (default-resources)
@ beam-runners-google-cloud-dataflow-java ---
2017-03-09T20:12:23.096 [INFO] Using 'UTF-8' encoding to copy filtered resources.
2017-03-09T20:12:23.096 [INFO] Copying 1 resource
2017-03-09T20:12:23.097 [INFO] Copying 3 resources
2017-03-09T20:12:23.440 [INFO] 
2017-03-09T20:12:23.440 [INFO] --- maven-compiler-plugin:3.6.1:compile (default-compile) @
beam-runners-google-cloud-dataflow-java ---
2017-03-09T20:12:23.449 [INFO] Changes detected - recompiling the module!
2017-03-09T20:12:23.449 [INFO] Compiling 46 source files to <https://builds.apache.org/job/beam_PostCommit_Java_RunnableOnService_Dataflow/ws/runners/google-cloud-dataflow-java/target/classes>
2017-03-09T20:12:24.409 [WARNING] bootstrap class path not set in conjunction with -source
1.7
2017-03-09T20:12:24.409 [WARNING] <https://builds.apache.org/job/beam_PostCommit_Java_RunnableOnService_Dataflow/ws/runners/google-cloud-dataflow-java/src/main/java/org/apache/beam/runners/dataflow/internal/IsmFormat.java>:[119,31]
An @AutoValue property that is a primitive array returns the original array, which can therefore
be modified by the caller. If this OK, you can suppress this warning with @SuppressWarnings("mutable").
Otherwise, you should replace the property with an immutable type, perhaps a simple wrapper
around the original array.
2017-03-09T20:12:24.409 [INFO] <https://builds.apache.org/job/beam_PostCommit_Java_RunnableOnService_Dataflow/ws/runners/google-cloud-dataflow-java/src/main/java/org/apache/beam/runners/dataflow/util/PackageUtil.java>:
Some input files use or override a deprecated API.
2017-03-09T20:12:24.409 [INFO] <https://builds.apache.org/job/beam_PostCommit_Java_RunnableOnService_Dataflow/ws/runners/google-cloud-dataflow-java/src/main/java/org/apache/beam/runners/dataflow/util/PackageUtil.java>:
Recompile with -Xlint:deprecation for details.
2017-03-09T20:12:24.409 [INFO] <https://builds.apache.org/job/beam_PostCommit_Java_RunnableOnService_Dataflow/ws/runners/google-cloud-dataflow-java/src/main/java/org/apache/beam/runners/dataflow/internal/IsmFormat.java>:
Some input files use unchecked or unsafe operations.
2017-03-09T20:12:24.409 [INFO] <https://builds.apache.org/job/beam_PostCommit_Java_RunnableOnService_Dataflow/ws/runners/google-cloud-dataflow-java/src/main/java/org/apache/beam/runners/dataflow/internal/IsmFormat.java>:
Recompile with -Xlint:unchecked for details.
2017-03-09T20:12:24.749 [INFO] 
2017-03-09T20:12:24.749 [INFO] --- maven-resources-plugin:2.7:testResources (default-testResources)
@ beam-runners-google-cloud-dataflow-java ---
2017-03-09T20:12:24.750 [INFO] Using 'UTF-8' encoding to copy filtered resources.
2017-03-09T20:12:24.750 [INFO] skip non existing resourceDirectory <https://builds.apache.org/job/beam_PostCommit_Java_RunnableOnService_Dataflow/ws/runners/google-cloud-dataflow-java/src/test/resources>
2017-03-09T20:12:24.751 [INFO] Copying 3 resources
2017-03-09T20:12:25.055 [INFO] 
2017-03-09T20:12:25.055 [INFO] --- maven-compiler-plugin:3.6.1:testCompile (default-testCompile)
@ beam-runners-google-cloud-dataflow-java ---
2017-03-09T20:12:25.065 [INFO] Changes detected - recompiling the module!
2017-03-09T20:12:25.065 [INFO] Compiling 20 source files to <https://builds.apache.org/job/beam_PostCommit_Java_RunnableOnService_Dataflow/ws/runners/google-cloud-dataflow-java/target/test-classes>
2017-03-09T20:12:25.652 [INFO] <https://builds.apache.org/job/beam_PostCommit_Java_RunnableOnService_Dataflow/ws/runners/google-cloud-dataflow-java/src/test/java/org/apache/beam/runners/dataflow/util/PackageUtilTest.java>:
Some input files use or override a deprecated API.
2017-03-09T20:12:25.652 [INFO] <https://builds.apache.org/job/beam_PostCommit_Java_RunnableOnService_Dataflow/ws/runners/google-cloud-dataflow-java/src/test/java/org/apache/beam/runners/dataflow/util/PackageUtilTest.java>:
Recompile with -Xlint:deprecation for details.
2017-03-09T20:12:25.652 [INFO] <https://builds.apache.org/job/beam_PostCommit_Java_RunnableOnService_Dataflow/ws/runners/google-cloud-dataflow-java/src/test/java/org/apache/beam/runners/dataflow/DataflowPipelineJobTest.java>:
Some input files use unchecked or unsafe operations.
2017-03-09T20:12:25.652 [INFO] <https://builds.apache.org/job/beam_PostCommit_Java_RunnableOnService_Dataflow/ws/runners/google-cloud-dataflow-java/src/test/java/org/apache/beam/runners/dataflow/DataflowPipelineJobTest.java>:
Recompile with -Xlint:unchecked for details.
2017-03-09T20:12:25.653 [INFO] -------------------------------------------------------------
2017-03-09T20:12:25.653 [ERROR] COMPILATION ERROR : 
2017-03-09T20:12:25.653 [INFO] -------------------------------------------------------------
2017-03-09T20:12:25.653 [ERROR] <https://builds.apache.org/job/beam_PostCommit_Java_RunnableOnService_Dataflow/ws/runners/google-cloud-dataflow-java/src/test/java/org/apache/beam/runners/dataflow/BatchStatefulParDoOverridesTest.java>:[74,54]
cannot find symbol
  symbol:   method getRunner()
  location: variable pipeline of type org.apache.beam.sdk.Pipeline
2017-03-09T20:12:25.653 [ERROR] <https://builds.apache.org/job/beam_PostCommit_Java_RunnableOnService_Dataflow/ws/runners/google-cloud-dataflow-java/src/test/java/org/apache/beam/runners/dataflow/BatchStatefulParDoOverridesTest.java>:[92,54]
cannot find symbol
  symbol:   method getRunner()
  location: variable pipeline of type org.apache.beam.sdk.Pipeline
2017-03-09T20:12:25.653 [INFO] 2 errors 
2017-03-09T20:12:25.653 [INFO] -------------------------------------------------------------
[JENKINS] Archiving disabled
[JENKINS] Archiving disabled
[JENKINS] Archiving disabled
[JENKINS] Archiving disabled
[JENKINS] Archiving disabled
[JENKINS] Archiving disabled
[JENKINS] Archiving disabled
[JENKINS] Archiving disabled
[JENKINS] Archiving disabled
[JENKINS] Archiving disabled
[JENKINS] Archiving disabled
2017-03-09T20:12:48.355 [INFO] ------------------------------------------------------------------------
2017-03-09T20:12:48.355 [INFO] Reactor Summary:
2017-03-09T20:12:48.355 [INFO] 
2017-03-09T20:12:48.355 [INFO] Apache Beam :: Parent .............................. SUCCESS
[ 25.180 s]
2017-03-09T20:12:48.355 [INFO] Apache Beam :: SDKs :: Java :: Build Tools ......... SUCCESS
[ 23.399 s]
2017-03-09T20:12:48.355 [INFO] Apache Beam :: SDKs ................................ SUCCESS
[  5.636 s]
[JENKINS] Archiving disabled2017-03-09T20:12:48.355 [INFO] Apache Beam :: SDKs :: Common ......................
SUCCESS [  5.472 s]

2017-03-09T20:12:48.355 [INFO] Apache Beam :: SDKs :: Common :: Fn API ............ SUCCESS
[ 17.626 s]
2017-03-09T20:12:48.355 [INFO] Apache Beam :: SDKs :: Common :: Runner API ........ SUCCESS
[ 11.530 s]
2017-03-09T20:12:48.355 [INFO] Apache Beam :: SDKs :: Java ........................ SUCCESS
[  3.578 s]
2017-03-09T20:12:48.355 [INFO] Apache Beam :: SDKs :: Java :: Core ................ SUCCESS
[04:41 min]
2017-03-09T20:12:48.355 [INFO] Apache Beam :: Runners ............................. SUCCESS
[  4.577 s]
2017-03-09T20:12:48.355 [INFO] Apache Beam :: Runners :: Core Java Construction ... SUCCESS
[ 15.538 s]
2017-03-09T20:12:48.355 [INFO] Apache Beam :: Runners :: Google Cloud Dataflow .... FAILURE
[  7.554 s]
2017-03-09T20:12:48.355 [INFO] ------------------------------------------------------------------------
2017-03-09T20:12:48.355 [INFO] BUILD FAILURE
2017-03-09T20:12:48.355 [INFO] ------------------------------------------------------------------------
2017-03-09T20:12:48.355 [INFO] Total time: 11:31 min
2017-03-09T20:12:48.355 [INFO] Finished at: 2017-03-09T20:12:48+00:00
2017-03-09T20:12:48.998 [INFO] Final Memory: 136M/1344M
2017-03-09T20:12:48.998 [INFO] ------------------------------------------------------------------------
Waiting for Jenkins to finish collecting data
2017-03-09T20:13:17.104 [ERROR] Failed to execute goal org.apache.maven.plugins:maven-compiler-plugin:3.6.1:testCompile
(default-testCompile) on project beam-runners-google-cloud-dataflow-java: Compilation failure:
Compilation failure:
2017-03-09T20:13:17.104 [ERROR] <https://builds.apache.org/job/beam_PostCommit_Java_RunnableOnService_Dataflow/ws/runners/google-cloud-dataflow-java/src/test/java/org/apache/beam/runners/dataflow/BatchStatefulParDoOverridesTest.java>:[74,54]
cannot find symbol
2017-03-09T20:13:17.104 [ERROR] symbol:   method getRunner()
2017-03-09T20:13:17.104 [ERROR] location: variable pipeline of type org.apache.beam.sdk.Pipeline
2017-03-09T20:13:17.104 [ERROR] <https://builds.apache.org/job/beam_PostCommit_Java_RunnableOnService_Dataflow/ws/runners/google-cloud-dataflow-java/src/test/java/org/apache/beam/runners/dataflow/BatchStatefulParDoOverridesTest.java>:[92,54]
cannot find symbol
2017-03-09T20:13:17.104 [ERROR] symbol:   method getRunner()
2017-03-09T20:13:17.104 [ERROR] location: variable pipeline of type org.apache.beam.sdk.Pipeline
2017-03-09T20:13:17.104 [ERROR] -> [Help 1]
org.apache.maven.lifecycle.LifecycleExecutionException: Failed to execute goal org.apache.maven.plugins:maven-compiler-plugin:3.6.1:testCompile
(default-testCompile) on project beam-runners-google-cloud-dataflow-java: Compilation failure
	at org.apache.maven.lifecycle.internal.MojoExecutor.execute(MojoExecutor.java:212)
	at org.apache.maven.lifecycle.internal.MojoExecutor.execute(MojoExecutor.java:153)
	at org.apache.maven.lifecycle.internal.MojoExecutor.execute(MojoExecutor.java:145)
	at org.apache.maven.lifecycle.internal.LifecycleModuleBuilder.buildProject(LifecycleModuleBuilder.java:116)
	at org.apache.maven.lifecycle.internal.LifecycleModuleBuilder.buildProject(LifecycleModuleBuilder.java:80)
	at org.apache.maven.lifecycle.internal.builder.singlethreaded.SingleThreadedBuilder.build(SingleThreadedBuilder.java:51)
	at org.apache.maven.lifecycle.internal.LifecycleStarter.execute(LifecycleStarter.java:128)
	at org.apache.maven.DefaultMaven.doExecute(DefaultMaven.java:307)
	at org.apache.maven.DefaultMaven.doExecute(DefaultMaven.java:193)
	at org.apache.maven.DefaultMaven.execute(DefaultMaven.java:106)
	at org.jvnet.hudson.maven3.launcher.Maven33Launcher.main(Maven33Launcher.java:129)
	at sun.reflect.NativeMethodAccessorImpl.invoke0(Native Method)
	at sun.reflect.NativeMethodAccessorImpl.invoke(NativeMethodAccessorImpl.java:62)
	at sun.reflect.DelegatingMethodAccessorImpl.invoke(DelegatingMethodAccessorImpl.java:43)
	at java.lang.reflect.Method.invoke(Method.java:498)
	at org.codehaus.plexus.classworlds.launcher.Launcher.launchStandard(Launcher.java:330)
	at org.codehaus.plexus.classworlds.launcher.Launcher.launch(Launcher.java:238)
	at jenkins.maven3.agent.Maven33Main.launch(Maven33Main.java:176)
	at sun.reflect.NativeMethodAccessorImpl.invoke0(Native Method)
	at sun.reflect.NativeMethodAccessorImpl.invoke(NativeMethodAccessorImpl.java:62)
	at sun.reflect.DelegatingMethodAccessorImpl.invoke(DelegatingMethodAccessorImpl.java:43)
	at java.lang.reflect.Method.invoke(Method.java:498)
	at hudson.maven.Maven3Builder.call(Maven3Builder.java:139)
	at hudson.maven.Maven3Builder.call(Maven3Builder.java:70)
	at hudson.remoting.UserRequest.perform(UserRequest.java:153)
	at hudson.remoting.UserRequest.perform(UserRequest.java:50)
	at hudson.remoting.Request$2.run(Request.java:336)
	at hudson.remoting.InterceptingExecutorService$1.call(InterceptingExecutorService.java:68)
	at java.util.concurrent.FutureTask.run(FutureTask.java:266)
	at java.util.concurrent.ThreadPoolExecutor.runWorker(ThreadPoolExecutor.java:1142)
	at java.util.concurrent.ThreadPoolExecutor$Worker.run(ThreadPoolExecutor.java:617)
	at java.lang.Thread.run(Thread.java:745)
Caused by: org.apache.maven.plugin.compiler.CompilationFailureException: Compilation failure
	at org.apache.maven.plugin.compiler.AbstractCompilerMojo.execute(AbstractCompilerMojo.java:1029)
	at org.apache.maven.plugin.compiler.TestCompilerMojo.execute(TestCompilerMojo.java:170)
	at org.apache.maven.plugin.DefaultBuildPluginManager.executeMojo(DefaultBuildPluginManager.java:134)
	at org.apache.maven.lifecycle.internal.MojoExecutor.execute(MojoExecutor.java:208)
	... 31 more
2017-03-09T20:13:17.105 [ERROR] 
2017-03-09T20:13:17.105 [ERROR] Re-run Maven using the -X switch to enable full debug logging.
2017-03-09T20:13:17.105 [ERROR] 
2017-03-09T20:13:17.105 [ERROR] For more information about the errors and possible solutions,
please read the following articles:
2017-03-09T20:13:17.106 [ERROR] [Help 1] http://cwiki.apache.org/confluence/display/MAVEN/MojoFailureException
2017-03-09T20:13:17.106 [ERROR] 
2017-03-09T20:13:17.106 [ERROR] After correcting the problems, you can resume the build with
the command
2017-03-09T20:13:17.106 [ERROR]   mvn <goals> -rf :beam-runners-google-cloud-dataflow-java
channel stopped

Mime
View raw message