beam-commits mailing list archives

Site index · List index
Message view « Date » · « Thread »
Top « Date » · « Thread »
From Apache Jenkins Server <jenk...@builds.apache.org>
Subject Build failed in Jenkins: beam_PostCommit_Java_MavenInstall #3919
Date Thu, 25 May 2017 18:56:30 GMT
See <https://builds.apache.org/job/beam_PostCommit_Java_MavenInstall/3919/display/redirect?page=changes>

Changes:

[mairbek] writeBatchSize -> writeBatchSizeBytes

[mairbek] Updates from the review

[mairbek] Fallback on specification

[mairbek] Try to drop the database before creating one in the integration test

------------------------------------------
[...truncated 742.39 KB...]
2017-05-25T18:52:32.598 [INFO] Downloaded: https://repo.maven.apache.org/maven2/com/google/cloud/google-cloud-core/1.0.2/google-cloud-core-1.0.2.jar
(117 KB at 422.1 KB/sec)
2017-05-25T18:52:32.599 [INFO] Downloading: https://repo.maven.apache.org/maven2/com/google/cloud/google-cloud-core-grpc/1.0.0-rc3/google-cloud-core-grpc-1.0.0-rc3.jar
2017-05-25T18:52:32.599 [INFO] Downloaded: https://repo.maven.apache.org/maven2/com/google/api/gax/1.1.0/gax-1.1.0.jar
(63 KB at 225.2 KB/sec)
2017-05-25T18:52:32.599 [INFO] Downloading: https://repo.maven.apache.org/maven2/com/google/api/gax-grpc/0.15.0/gax-grpc-0.15.0.jar
2017-05-25T18:52:32.645 [INFO] Downloaded: https://repo.maven.apache.org/maven2/com/google/api/grpc/proto-google-iam-v1/0.1.11/proto-google-iam-v1-0.1.11.jar
(91 KB at 280.2 KB/sec)
2017-05-25T18:52:32.645 [INFO] Downloading: https://repo.maven.apache.org/maven2/com/google/api/grpc/proto-google-cloud-spanner-v1/0.1.9/proto-google-cloud-spanner-v1-0.1.9.jar
2017-05-25T18:52:32.646 [INFO] Downloaded: https://repo.maven.apache.org/maven2/com/google/api/gax-grpc/0.15.0/gax-grpc-0.15.0.jar
(131 KB at 403.6 KB/sec)
2017-05-25T18:52:32.646 [INFO] Downloading: https://repo.maven.apache.org/maven2/com/google/api/grpc/proto-google-cloud-spanner-admin-instance-v1/0.1.9/proto-google-cloud-spanner-admin-instance-v1-0.1.9.jar
2017-05-25T18:52:32.654 [INFO] Downloaded: https://repo.maven.apache.org/maven2/com/google/cloud/google-cloud-core-grpc/1.0.0-rc3/google-cloud-core-grpc-1.0.0-rc3.jar
(11 KB at 32.6 KB/sec)
2017-05-25T18:52:32.654 [INFO] Downloaded: https://repo.maven.apache.org/maven2/com/google/cloud/google-cloud-spanner/0.16.0-beta/google-cloud-spanner-0.16.0-beta.jar
(304 KB at 913.9 KB/sec)
2017-05-25T18:52:32.654 [INFO] Downloading: https://repo.maven.apache.org/maven2/com/google/api/grpc/grpc-google-cloud-spanner-v1/0.1.9/grpc-google-cloud-spanner-v1-0.1.9.jar
2017-05-25T18:52:32.654 [INFO] Downloading: https://repo.maven.apache.org/maven2/com/google/api/grpc/grpc-google-cloud-spanner-admin-database-v1/0.1.9/grpc-google-cloud-spanner-admin-database-v1-0.1.9.jar
2017-05-25T18:52:32.668 [INFO] Downloaded: https://repo.maven.apache.org/maven2/org/threeten/threetenbp/1.3.3/threetenbp-1.3.3.jar
(500 KB at 1443.4 KB/sec)
2017-05-25T18:52:32.668 [INFO] Downloading: https://repo.maven.apache.org/maven2/com/google/api/grpc/grpc-google-cloud-spanner-admin-instance-v1/0.1.9/grpc-google-cloud-spanner-admin-instance-v1-0.1.9.jar
2017-05-25T18:52:32.680 [INFO] Downloaded: https://repo.maven.apache.org/maven2/com/google/api/grpc/grpc-google-cloud-spanner-v1/0.1.9/grpc-google-cloud-spanner-v1-0.1.9.jar
(13 KB at 34.3 KB/sec)
2017-05-25T18:52:32.680 [INFO] Downloading: https://repo.maven.apache.org/maven2/com/google/api/grpc/grpc-google-longrunning-v1/0.1.9/grpc-google-longrunning-v1-0.1.9.jar
2017-05-25T18:52:32.682 [INFO] Downloaded: https://repo.maven.apache.org/maven2/com/google/api/grpc/grpc-google-cloud-spanner-admin-database-v1/0.1.9/grpc-google-cloud-spanner-admin-database-v1-0.1.9.jar
(14 KB at 36.1 KB/sec)
2017-05-25T18:52:32.682 [INFO] Downloading: https://repo.maven.apache.org/maven2/com/google/api/grpc/proto-google-longrunning-v1/0.1.9/proto-google-longrunning-v1-0.1.9.jar
2017-05-25T18:52:32.687 [INFO] Downloaded: https://repo.maven.apache.org/maven2/com/google/api/grpc/proto-google-cloud-spanner-admin-instance-v1/0.1.9/proto-google-cloud-spanner-admin-instance-v1-0.1.9.jar
(165 KB at 449.3 KB/sec)
2017-05-25T18:52:32.687 [INFO] Downloading: https://repo.maven.apache.org/maven2/com/google/cloud/bigtable/bigtable-protos/0.9.6.2/bigtable-protos-0.9.6.2.jar
2017-05-25T18:52:32.696 [INFO] Downloaded: https://repo.maven.apache.org/maven2/com/google/api/grpc/grpc-google-cloud-spanner-admin-instance-v1/0.1.9/grpc-google-cloud-spanner-admin-instance-v1-0.1.9.jar
(14 KB at 35.6 KB/sec)
2017-05-25T18:52:32.696 [INFO] Downloading: https://repo.maven.apache.org/maven2/com/google/cloud/bigtable/bigtable-client-core/0.9.6.2/bigtable-client-core-0.9.6.2.jar
2017-05-25T18:52:32.705 [INFO] Downloaded: https://repo.maven.apache.org/maven2/com/google/api/grpc/proto-google-cloud-spanner-v1/0.1.9/proto-google-cloud-spanner-v1-0.1.9.jar
(407 KB at 1062.5 KB/sec)
2017-05-25T18:52:32.705 [INFO] Downloading: https://repo.maven.apache.org/maven2/commons-logging/commons-logging/1.2/commons-logging-1.2.jar
2017-05-25T18:52:32.708 [INFO] Downloaded: https://repo.maven.apache.org/maven2/com/google/api/grpc/grpc-google-longrunning-v1/0.1.9/grpc-google-longrunning-v1-0.1.9.jar
(10 KB at 24.9 KB/sec)
2017-05-25T18:52:32.708 [INFO] Downloading: https://repo.maven.apache.org/maven2/com/google/auth/google-auth-library-appengine/0.6.0/google-auth-library-appengine-0.6.0.jar
2017-05-25T18:52:32.717 [INFO] Downloaded: https://repo.maven.apache.org/maven2/com/google/api/grpc/proto-google-longrunning-v1/0.1.9/proto-google-longrunning-v1-0.1.9.jar
(68 KB at 170.7 KB/sec)
2017-05-25T18:52:32.718 [INFO] Downloading: https://repo.maven.apache.org/maven2/com/google/appengine/appengine-api-1.0-sdk/1.9.34/appengine-api-1.0-sdk-1.9.34.jar
2017-05-25T18:52:32.735 [INFO] Downloaded: https://repo.maven.apache.org/maven2/com/google/auth/google-auth-library-appengine/0.6.0/google-auth-library-appengine-0.6.0.jar
(5 KB at 11.3 KB/sec)
2017-05-25T18:52:32.735 [INFO] Downloading: https://repo.maven.apache.org/maven2/io/dropwizard/metrics/metrics-core/3.1.2/metrics-core-3.1.2.jar
2017-05-25T18:52:32.742 [INFO] Downloaded: https://repo.maven.apache.org/maven2/com/google/cloud/bigtable/bigtable-client-core/0.9.6.2/bigtable-client-core-0.9.6.2.jar
(208 KB at 493.4 KB/sec)
2017-05-25T18:52:32.742 [INFO] Downloading: https://repo.maven.apache.org/maven2/io/netty/netty-tcnative-boringssl-static/1.1.33.Fork26/netty-tcnative-boringssl-static-1.1.33.Fork26.jar
2017-05-25T18:52:32.744 [INFO] Downloaded: https://repo.maven.apache.org/maven2/commons-logging/commons-logging/1.2/commons-logging-1.2.jar
(61 KB at 143.1 KB/sec)
2017-05-25T18:52:32.744 [INFO] Downloading: https://repo.maven.apache.org/maven2/com/google/api/grpc/proto-google-cloud-spanner-admin-database-v1/0.1.9/proto-google-cloud-spanner-admin-database-v1-0.1.9.jar
2017-05-25T18:52:32.770 [INFO] Downloaded: https://repo.maven.apache.org/maven2/io/dropwizard/metrics/metrics-core/3.1.2/metrics-core-3.1.2.jar
(110 KB at 245.4 KB/sec)
2017-05-25T18:52:32.770 [INFO] Downloading: https://repo.maven.apache.org/maven2/com/google/api/grpc/proto-google-common-protos/0.1.9/proto-google-common-protos-0.1.9.jar
2017-05-25T18:52:32.778 [INFO] Downloaded: https://repo.maven.apache.org/maven2/com/google/cloud/bigtable/bigtable-protos/0.9.6.2/bigtable-protos-0.9.6.2.jar
(792 KB at 1735.4 KB/sec)
2017-05-25T18:52:32.782 [INFO] Downloaded: https://repo.maven.apache.org/maven2/com/google/api/grpc/proto-google-cloud-spanner-admin-database-v1/0.1.9/proto-google-cloud-spanner-admin-database-v1-0.1.9.jar
(132 KB at 286.9 KB/sec)
2017-05-25T18:52:32.928 [INFO] Downloaded: https://repo.maven.apache.org/maven2/com/google/api/grpc/proto-google-common-protos/0.1.9/proto-google-common-protos-0.1.9.jar
(1615 KB at 2664.8 KB/sec)
2017-05-25T18:52:33.025 [INFO] Downloaded: https://repo.maven.apache.org/maven2/io/netty/netty-tcnative-boringssl-static/1.1.33.Fork26/netty-tcnative-boringssl-static-1.1.33.Fork26.jar
(2552 KB at 3629.4 KB/sec)
2017-05-25T18:52:33.964 [INFO] Downloaded: https://repo.maven.apache.org/maven2/com/google/appengine/appengine-api-1.0-sdk/1.9.34/appengine-api-1.0-sdk-1.9.34.jar
(17206 KB at 10478.1 KB/sec)
2017-05-25T18:52:33.978 [INFO] 
2017-05-25T18:52:33.978 [INFO] --- maven-clean-plugin:3.0.0:clean (default-clean) @ beam-sdks-java-io-google-cloud-platform
---
2017-05-25T18:52:33.980 [INFO] Deleting <https://builds.apache.org/job/beam_PostCommit_Java_MavenInstall/ws/sdks/java/io/google-cloud-platform>
(includes = [**/*.pyc, **/*.egg-info/, **/sdks/python/LICENSE, **/sdks/python/NOTICE, **/sdks/python/README.md],
excludes = [])
2017-05-25T18:52:34.081 [INFO] 
2017-05-25T18:52:34.081 [INFO] --- maven-enforcer-plugin:1.4.1:enforce (enforce) @ beam-sdks-java-io-google-cloud-platform
---
2017-05-25T18:52:34.246 [INFO] artifact io.netty:netty-codec-http2: checking for updates from
central
2017-05-25T18:52:35.694 [INFO] 
2017-05-25T18:52:35.694 [INFO] --- maven-enforcer-plugin:1.4.1:enforce (enforce-banned-dependencies)
@ beam-sdks-java-io-google-cloud-platform ---
2017-05-25T18:52:36.319 [INFO] 
2017-05-25T18:52:36.319 [INFO] --- maven-remote-resources-plugin:1.5:process (process-resource-bundles)
@ beam-sdks-java-io-google-cloud-platform ---
2017-05-25T18:52:37.845 [INFO] 
2017-05-25T18:52:37.845 [INFO] --- maven-resources-plugin:3.0.2:resources (default-resources)
@ beam-sdks-java-io-google-cloud-platform ---
2017-05-25T18:52:37.847 [INFO] Using 'UTF-8' encoding to copy filtered resources.
2017-05-25T18:52:37.848 [INFO] skip non existing resourceDirectory <https://builds.apache.org/job/beam_PostCommit_Java_MavenInstall/ws/sdks/java/io/google-cloud-platform/src/main/resources>
2017-05-25T18:52:37.848 [INFO] Copying 3 resources
2017-05-25T18:52:38.160 [INFO] 
2017-05-25T18:52:38.160 [INFO] --- maven-compiler-plugin:3.6.1:compile (default-compile) @
beam-sdks-java-io-google-cloud-platform ---
2017-05-25T18:52:38.176 [INFO] Changes detected - recompiling the module!
2017-05-25T18:52:38.176 [INFO] Compiling 65 source files to <https://builds.apache.org/job/beam_PostCommit_Java_MavenInstall/ws/sdks/java/io/google-cloud-platform/target/classes>
2017-05-25T18:52:39.965 [WARNING] bootstrap class path not set in conjunction with -source
1.7
2017-05-25T18:52:39.965 [INFO] <https://builds.apache.org/job/beam_PostCommit_Java_MavenInstall/ws/sdks/java/io/google-cloud-platform/src/main/java/org/apache/beam/sdk/io/gcp/bigquery/TableRowWriter.java>:
Some input files use or override a deprecated API.
2017-05-25T18:52:39.965 [INFO] <https://builds.apache.org/job/beam_PostCommit_Java_MavenInstall/ws/sdks/java/io/google-cloud-platform/src/main/java/org/apache/beam/sdk/io/gcp/bigquery/TableRowWriter.java>:
Recompile with -Xlint:deprecation for details.
2017-05-25T18:52:39.965 [INFO] <https://builds.apache.org/job/beam_PostCommit_Java_MavenInstall/ws/sdks/java/io/google-cloud-platform/src/main/java/org/apache/beam/sdk/io/gcp/bigquery/ShardedKey.java>:
Some input files use unchecked or unsafe operations.
2017-05-25T18:52:39.965 [INFO] <https://builds.apache.org/job/beam_PostCommit_Java_MavenInstall/ws/sdks/java/io/google-cloud-platform/src/main/java/org/apache/beam/sdk/io/gcp/bigquery/ShardedKey.java>:
Recompile with -Xlint:unchecked for details.
2017-05-25T18:52:40.193 [INFO] 
2017-05-25T18:52:40.194 [INFO] --- maven-resources-plugin:3.0.2:testResources (default-testResources)
@ beam-sdks-java-io-google-cloud-platform ---
2017-05-25T18:52:40.195 [INFO] Using 'UTF-8' encoding to copy filtered resources.
2017-05-25T18:52:40.195 [INFO] skip non existing resourceDirectory <https://builds.apache.org/job/beam_PostCommit_Java_MavenInstall/ws/sdks/java/io/google-cloud-platform/src/test/resources>
2017-05-25T18:52:40.195 [INFO] Copying 3 resources
2017-05-25T18:52:40.765 [INFO] 
2017-05-25T18:52:40.765 [INFO] --- maven-compiler-plugin:3.6.1:testCompile (default-testCompile)
@ beam-sdks-java-io-google-cloud-platform ---
2017-05-25T18:52:40.777 [INFO] Changes detected - recompiling the module!
2017-05-25T18:52:40.778 [INFO] Compiling 34 source files to <https://builds.apache.org/job/beam_PostCommit_Java_MavenInstall/ws/sdks/java/io/google-cloud-platform/target/test-classes>
2017-05-25T18:52:41.754 [INFO] <https://builds.apache.org/job/beam_PostCommit_Java_MavenInstall/ws/sdks/java/io/google-cloud-platform/src/test/java/org/apache/beam/sdk/io/gcp/bigquery/FakeBigQueryServices.java>:
Some input files use or override a deprecated API.
2017-05-25T18:52:41.754 [INFO] <https://builds.apache.org/job/beam_PostCommit_Java_MavenInstall/ws/sdks/java/io/google-cloud-platform/src/test/java/org/apache/beam/sdk/io/gcp/bigquery/FakeBigQueryServices.java>:
Recompile with -Xlint:deprecation for details.
2017-05-25T18:52:41.754 [INFO] <https://builds.apache.org/job/beam_PostCommit_Java_MavenInstall/ws/sdks/java/io/google-cloud-platform/src/test/java/org/apache/beam/sdk/io/gcp/bigquery/FakeBigQueryServices.java>:
Some input files use unchecked or unsafe operations.
2017-05-25T18:52:41.754 [INFO] <https://builds.apache.org/job/beam_PostCommit_Java_MavenInstall/ws/sdks/java/io/google-cloud-platform/src/test/java/org/apache/beam/sdk/io/gcp/bigquery/FakeBigQueryServices.java>:
Recompile with -Xlint:unchecked for details.
2017-05-25T18:52:41.806 [INFO] 
2017-05-25T18:52:41.806 [INFO] --- maven-checkstyle-plugin:2.17:check (default) @ beam-sdks-java-io-google-cloud-platform
---
2017-05-25T18:52:45.726 [INFO] Starting audit...
[ERROR] <https://builds.apache.org/job/beam_PostCommit_Java_MavenInstall/ws/sdks/java/io/google-cloud-platform/src/test/java/org/apache/beam/sdk/io/gcp/spanner/SpannerWriteIT.java>:28:8:
Unused import: com.google.cloud.spanner.ErrorCode. [UnusedImports]
[ERROR] <https://builds.apache.org/job/beam_PostCommit_Java_MavenInstall/ws/sdks/java/io/google-cloud-platform/src/test/java/org/apache/beam/sdk/io/gcp/spanner/SpannerWriteIT.java>:33:8:
Unused import: com.google.cloud.spanner.SpannerException. [UnusedImports]
Audit done.
2017-05-25T18:52:45.727 [INFO] There are 2 errors reported by Checkstyle 6.19 with beam/checkstyle.xml
ruleset.
2017-05-25T18:52:45.733 [ERROR] src/test/java/org/apache/beam/sdk/io/gcp/spanner/SpannerWriteIT.java:[28,8]
(imports) UnusedImports: Unused import: com.google.cloud.spanner.ErrorCode.
2017-05-25T18:52:45.733 [ERROR] src/test/java/org/apache/beam/sdk/io/gcp/spanner/SpannerWriteIT.java:[33,8]
(imports) UnusedImports: Unused import: com.google.cloud.spanner.SpannerException.
[JENKINS] Archiving disabled
2017-05-25T18:52:59.097 [INFO]                                                           
             
2017-05-25T18:52:59.097 [INFO] ------------------------------------------------------------------------
2017-05-25T18:52:59.097 [INFO] Skipping Apache Beam :: Parent
2017-05-25T18:52:59.097 [INFO] This project has been banned from the build due to previous
failures.
2017-05-25T18:52:59.097 [INFO] ------------------------------------------------------------------------
[JENKINS] Archiving disabled
[JENKINS] Archiving disabled
[JENKINS] Archiving disabled
[JENKINS] Archiving disabled
[JENKINS] Archiving disabled
[JENKINS] Archiving disabled
[JENKINS] Archiving disabled
[JENKINS] Archiving disabled
[JENKINS] Archiving disabled
[JENKINS] Archiving disabled
[JENKINS] Archiving disabled
[JENKINS] Archiving disabled
[JENKINS] Archiving disabled
[JENKINS] Archiving disabled
[JENKINS] Archiving disabled
[JENKINS] Archiving disabled
[JENKINS] Archiving disabled
[JENKINS] Archiving disabled
[JENKINS] Archiving disabled
[JENKINS] Archiving disabled
[JENKINS] Archiving disabled
[JENKINS] Archiving disabled
[JENKINS] Archiving disabled
[JENKINS] Archiving disabled
[JENKINS] Archiving disabled
[JENKINS] Archiving disabled
[JENKINS] Archiving disabled
[JENKINS] Archiving disabled
[JENKINS] Archiving disabled
[JENKINS] Archiving disabled
[JENKINS] Archiving disabled
[JENKINS] Archiving disabled
[JENKINS] Archiving disabled
[JENKINS] Archiving disabled
[JENKINS] Archiving disabled
[JENKINS] Archiving disabled
[JENKINS] Archiving disabled
[JENKINS] Archiving disabled
[JENKINS] Archiving disabled
[JENKINS] Archiving disabled
[JENKINS] Archiving disabled
[JENKINS] Archiving disabled
[JENKINS] Archiving disabled
[JENKINS] Archiving disabled
[JENKINS] Archiving disabled
[JENKINS] Archiving disabled2017-05-25T18:53:32.424 [INFO] ------------------------------------------------------------------------
2017-05-25T18:53:32.424 [INFO] Reactor Summary:
2017-05-25T18:53:32.424 [INFO] 

2017-05-25T18:53:32.424 [INFO] Apache Beam :: Parent .............................. SUCCESS
[ 32.568 s]
2017-05-25T18:53:32.424 [INFO] Apache Beam :: SDKs :: Java :: Build Tools ......... SUCCESS
[ 14.722 s]
2017-05-25T18:53:32.425 [INFO] Apache Beam :: SDKs ................................ SUCCESS
[ 17.338 s]
2017-05-25T18:53:32.425 [INFO] Apache Beam :: SDKs :: Common ...................... SUCCESS
[  3.738 s]
2017-05-25T18:53:32.425 [INFO] Apache Beam :: SDKs :: Common :: Fn API ............ SUCCESS
[ 28.595 s]
2017-05-25T18:53:32.425 [INFO] Apache Beam :: SDKs :: Common :: Runner API ........ SUCCESS
[ 21.137 s]
2017-05-25T18:53:32.425 [INFO] Apache Beam :: SDKs :: Java ........................ SUCCESS
[  8.377 s]
2017-05-25T18:53:32.425 [INFO] Apache Beam :: SDKs :: Java :: Core ................ SUCCESS
[03:26 min]
2017-05-25T18:53:32.425 [INFO] Apache Beam :: SDKs :: Java :: IO .................. SUCCESS
[  5.672 s]
2017-05-25T18:53:32.425 [INFO] Apache Beam :: SDKs :: Java :: IO :: Common ........ SUCCESS
[  9.657 s]
2017-05-25T18:53:32.425 [INFO] Apache Beam :: Runners ............................. SUCCESS
[  6.082 s]
2017-05-25T18:53:32.425 [INFO] Apache Beam :: Runners :: Core Construction Java ... SUCCESS
[ 49.427 s]
2017-05-25T18:53:32.425 [INFO] Apache Beam :: Runners :: Core Java ................ SUCCESS
[01:08 min]
2017-05-25T18:53:32.425 [INFO] Apache Beam :: Runners :: Direct Java .............. SUCCESS
[03:15 min]
2017-05-25T18:53:32.425 [INFO] Apache Beam :: SDKs :: Java :: IO :: Elasticsearch . SUCCESS
[ 45.374 s]
2017-05-25T18:53:32.425 [INFO] Apache Beam :: SDKs :: Java :: Extensions .......... SUCCESS
[ 10.198 s]
2017-05-25T18:53:32.425 [INFO] Apache Beam :: SDKs :: Java :: Extensions :: Google Cloud Platform
Core SUCCESS [ 43.871 s]
2017-05-25T18:53:32.425 [INFO] Apache Beam :: SDKs :: Java :: Extensions :: Protobuf SUCCESS
[ 32.172 s]
2017-05-25T18:53:32.425 [INFO] Apache Beam :: SDKs :: Java :: IO :: Google Cloud Platform
FAILURE [ 20.307 s]
2017-05-25T18:53:32.425 [INFO] Apache Beam :: SDKs :: Java :: IO :: Hadoop Common . SKIPPED
2017-05-25T18:53:32.425 [INFO] Apache Beam :: SDKs :: Java :: IO :: Hadoop File System SKIPPED
2017-05-25T18:53:32.425 [INFO] Apache Beam :: SDKs :: Java :: IO :: Hadoop ........ SKIPPED
2017-05-25T18:53:32.425 [INFO] Apache Beam :: SDKs :: Java :: IO :: Hadoop :: input-format
SKIPPED
2017-05-25T18:53:32.425 [INFO] Apache Beam :: Runners :: Google Cloud Dataflow .... SKIPPED
2017-05-25T18:53:32.425 [INFO] Apache Beam :: SDKs :: Java :: IO :: Hadoop :: jdk1.8-tests
SKIPPED
2017-05-25T18:53:32.425 [INFO] Apache Beam :: SDKs :: Java :: IO :: HBase ......... SKIPPED
2017-05-25T18:53:32.425 [INFO] Apache Beam :: SDKs :: Java :: IO :: JDBC .......... SKIPPED
2017-05-25T18:53:32.425 [INFO] Apache Beam :: SDKs :: Java :: IO :: JMS ........... SKIPPED
2017-05-25T18:53:32.425 [INFO] Apache Beam :: SDKs :: Java :: IO :: Kafka ......... SKIPPED
2017-05-25T18:53:32.425 [INFO] Apache Beam :: SDKs :: Java :: IO :: Kinesis ....... SKIPPED
2017-05-25T18:53:32.425 [INFO] Apache Beam :: SDKs :: Java :: IO :: MongoDB ....... SKIPPED
2017-05-25T18:53:32.425 [INFO] Apache Beam :: SDKs :: Java :: IO :: MQTT .......... SKIPPED
2017-05-25T18:53:32.425 [INFO] Apache Beam :: SDKs :: Java :: IO :: XML ........... SKIPPED
2017-05-25T18:53:32.425 [INFO] Apache Beam :: SDKs :: Java :: Maven Archetypes .... SKIPPED
2017-05-25T18:53:32.425 [INFO] Apache Beam :: SDKs :: Java :: Maven Archetypes :: Starter
SKIPPED
2017-05-25T18:53:32.425 [INFO] Apache Beam :: Examples ............................ SKIPPED
2017-05-25T18:53:32.425 [INFO] Apache Beam :: Examples :: Java .................... SKIPPED
2017-05-25T18:53:32.425 [INFO] Apache Beam :: SDKs :: Java :: Maven Archetypes :: Examples
SKIPPED
2017-05-25T18:53:32.425 [INFO] Apache Beam :: Examples :: Java 8 .................. SKIPPED
2017-05-25T18:53:32.425 [INFO] Apache Beam :: SDKs :: Java :: Maven Archetypes :: Examples
- Java 8 SKIPPED
2017-05-25T18:53:32.425 [INFO] Apache Beam :: SDKs :: Java :: Extensions :: Jackson SKIPPED
2017-05-25T18:53:32.425 [INFO] Apache Beam :: SDKs :: Java :: Extensions :: Join library SKIPPED
2017-05-25T18:53:32.425 [INFO] Apache Beam :: SDKs :: Java :: Extensions :: Sorter  SKIPPED
2017-05-25T18:53:32.425 [INFO] Apache Beam :: SDKs :: Java :: Harness ............. SKIPPED
2017-05-25T18:53:32.425 [INFO] Apache Beam :: SDKs :: Java :: Java 8 Tests ........ SKIPPED
2017-05-25T18:53:32.425 [INFO] Apache Beam :: SDKs :: Python ...................... SKIPPED
2017-05-25T18:53:32.425 [INFO] Apache Beam :: Runners :: Flink .................... SKIPPED
2017-05-25T18:53:32.425 [INFO] Apache Beam :: Runners :: Spark .................... SKIPPED
2017-05-25T18:53:32.426 [INFO] Apache Beam :: Runners :: Apex ..................... SKIPPED
2017-05-25T18:53:32.426 [INFO] Apache Beam :: SDKs :: Java :: Aggregated Javadoc .. SKIPPED
2017-05-25T18:53:32.426 [INFO] ------------------------------------------------------------------------
2017-05-25T18:53:32.426 [INFO] BUILD FAILURE
2017-05-25T18:53:32.426 [INFO] ------------------------------------------------------------------------
2017-05-25T18:53:32.426 [INFO] Total time: 16:21 min
2017-05-25T18:53:32.426 [INFO] Finished at: 2017-05-25T18:53:32+00:00
2017-05-25T18:53:33.101 [INFO] Final Memory: 153M/1721M
2017-05-25T18:53:33.101 [INFO] ------------------------------------------------------------------------
Waiting for Jenkins to finish collecting data
2017-05-25T18:54:17.006 [ERROR] Failed to execute goal org.apache.maven.plugins:maven-checkstyle-plugin:2.17:check
(default) on project beam-sdks-java-io-google-cloud-platform: You have 2 Checkstyle violations.
-> [Help 1]
org.apache.maven.lifecycle.LifecycleExecutionException: Failed to execute goal org.apache.maven.plugins:maven-checkstyle-plugin:2.17:check
(default) on project beam-sdks-java-io-google-cloud-platform: You have 2 Checkstyle violations.
	at org.apache.maven.lifecycle.internal.MojoExecutor.execute(MojoExecutor.java:212)
	at org.apache.maven.lifecycle.internal.MojoExecutor.execute(MojoExecutor.java:153)
	at org.apache.maven.lifecycle.internal.MojoExecutor.execute(MojoExecutor.java:145)
	at org.apache.maven.lifecycle.internal.LifecycleModuleBuilder.buildProject(LifecycleModuleBuilder.java:116)
	at org.apache.maven.lifecycle.internal.LifecycleModuleBuilder.buildProject(LifecycleModuleBuilder.java:80)
	at org.apache.maven.lifecycle.internal.builder.singlethreaded.SingleThreadedBuilder.build(SingleThreadedBuilder.java:51)
	at org.apache.maven.lifecycle.internal.LifecycleStarter.execute(LifecycleStarter.java:128)
	at org.apache.maven.DefaultMaven.doExecute(DefaultMaven.java:307)
	at org.apache.maven.DefaultMaven.doExecute(DefaultMaven.java:193)
	at org.apache.maven.DefaultMaven.execute(DefaultMaven.java:106)
	at org.jvnet.hudson.maven3.launcher.Maven33Launcher.main(Maven33Launcher.java:129)
	at sun.reflect.NativeMethodAccessorImpl.invoke0(Native Method)
	at sun.reflect.NativeMethodAccessorImpl.invoke(NativeMethodAccessorImpl.java:62)
	at sun.reflect.DelegatingMethodAccessorImpl.invoke(DelegatingMethodAccessorImpl.java:43)
	at java.lang.reflect.Method.invoke(Method.java:498)
	at org.codehaus.plexus.classworlds.launcher.Launcher.launchStandard(Launcher.java:330)
	at org.codehaus.plexus.classworlds.launcher.Launcher.launch(Launcher.java:238)
	at jenkins.maven3.agent.Maven33Main.launch(Maven33Main.java:176)
	at sun.reflect.NativeMethodAccessorImpl.invoke0(Native Method)
	at sun.reflect.NativeMethodAccessorImpl.invoke(NativeMethodAccessorImpl.java:62)
	at sun.reflect.DelegatingMethodAccessorImpl.invoke(DelegatingMethodAccessorImpl.java:43)
	at java.lang.reflect.Method.invoke(Method.java:498)
	at hudson.maven.Maven3Builder.call(Maven3Builder.java:139)
	at hudson.maven.Maven3Builder.call(Maven3Builder.java:70)
	at hudson.remoting.UserRequest.perform(UserRequest.java:153)
	at hudson.remoting.UserRequest.perform(UserRequest.java:50)
	at hudson.remoting.Request$2.run(Request.java:336)
	at hudson.remoting.InterceptingExecutorService$1.call(InterceptingExecutorService.java:68)
	at java.util.concurrent.FutureTask.run(FutureTask.java:266)
	at java.util.concurrent.ThreadPoolExecutor.runWorker(ThreadPoolExecutor.java:1142)
	at java.util.concurrent.ThreadPoolExecutor$Worker.run(ThreadPoolExecutor.java:617)
	at java.lang.Thread.run(Thread.java:745)
Caused by: org.apache.maven.plugin.MojoFailureException: You have 2 Checkstyle violations.
	at org.apache.maven.plugin.checkstyle.CheckstyleViolationCheckMojo.execute(CheckstyleViolationCheckMojo.java:588)
	at org.apache.maven.plugin.DefaultBuildPluginManager.executeMojo(DefaultBuildPluginManager.java:134)
	at org.apache.maven.lifecycle.internal.MojoExecutor.execute(MojoExecutor.java:208)
	... 31 more
2017-05-25T18:54:17.007 [ERROR] 
2017-05-25T18:54:17.007 [ERROR] Re-run Maven using the -X switch to enable full debug logging.
2017-05-25T18:54:17.007 [ERROR] 
2017-05-25T18:54:17.007 [ERROR] For more information about the errors and possible solutions,
please read the following articles:
2017-05-25T18:54:17.007 [ERROR] [Help 1] http://cwiki.apache.org/confluence/display/MAVEN/MojoFailureException
2017-05-25T18:54:17.007 [ERROR] 
2017-05-25T18:54:17.007 [ERROR] After correcting the problems, you can resume the build with
the command
2017-05-25T18:54:17.007 [ERROR]   mvn <goals> -rf :beam-sdks-java-io-google-cloud-platform
channel stopped
Not sending mail to unregistered user mairbek@google.com

Mime
View raw message