beam-commits mailing list archives

Site index · List index
Message view « Date » · « Thread »
Top « Date » · « Thread »
From Apache Jenkins Server <jenk...@builds.apache.org>
Subject Build failed in Jenkins: beam_PostCommit_Java_ValidatesRunner_Spark #1964
Date Fri, 05 May 2017 22:18:28 GMT
See <https://builds.apache.org/job/beam_PostCommit_Java_ValidatesRunner_Spark/1964/display/redirect?page=changes>

Changes:

[dhalperi] Fix merge bug in SparkRuntimeContext

[lcwik] [BEAM-2174] Update CoderRegistry to allow creating coders through

------------------------------------------
[...truncated 582.66 KB...]
2017-05-05T22:17:11.586 [INFO] Downloaded: https://repo.maven.apache.org/maven2/org/mortbay/jetty/jetty/6.1.26/jetty-6.1.26.jar
(528 KB at 237.3 KB/sec)
2017-05-05T22:17:11.586 [INFO] Downloading: https://repo.maven.apache.org/maven2/javax/xml/bind/jaxb-api/2.2.2/jaxb-api-2.2.2.jar
2017-05-05T22:17:11.591 [INFO] Downloaded: https://repo.maven.apache.org/maven2/stax/stax-api/1.0.1/stax-api-1.0.1.jar
(26 KB at 11.6 KB/sec)
2017-05-05T22:17:11.591 [INFO] Downloading: https://repo.maven.apache.org/maven2/javax/activation/activation/1.1/activation-1.1.jar
2017-05-05T22:17:11.600 [INFO] Downloaded: https://repo.maven.apache.org/maven2/org/codehaus/jettison/jettison/1.1/jettison-1.1.jar
(67 KB at 29.6 KB/sec)
2017-05-05T22:17:11.600 [INFO] Downloading: https://repo.maven.apache.org/maven2/org/codehaus/jackson/jackson-jaxrs/1.8.3/jackson-jaxrs-1.8.3.jar
2017-05-05T22:17:11.625 [INFO] Downloaded: https://repo.maven.apache.org/maven2/javax/activation/activation/1.1/activation-1.1.jar
(62 KB at 27.2 KB/sec)
2017-05-05T22:17:11.625 [INFO] Downloading: https://repo.maven.apache.org/maven2/org/codehaus/jackson/jackson-xc/1.8.3/jackson-xc-1.8.3.jar
2017-05-05T22:17:11.626 [INFO] Downloaded: https://repo.maven.apache.org/maven2/javax/xml/bind/jaxb-api/2.2.2/jaxb-api-2.2.2.jar
(103 KB at 45.4 KB/sec)
2017-05-05T22:17:11.626 [INFO] Downloading: https://repo.maven.apache.org/maven2/tomcat/jasper-compiler/5.5.23/jasper-compiler-5.5.23.jar
2017-05-05T22:17:11.628 [INFO] Downloaded: https://repo.maven.apache.org/maven2/org/codehaus/jackson/jackson-jaxrs/1.8.3/jackson-jaxrs-1.8.3.jar
(18 KB at 7.7 KB/sec)
2017-05-05T22:17:11.628 [INFO] Downloading: https://repo.maven.apache.org/maven2/tomcat/jasper-runtime/5.5.23/jasper-runtime-5.5.23.jar
2017-05-05T22:17:11.656 [INFO] Downloaded: https://repo.maven.apache.org/maven2/org/codehaus/jackson/jackson-xc/1.8.3/jackson-xc-1.8.3.jar
(32 KB at 13.8 KB/sec)
2017-05-05T22:17:11.656 [INFO] Downloading: https://repo.maven.apache.org/maven2/javax/servlet/jsp/jsp-api/2.1/jsp-api-2.1.jar
2017-05-05T22:17:11.664 [INFO] Downloaded: https://repo.maven.apache.org/maven2/tomcat/jasper-runtime/5.5.23/jasper-runtime-5.5.23.jar
(76 KB at 32.6 KB/sec)
2017-05-05T22:17:11.664 [INFO] Downloading: https://repo.maven.apache.org/maven2/commons-el/commons-el/1.0/commons-el-1.0.jar
2017-05-05T22:17:11.698 [INFO] Downloaded: https://repo.maven.apache.org/maven2/javax/servlet/jsp/jsp-api/2.1/jsp-api-2.1.jar
(99 KB at 42.1 KB/sec)
2017-05-05T22:17:11.698 [INFO] Downloading: https://repo.maven.apache.org/maven2/commons-lang/commons-lang/2.5/commons-lang-2.5.jar
2017-05-05T22:17:11.703 [INFO] Downloaded: https://repo.maven.apache.org/maven2/com/sun/xml/bind/jaxb-impl/2.2.3-1/jaxb-impl-2.2.3-1.jar
(870 KB at 371.7 KB/sec)
2017-05-05T22:17:11.703 [INFO] Downloading: https://repo.maven.apache.org/maven2/commons-configuration/commons-configuration/1.6/commons-configuration-1.6.jar
2017-05-05T22:17:11.706 [INFO] Downloaded: https://repo.maven.apache.org/maven2/commons-el/commons-el/1.0/commons-el-1.0.jar
(110 KB at 46.8 KB/sec)
2017-05-05T22:17:11.706 [INFO] Downloading: https://repo.maven.apache.org/maven2/commons-beanutils/commons-beanutils-core/1.8.0/commons-beanutils-core-1.8.0.jar
2017-05-05T22:17:11.712 [INFO] Downloaded: https://repo.maven.apache.org/maven2/tomcat/jasper-compiler/5.5.23/jasper-compiler-5.5.23.jar
(399 KB at 169.8 KB/sec)
2017-05-05T22:17:11.712 [INFO] Downloading: https://repo.maven.apache.org/maven2/org/codehaus/jackson/jackson-core-asl/1.8.8/jackson-core-asl-1.8.8.jar
2017-05-05T22:17:11.758 [INFO] Downloaded: https://repo.maven.apache.org/maven2/commons-lang/commons-lang/2.5/commons-lang-2.5.jar
(273 KB at 113.9 KB/sec)
2017-05-05T22:17:11.758 [INFO] Downloading: https://repo.maven.apache.org/maven2/org/codehaus/jackson/jackson-mapper-asl/1.8.8/jackson-mapper-asl-1.8.8.jar
2017-05-05T22:17:11.769 [INFO] Downloaded: https://repo.maven.apache.org/maven2/commons-beanutils/commons-beanutils-core/1.8.0/commons-beanutils-core-1.8.0.jar
(202 KB at 83.7 KB/sec)
2017-05-05T22:17:11.769 [INFO] Downloading: https://repo.maven.apache.org/maven2/org/apache/hadoop/hadoop-auth/2.2.0/hadoop-auth-2.2.0.jar
2017-05-05T22:17:11.770 [INFO] Downloaded: https://repo.maven.apache.org/maven2/org/codehaus/jackson/jackson-core-asl/1.8.8/jackson-core-asl-1.8.8.jar
(223 KB at 92.3 KB/sec)
2017-05-05T22:17:11.770 [INFO] Downloading: https://repo.maven.apache.org/maven2/com/jcraft/jsch/0.1.42/jsch-0.1.42.jar
2017-05-05T22:17:11.774 [INFO] Downloaded: https://repo.maven.apache.org/maven2/commons-configuration/commons-configuration/1.6/commons-configuration-1.6.jar
(292 KB at 121.1 KB/sec)
2017-05-05T22:17:11.774 [INFO] Downloading: https://repo.maven.apache.org/maven2/org/apache/hadoop/hadoop-mapreduce-client-core/2.2.0/hadoop-mapreduce-client-core-2.2.0.jar
2017-05-05T22:17:11.807 [INFO] Downloaded: https://repo.maven.apache.org/maven2/org/apache/hadoop/hadoop-auth/2.2.0/hadoop-auth-2.2.0.jar
(49 KB at 19.9 KB/sec)
2017-05-05T22:17:11.807 [INFO] Downloading: https://repo.maven.apache.org/maven2/org/apache/hadoop/hadoop-yarn-common/2.2.0/hadoop-yarn-common-2.2.0.jar
2017-05-05T22:17:11.831 [INFO] Downloaded: https://repo.maven.apache.org/maven2/com/jcraft/jsch/0.1.42/jsch-0.1.42.jar
(182 KB at 73.5 KB/sec)
2017-05-05T22:17:11.831 [INFO] Downloading: https://repo.maven.apache.org/maven2/com/google/inject/guice/3.0/guice-3.0.jar
2017-05-05T22:17:11.900 [INFO] Downloaded: https://repo.maven.apache.org/maven2/org/codehaus/jackson/jackson-mapper-asl/1.8.8/jackson-mapper-asl-1.8.8.jar
(653 KB at 257.5 KB/sec)
2017-05-05T22:17:11.900 [INFO] Downloading: https://repo.maven.apache.org/maven2/com/sun/jersey/jersey-test-framework/jersey-test-framework-grizzly2/1.9/jersey-test-framework-grizzly2-1.9.jar
2017-05-05T22:17:11.934 [INFO] Downloaded: https://repo.maven.apache.org/maven2/com/sun/jersey/jersey-test-framework/jersey-test-framework-grizzly2/1.9/jersey-test-framework-grizzly2-1.9.jar
(13 KB at 4.9 KB/sec)
2017-05-05T22:17:11.934 [INFO] Downloading: https://repo.maven.apache.org/maven2/com/sun/jersey/jersey-test-framework/jersey-test-framework-core/1.9/jersey-test-framework-core-1.9.jar
2017-05-05T22:17:11.966 [INFO] Downloaded: https://repo.maven.apache.org/maven2/com/sun/jersey/jersey-test-framework/jersey-test-framework-core/1.9/jersey-test-framework-core-1.9.jar
(28 KB at 10.5 KB/sec)
2017-05-05T22:17:11.966 [INFO] Downloading: https://repo.maven.apache.org/maven2/javax/servlet/javax.servlet-api/3.0.1/javax.servlet-api-3.0.1.jar
2017-05-05T22:17:11.979 [INFO] Downloaded: https://repo.maven.apache.org/maven2/com/google/inject/guice/3.0/guice-3.0.jar
(694 KB at 265.3 KB/sec)
2017-05-05T22:17:11.979 [INFO] Downloading: https://repo.maven.apache.org/maven2/com/sun/jersey/jersey-client/1.9/jersey-client-1.9.jar
2017-05-05T22:17:11.989 [INFO] Downloaded: https://repo.maven.apache.org/maven2/org/apache/hadoop/hadoop-mapreduce-client-core/2.2.0/hadoop-mapreduce-client-core-2.2.0.jar
(1421 KB at 541.3 KB/sec)
2017-05-05T22:17:11.989 [INFO] Downloading: https://repo.maven.apache.org/maven2/com/sun/jersey/jersey-grizzly2/1.9/jersey-grizzly2-1.9.jar
2017-05-05T22:17:12.002 [INFO] Downloaded: https://repo.maven.apache.org/maven2/org/apache/hadoop/hadoop-yarn-common/2.2.0/hadoop-yarn-common-2.2.0.jar
(1272 KB at 481.8 KB/sec)
2017-05-05T22:17:12.002 [INFO] Downloading: https://repo.maven.apache.org/maven2/org/glassfish/grizzly/grizzly-http/2.1.2/grizzly-http-2.1.2.jar
2017-05-05T22:17:12.004 [INFO] Downloaded: https://repo.maven.apache.org/maven2/javax/servlet/javax.servlet-api/3.0.1/javax.servlet-api-3.0.1.jar
(84 KB at 31.6 KB/sec)
2017-05-05T22:17:12.004 [INFO] Downloading: https://repo.maven.apache.org/maven2/org/glassfish/grizzly/grizzly-framework/2.1.2/grizzly-framework-2.1.2.jar
2017-05-05T22:17:12.016 [INFO] Downloaded: https://repo.maven.apache.org/maven2/com/sun/jersey/jersey-client/1.9/jersey-client-1.9.jar
(128 KB at 48.0 KB/sec)
2017-05-05T22:17:12.016 [INFO] Downloading: https://repo.maven.apache.org/maven2/org/glassfish/gmbal/gmbal-api-only/3.0.0-b023/gmbal-api-only-3.0.0-b023.jar
2017-05-05T22:17:12.018 [INFO] Downloaded: https://repo.maven.apache.org/maven2/com/sun/jersey/jersey-grizzly2/1.9/jersey-grizzly2-1.9.jar
(18 KB at 6.5 KB/sec)
2017-05-05T22:17:12.018 [INFO] Downloading: https://repo.maven.apache.org/maven2/org/glassfish/external/management-api/3.0.0-b012/management-api-3.0.0-b012.jar
2017-05-05T22:17:12.045 [INFO] Downloaded: https://repo.maven.apache.org/maven2/org/glassfish/gmbal/gmbal-api-only/3.0.0-b023/gmbal-api-only-3.0.0-b023.jar
(22 KB at 7.9 KB/sec)
2017-05-05T22:17:12.045 [INFO] Downloading: https://repo.maven.apache.org/maven2/org/glassfish/grizzly/grizzly-http-server/2.1.2/grizzly-http-server-2.1.2.jar
2017-05-05T22:17:12.052 [INFO] Downloaded: https://repo.maven.apache.org/maven2/org/glassfish/external/management-api/3.0.0-b012/management-api-3.0.0-b012.jar
(42 KB at 15.3 KB/sec)
2017-05-05T22:17:12.052 [INFO] Downloading: https://repo.maven.apache.org/maven2/org/glassfish/grizzly/grizzly-rcm/2.1.2/grizzly-rcm-2.1.2.jar
2017-05-05T22:17:12.071 [INFO] Downloaded: https://repo.maven.apache.org/maven2/org/glassfish/grizzly/grizzly-http/2.1.2/grizzly-http-2.1.2.jar
(248 KB at 91.3 KB/sec)
2017-05-05T22:17:12.072 [INFO] Downloading: https://repo.maven.apache.org/maven2/org/glassfish/grizzly/grizzly-http-servlet/2.1.2/grizzly-http-servlet-2.1.2.jar
2017-05-05T22:17:12.080 [INFO] Downloaded: https://repo.maven.apache.org/maven2/org/glassfish/grizzly/grizzly-rcm/2.1.2/grizzly-rcm-2.1.2.jar
(8 KB at 2.9 KB/sec)
2017-05-05T22:17:12.080 [INFO] Downloading: https://repo.maven.apache.org/maven2/org/glassfish/javax.servlet/3.1/javax.servlet-3.1.jar
2017-05-05T22:17:12.093 [INFO] Downloaded: https://repo.maven.apache.org/maven2/org/glassfish/grizzly/grizzly-framework/2.1.2/grizzly-framework-2.1.2.jar
(675 KB at 247.1 KB/sec)
2017-05-05T22:17:12.093 [INFO] Downloading: https://repo.maven.apache.org/maven2/com/sun/jersey/contribs/jersey-guice/1.9/jersey-guice-1.9.jar
2017-05-05T22:17:12.099 [INFO] Downloaded: https://repo.maven.apache.org/maven2/org/glassfish/grizzly/grizzly-http-server/2.1.2/grizzly-http-server-2.1.2.jar
(194 KB at 70.8 KB/sec)
2017-05-05T22:17:12.099 [INFO] Downloading: https://repo.maven.apache.org/maven2/com/google/inject/extensions/guice-servlet/3.0/guice-servlet-3.0.jar
2017-05-05T22:17:12.106 [INFO] Downloaded: https://repo.maven.apache.org/maven2/org/scala-lang/scala-compiler/2.10.0/scala-compiler-2.10.0.jar
(13818 KB at 5039.3 KB/sec)
2017-05-05T22:17:12.107 [INFO] Downloading: https://repo.maven.apache.org/maven2/io/netty/netty/3.6.2.Final/netty-3.6.2.Final.jar
2017-05-05T22:17:12.114 [INFO] Downloaded: https://repo.maven.apache.org/maven2/org/glassfish/javax.servlet/3.1/javax.servlet-3.1.jar
(82 KB at 29.8 KB/sec)
2017-05-05T22:17:12.114 [INFO] Downloading: https://repo.maven.apache.org/maven2/com/fasterxml/jackson/core/jackson-core/2.4.4/jackson-core-2.4.4.jar
2017-05-05T22:17:12.122 [INFO] Downloaded: https://repo.maven.apache.org/maven2/com/sun/jersey/contribs/jersey-guice/1.9/jersey-guice-1.9.jar
(15 KB at 5.2 KB/sec)
2017-05-05T22:17:12.122 [INFO] Downloading: https://repo.maven.apache.org/maven2/com/fasterxml/jackson/core/jackson-annotations/2.4.4/jackson-annotations-2.4.4.jar
2017-05-05T22:17:12.129 [INFO] Downloaded: https://repo.maven.apache.org/maven2/org/glassfish/grizzly/grizzly-http-servlet/2.1.2/grizzly-http-servlet-2.1.2.jar
(330 KB at 119.0 KB/sec)
2017-05-05T22:17:12.129 [INFO] Downloading: https://repo.maven.apache.org/maven2/com/fasterxml/jackson/core/jackson-databind/2.4.4/jackson-databind-2.4.4.jar
2017-05-05T22:17:12.131 [INFO] Downloaded: https://repo.maven.apache.org/maven2/com/google/inject/extensions/guice-servlet/3.0/guice-servlet-3.0.jar
(64 KB at 23.0 KB/sec)
2017-05-05T22:17:12.131 [INFO] Downloading: https://repo.maven.apache.org/maven2/org/apache/zookeeper/zookeeper/3.4.6/zookeeper-3.4.6.jar
2017-05-05T22:17:12.156 [INFO] Downloaded: https://repo.maven.apache.org/maven2/com/fasterxml/jackson/core/jackson-annotations/2.4.4/jackson-annotations-2.4.4.jar
(38 KB at 13.5 KB/sec)
2017-05-05T22:17:12.157 [INFO] Downloading: https://repo.maven.apache.org/maven2/jline/jline/0.9.94/jline-0.9.94.jar
2017-05-05T22:17:12.167 [INFO] Downloaded: https://repo.maven.apache.org/maven2/com/fasterxml/jackson/core/jackson-core/2.4.4/jackson-core-2.4.4.jar
(221 KB at 78.6 KB/sec)
2017-05-05T22:17:12.167 [INFO] Downloading: https://repo.maven.apache.org/maven2/org/scala-lang/scala-library/2.10.5/scala-library-2.10.5.jar
2017-05-05T22:17:12.199 [INFO] Downloaded: https://repo.maven.apache.org/maven2/jline/jline/0.9.94/jline-0.9.94.jar
(86 KB at 30.1 KB/sec)
2017-05-05T22:17:12.199 [INFO] Downloading: https://repo.maven.apache.org/maven2/io/dropwizard/metrics/metrics-core/3.1.2/metrics-core-3.1.2.jar
2017-05-05T22:17:12.250 [INFO] Downloaded: https://repo.maven.apache.org/maven2/io/dropwizard/metrics/metrics-core/3.1.2/metrics-core-3.1.2.jar
(110 KB at 38.1 KB/sec)
2017-05-05T22:17:12.250 [INFO] Downloading: https://repo.maven.apache.org/maven2/org/apache/kafka/kafka_2.10/0.9.0.1/kafka_2.10-0.9.0.1.jar
2017-05-05T22:17:12.264 [INFO] Downloaded: https://repo.maven.apache.org/maven2/org/apache/zookeeper/zookeeper/3.4.6/zookeeper-3.4.6.jar
(775 KB at 267.1 KB/sec)
2017-05-05T22:17:12.264 [INFO] Downloading: https://repo.maven.apache.org/maven2/com/101tec/zkclient/0.7/zkclient-0.7.jar
2017-05-05T22:17:12.271 [INFO] Downloaded: https://repo.maven.apache.org/maven2/io/netty/netty/3.6.2.Final/netty-3.6.2.Final.jar
(1172 KB at 403.1 KB/sec)
2017-05-05T22:17:12.272 [INFO] Downloading: https://repo.maven.apache.org/maven2/com/yammer/metrics/metrics-core/2.2.0/metrics-core-2.2.0.jar
2017-05-05T22:17:12.308 [INFO] Downloaded: https://repo.maven.apache.org/maven2/com/fasterxml/jackson/core/jackson-databind/2.4.4/jackson-databind-2.4.4.jar
(1052 KB at 357.4 KB/sec)
2017-05-05T22:17:12.308 [INFO] Downloading: https://repo.maven.apache.org/maven2/net/sf/jopt-simple/jopt-simple/3.2/jopt-simple-3.2.jar
2017-05-05T22:17:12.309 [INFO] Downloaded: https://repo.maven.apache.org/maven2/com/101tec/zkclient/0.7/zkclient-0.7.jar
(73 KB at 24.5 KB/sec)
2017-05-05T22:17:12.309 [INFO] Downloading: https://repo.maven.apache.org/maven2/com/fasterxml/jackson/dataformat/jackson-dataformat-yaml/2.4.4/jackson-dataformat-yaml-2.4.4.jar
2017-05-05T22:17:12.312 [INFO] Downloaded: https://repo.maven.apache.org/maven2/com/yammer/metrics/metrics-core/2.2.0/metrics-core-2.2.0.jar
(81 KB at 27.2 KB/sec)
2017-05-05T22:17:12.312 [INFO] Downloading: https://repo.maven.apache.org/maven2/org/yaml/snakeyaml/1.12/snakeyaml-1.12.jar
2017-05-05T22:17:12.348 [INFO] Downloaded: https://repo.maven.apache.org/maven2/net/sf/jopt-simple/jopt-simple/3.2/jopt-simple-3.2.jar
(52 KB at 17.4 KB/sec)
2017-05-05T22:17:12.378 [INFO] Downloaded: https://repo.maven.apache.org/maven2/org/yaml/snakeyaml/1.12/snakeyaml-1.12.jar
(265 KB at 87.8 KB/sec)
2017-05-05T22:17:12.379 [INFO] Downloaded: https://repo.maven.apache.org/maven2/com/fasterxml/jackson/dataformat/jackson-dataformat-yaml/2.4.4/jackson-dataformat-yaml-2.4.4.jar
(314 KB at 103.9 KB/sec)
2017-05-05T22:17:12.650 [INFO] Downloaded: https://repo.maven.apache.org/maven2/org/apache/kafka/kafka_2.10/0.9.0.1/kafka_2.10-0.9.0.1.jar
(4859 KB at 1478.9 KB/sec)
2017-05-05T22:17:12.765 [INFO] Downloaded: https://repo.maven.apache.org/maven2/org/scala-lang/scala-library/2.10.5/scala-library-2.10.5.jar
(6964 KB at 2048.1 KB/sec)
2017-05-05T22:17:12.798 [INFO] 
2017-05-05T22:17:12.799 [INFO] --- maven-clean-plugin:3.0.0:clean (default-clean) @ beam-runners-spark
---
2017-05-05T22:17:12.801 [INFO] Deleting <https://builds.apache.org/job/beam_PostCommit_Java_ValidatesRunner_Spark/ws/runners/spark>
(includes = [**/*.pyc, **/*.egg-info/, **/sdks/python/LICENSE, **/sdks/python/NOTICE], excludes
= [])
2017-05-05T22:17:12.851 [INFO] 
2017-05-05T22:17:12.852 [INFO] --- maven-enforcer-plugin:1.4.1:enforce (enforce) @ beam-runners-spark
---
2017-05-05T22:17:16.767 [INFO] 
2017-05-05T22:17:16.767 [INFO] --- maven-remote-resources-plugin:1.5:process (process-resource-bundles)
@ beam-runners-spark ---
2017-05-05T22:17:17.116 [INFO] 
2017-05-05T22:17:17.116 [INFO] --- maven-resources-plugin:3.0.2:resources (default-resources)
@ beam-runners-spark ---
2017-05-05T22:17:17.117 [INFO] Using 'UTF-8' encoding to copy filtered resources.
2017-05-05T22:17:17.117 [INFO] skip non existing resourceDirectory <https://builds.apache.org/job/beam_PostCommit_Java_ValidatesRunner_Spark/ws/runners/spark/src/main/resources>
2017-05-05T22:17:17.118 [INFO] Copying 3 resources
2017-05-05T22:17:17.205 [INFO] 
2017-05-05T22:17:17.205 [INFO] --- maven-compiler-plugin:3.6.1:compile (default-compile) @
beam-runners-spark ---
2017-05-05T22:17:17.221 [INFO] Changes detected - recompiling the module!
2017-05-05T22:17:17.222 [INFO] Compiling 81 source files to <https://builds.apache.org/job/beam_PostCommit_Java_ValidatesRunner_Spark/ws/runners/spark/target/classes>
2017-05-05T22:17:18.915 [WARNING] bootstrap class path not set in conjunction with -source
1.7
2017-05-05T22:17:18.915 [INFO] <https://builds.apache.org/job/beam_PostCommit_Java_ValidatesRunner_Spark/ws/runners/spark/src/main/java/org/apache/beam/runners/spark/translation/TransformTranslator.java>:
Some input files use or override a deprecated API.
2017-05-05T22:17:18.915 [INFO] <https://builds.apache.org/job/beam_PostCommit_Java_ValidatesRunner_Spark/ws/runners/spark/src/main/java/org/apache/beam/runners/spark/translation/TransformTranslator.java>:
Recompile with -Xlint:deprecation for details.
2017-05-05T22:17:18.915 [INFO] <https://builds.apache.org/job/beam_PostCommit_Java_ValidatesRunner_Spark/ws/runners/spark/src/main/java/org/apache/beam/runners/spark/translation/TransformTranslator.java>:
Some input files use unchecked or unsafe operations.
2017-05-05T22:17:18.915 [INFO] <https://builds.apache.org/job/beam_PostCommit_Java_ValidatesRunner_Spark/ws/runners/spark/src/main/java/org/apache/beam/runners/spark/translation/TransformTranslator.java>:
Recompile with -Xlint:unchecked for details.
2017-05-05T22:17:18.963 [INFO] 
2017-05-05T22:17:18.963 [INFO] --- maven-resources-plugin:3.0.2:testResources (default-testResources)
@ beam-runners-spark ---
2017-05-05T22:17:18.965 [INFO] Using 'UTF-8' encoding to copy filtered resources.
2017-05-05T22:17:18.965 [INFO] Copying 3 resources
2017-05-05T22:17:19.017 [INFO] Copying 3 resources
2017-05-05T22:17:19.067 [INFO] 
2017-05-05T22:17:19.067 [INFO] --- maven-compiler-plugin:3.6.1:testCompile (default-testCompile)
@ beam-runners-spark ---
2017-05-05T22:17:19.080 [INFO] Changes detected - recompiling the module!
2017-05-05T22:17:19.081 [INFO] Compiling 24 source files to <https://builds.apache.org/job/beam_PostCommit_Java_ValidatesRunner_Spark/ws/runners/spark/target/test-classes>
2017-05-05T22:17:21.505 [INFO] <https://builds.apache.org/job/beam_PostCommit_Java_ValidatesRunner_Spark/ws/runners/spark/src/test/java/org/apache/beam/runners/spark/ForceStreamingTest.java>:
<https://builds.apache.org/job/beam_PostCommit_Java_ValidatesRunner_Spark/ws/runners/spark/src/test/java/org/apache/beam/runners/spark/ForceStreamingTest.java>
uses or overrides a deprecated API.
2017-05-05T22:17:21.505 [INFO] <https://builds.apache.org/job/beam_PostCommit_Java_ValidatesRunner_Spark/ws/runners/spark/src/test/java/org/apache/beam/runners/spark/ForceStreamingTest.java>:
Recompile with -Xlint:deprecation for details.
2017-05-05T22:17:21.505 [INFO] <https://builds.apache.org/job/beam_PostCommit_Java_ValidatesRunner_Spark/ws/runners/spark/src/test/java/org/apache/beam/runners/spark/translation/streaming/TrackStreamingSourcesTest.java>:
Some input files use unchecked or unsafe operations.
2017-05-05T22:17:21.505 [INFO] <https://builds.apache.org/job/beam_PostCommit_Java_ValidatesRunner_Spark/ws/runners/spark/src/test/java/org/apache/beam/runners/spark/translation/streaming/TrackStreamingSourcesTest.java>:
Recompile with -Xlint:unchecked for details.
2017-05-05T22:17:21.505 [INFO] -------------------------------------------------------------
2017-05-05T22:17:21.505 [ERROR] COMPILATION ERROR : 
2017-05-05T22:17:21.505 [INFO] -------------------------------------------------------------
2017-05-05T22:17:21.505 [ERROR] <https://builds.apache.org/job/beam_PostCommit_Java_ValidatesRunner_Spark/ws/runners/spark/src/test/java/org/apache/beam/runners/spark/translation/SparkRuntimeContextTest.java>:[108,35]
constructor SparkRuntimeContext in class org.apache.beam.runners.spark.translation.SparkRuntimeContext
cannot be applied to given types;
  required: org.apache.beam.sdk.Pipeline,org.apache.beam.sdk.options.PipelineOptions
  found: org.apache.beam.sdk.Pipeline
  reason: actual and formal argument lists differ in length
2017-05-05T22:17:21.505 [INFO] 1 error
2017-05-05T22:17:21.505 [INFO] -------------------------------------------------------------
[JENKINS] Archiving disabled
[JENKINS] Archiving disabled
[JENKINS] Archiving disabled
[JENKINS] Archiving disabled
[JENKINS] Archiving disabled
[JENKINS] Archiving disabled
[JENKINS] Archiving disabled
[JENKINS] Archiving disabled
[JENKINS] Archiving disabled
[JENKINS] Archiving disabled
[JENKINS] Archiving disabled
[JENKINS] Archiving disabled
[JENKINS] Archiving disabled
[JENKINS] Archiving disabled
[JENKINS] Archiving disabled
[JENKINS] Archiving disabled
2017-05-05T22:17:30.782 [INFO] ------------------------------------------------------------------------
2017-05-05T22:17:30.783 [INFO] Reactor Summary:
2017-05-05T22:17:30.783 [INFO] 
2017-05-05T22:17:30.783 [INFO] Apache Beam :: Parent .............................. SUCCESS
[ 35.407 s]
2017-05-05T22:17:30.783 [INFO] Apache Beam :: SDKs :: Java :: Build Tools ......... SUCCESS
[  9.713 s]
2017-05-05T22:17:30.783 [INFO] Apache Beam :: SDKs ................................ SUCCESS
[  3.451 s]
2017-05-05T22:17:30.783 [INFO] Apache Beam :: SDKs :: Common ...................... SUCCESS
[  1.673 s]
2017-05-05T22:17:30.783 [INFO] Apache Beam :: SDKs :: Common :: Fn API ............ SUCCESS
[ 20.092 s]
2017-05-05T22:17:30.783 [INFO] Apache Beam :: SDKs :: Common :: Runner API ........ SUCCESS
[  3.963 s]
2017-05-05T22:17:30.783 [INFO] Apache Beam :: SDKs :: Java ........................ SUCCESS
[  2.833 s]
2017-05-05T22:17:30.783 [INFO] Apache Beam :: SDKs :: Java :: Core ................ SUCCESS
[02:07 min]
2017-05-05T22:17:30.783 [INFO] Apache Beam :: SDKs :: Java :: IO .................. SUCCESS
[  1.554 s]
2017-05-05T22:17:30.783 [INFO] Apache Beam :: Runners ............................. SUCCESS
[  1.525 s]
2017-05-05T22:17:30.783 [INFO] Apache Beam :: Runners :: Core Construction Java ... SUCCESS
[ 12.945 s]
2017-05-05T22:17:30.783 [INFO] Apache Beam :: Runners :: Core Java ................ SUCCESS
[ 31.884 s]
2017-05-05T22:17:30.783 [INFO] Apache Beam :: Runners :: Direct Java .............. SUCCESS
[02:32 min]
2017-05-05T22:17:30.783 [INFO] Apache Beam :: SDKs :: Java :: IO :: Kafka ......... SUCCESS
[ 25.857 s]
2017-05-05T22:17:30.783 [INFO] Apache Beam :: Runners :: Spark .................... FAILURE
[ 18.927 s]
2017-05-05T22:17:30.783 [INFO] ------------------------------------------------------------------------
2017-05-05T22:17:30.783 [INFO] BUILD FAILURE
2017-05-05T22:17:30.783 [INFO] ------------------------------------------------------------------------
2017-05-05T22:17:30.784 [INFO] Total time: 08:20 min
2017-05-05T22:17:30.784 [INFO] Finished at: 2017-05-05T22:17:30+00:00
2017-05-05T22:17:31.498 [INFO] Final Memory: 134M/1670M
2017-05-05T22:17:31.498 [INFO] ------------------------------------------------------------------------
2017-05-05T22:17:31.498 [WARNING] The requested profile "validates-runner-tests" could not
be activated because it does not exist.
Waiting for Jenkins to finish collecting data
2017-05-05T22:18:17.626 [ERROR] Failed to execute goal org.apache.maven.plugins:maven-compiler-plugin:3.6.1:testCompile
(default-testCompile) on project beam-runners-spark: Compilation failure
2017-05-05T22:18:17.626 [ERROR] <https://builds.apache.org/job/beam_PostCommit_Java_ValidatesRunner_Spark/ws/runners/spark/src/test/java/org/apache/beam/runners/spark/translation/SparkRuntimeContextTest.java>:[108,35]
constructor SparkRuntimeContext in class org.apache.beam.runners.spark.translation.SparkRuntimeContext
cannot be applied to given types;
2017-05-05T22:18:17.626 [ERROR] required: org.apache.beam.sdk.Pipeline,org.apache.beam.sdk.options.PipelineOptions
2017-05-05T22:18:17.626 [ERROR] found: org.apache.beam.sdk.Pipeline
2017-05-05T22:18:17.626 [ERROR] reason: actual and formal argument lists differ in length
2017-05-05T22:18:17.626 [ERROR] -> [Help 1]
org.apache.maven.lifecycle.LifecycleExecutionException: Failed to execute goal org.apache.maven.plugins:maven-compiler-plugin:3.6.1:testCompile
(default-testCompile) on project beam-runners-spark: Compilation failure
<https://builds.apache.org/job/beam_PostCommit_Java_ValidatesRunner_Spark/ws/runners/spark/src/test/java/org/apache/beam/runners/spark/translation/SparkRuntimeContextTest.java>:[108,35]
constructor SparkRuntimeContext in class org.apache.beam.runners.spark.translation.SparkRuntimeContext
cannot be applied to given types;
  required: org.apache.beam.sdk.Pipeline,org.apache.beam.sdk.options.PipelineOptions
  found: org.apache.beam.sdk.Pipeline
  reason: actual and formal argument lists differ in length

	at org.apache.maven.lifecycle.internal.MojoExecutor.execute(MojoExecutor.java:212)
	at org.apache.maven.lifecycle.internal.MojoExecutor.execute(MojoExecutor.java:153)
	at org.apache.maven.lifecycle.internal.MojoExecutor.execute(MojoExecutor.java:145)
	at org.apache.maven.lifecycle.internal.LifecycleModuleBuilder.buildProject(LifecycleModuleBuilder.java:116)
	at org.apache.maven.lifecycle.internal.LifecycleModuleBuilder.buildProject(LifecycleModuleBuilder.java:80)
	at org.apache.maven.lifecycle.internal.builder.singlethreaded.SingleThreadedBuilder.build(SingleThreadedBuilder.java:51)
	at org.apache.maven.lifecycle.internal.LifecycleStarter.execute(LifecycleStarter.java:128)
	at org.apache.maven.DefaultMaven.doExecute(DefaultMaven.java:307)
	at org.apache.maven.DefaultMaven.doExecute(DefaultMaven.java:193)
	at org.apache.maven.DefaultMaven.execute(DefaultMaven.java:106)
	at org.jvnet.hudson.maven3.launcher.Maven33Launcher.main(Maven33Launcher.java:129)
	at sun.reflect.NativeMethodAccessorImpl.invoke0(Native Method)
	at sun.reflect.NativeMethodAccessorImpl.invoke(NativeMethodAccessorImpl.java:62)
	at sun.reflect.DelegatingMethodAccessorImpl.invoke(DelegatingMethodAccessorImpl.java:43)
	at java.lang.reflect.Method.invoke(Method.java:498)
	at org.codehaus.plexus.classworlds.launcher.Launcher.launchStandard(Launcher.java:330)
	at org.codehaus.plexus.classworlds.launcher.Launcher.launch(Launcher.java:238)
	at jenkins.maven3.agent.Maven33Main.launch(Maven33Main.java:176)
	at sun.reflect.NativeMethodAccessorImpl.invoke0(Native Method)
	at sun.reflect.NativeMethodAccessorImpl.invoke(NativeMethodAccessorImpl.java:62)
	at sun.reflect.DelegatingMethodAccessorImpl.invoke(DelegatingMethodAccessorImpl.java:43)
	at java.lang.reflect.Method.invoke(Method.java:498)
	at hudson.maven.Maven3Builder.call(Maven3Builder.java:139)
	at hudson.maven.Maven3Builder.call(Maven3Builder.java:70)
	at hudson.remoting.UserRequest.perform(UserRequest.java:153)
	at hudson.remoting.UserRequest.perform(UserRequest.java:50)
	at hudson.remoting.Request$2.run(Request.java:336)
	at hudson.remoting.InterceptingExecutorService$1.call(InterceptingExecutorService.java:68)
	at java.util.concurrent.FutureTask.run(FutureTask.java:266)
	at java.util.concurrent.ThreadPoolExecutor.runWorker(ThreadPoolExecutor.java:1142)
	at java.util.concurrent.ThreadPoolExecutor$Worker.run(ThreadPoolExecutor.java:617)
	at java.lang.Thread.run(Thread.java:745)
Caused by: org.apache.maven.plugin.compiler.CompilationFailureException: Compilation failure
<https://builds.apache.org/job/beam_PostCommit_Java_ValidatesRunner_Spark/ws/runners/spark/src/test/java/org/apache/beam/runners/spark/translation/SparkRuntimeContextTest.java>:[108,35]
constructor SparkRuntimeContext in class org.apache.beam.runners.spark.translation.SparkRuntimeContext
cannot be applied to given types;
  required: org.apache.beam.sdk.Pipeline,org.apache.beam.sdk.options.PipelineOptions
  found: org.apache.beam.sdk.Pipeline
  reason: actual and formal argument lists differ in length

	at org.apache.maven.plugin.compiler.AbstractCompilerMojo.execute(AbstractCompilerMojo.java:1029)
	at org.apache.maven.plugin.compiler.TestCompilerMojo.execute(TestCompilerMojo.java:170)
	at org.apache.maven.plugin.DefaultBuildPluginManager.executeMojo(DefaultBuildPluginManager.java:134)
	at org.apache.maven.lifecycle.internal.MojoExecutor.execute(MojoExecutor.java:208)
	... 31 more
2017-05-05T22:18:17.627 [ERROR] 
2017-05-05T22:18:17.627 [ERROR] Re-run Maven using the -X switch to enable full debug logging.
2017-05-05T22:18:17.627 [ERROR] 
2017-05-05T22:18:17.627 [ERROR] For more information about the errors and possible solutions,
please read the following articles:
2017-05-05T22:18:17.627 [ERROR] [Help 1] http://cwiki.apache.org/confluence/display/MAVEN/MojoFailureException
2017-05-05T22:18:17.628 [ERROR] 
2017-05-05T22:18:17.628 [ERROR] After correcting the problems, you can resume the build with
the command
2017-05-05T22:18:17.628 [ERROR]   mvn <goals> -rf :beam-runners-spark
channel stopped

Mime
View raw message