beam-commits mailing list archives

Site index · List index
Message view « Date » · « Thread »
Top « Date » · « Thread »
From Apache Jenkins Server <jenk...@builds.apache.org>
Subject Build failed in Jenkins: beam_PostCommit_Java_JDK_Versions_Test » OpenJDK 8 (on Ubuntu only),beam #21
Date Tue, 23 May 2017 01:41:29 GMT
See <https://builds.apache.org/job/beam_PostCommit_Java_JDK_Versions_Test/jdk=OpenJDK%208%20(on%20Ubuntu%20only),label=beam/21/display/redirect?page=changes>

Changes:

[tgroh] Include Additional PTransform inputs in Transform Nodes

------------------------------------------
[...truncated 1.06 MB...]
2017-05-23\T\01:36:38.468 [INFO] Excluding com.google.apis:google-api-services-storage:jar:v1-rev71-1.22.0
from the shaded jar.
2017-05-23\T\01:36:38.468 [INFO] Excluding org.apache.beam:beam-sdks-java-io-google-cloud-platform:jar:2.1.0-SNAPSHOT
from the shaded jar.
2017-05-23\T\01:36:38.468 [INFO] Excluding org.apache.beam:beam-sdks-java-extensions-protobuf:jar:2.1.0-SNAPSHOT
from the shaded jar.
2017-05-23\T\01:36:38.468 [INFO] Excluding com.google.api.grpc:grpc-google-pubsub-v1:jar:0.1.0
from the shaded jar.
2017-05-23\T\01:36:38.468 [INFO] Excluding com.google.api.grpc:grpc-google-iam-v1:jar:0.1.0
from the shaded jar.
2017-05-23\T\01:36:38.468 [INFO] Excluding io.grpc:grpc-auth:jar:1.2.0 from the shaded jar.
2017-05-23\T\01:36:38.468 [INFO] Excluding io.grpc:grpc-core:jar:1.2.0 from the shaded jar.
2017-05-23\T\01:36:38.468 [INFO] Excluding com.google.errorprone:error_prone_annotations:jar:2.0.15
from the shaded jar.
2017-05-23\T\01:36:38.468 [INFO] Excluding io.grpc:grpc-context:jar:1.2.0 from the shaded
jar.
2017-05-23\T\01:36:38.468 [INFO] Excluding com.google.instrumentation:instrumentation-api:jar:0.3.0
from the shaded jar.
2017-05-23\T\01:36:38.468 [INFO] Excluding io.grpc:grpc-netty:jar:1.2.0 from the shaded jar.
2017-05-23\T\01:36:38.468 [INFO] Excluding io.netty:netty-codec-http2:jar:4.1.8.Final from
the shaded jar.
2017-05-23\T\01:36:38.468 [INFO] Excluding io.netty:netty-codec-http:jar:4.1.8.Final from
the shaded jar.
2017-05-23\T\01:36:38.468 [INFO] Excluding io.netty:netty-handler-proxy:jar:4.1.8.Final from
the shaded jar.
2017-05-23\T\01:36:38.468 [INFO] Excluding io.netty:netty-codec-socks:jar:4.1.8.Final from
the shaded jar.
2017-05-23\T\01:36:38.468 [INFO] Excluding io.netty:netty-handler:jar:4.1.8.Final from the
shaded jar.
2017-05-23\T\01:36:38.468 [INFO] Excluding io.netty:netty-buffer:jar:4.1.8.Final from the
shaded jar.
2017-05-23\T\01:36:38.468 [INFO] Excluding io.netty:netty-common:jar:4.1.8.Final from the
shaded jar.
2017-05-23\T\01:36:38.468 [INFO] Excluding io.netty:netty-transport:jar:4.1.8.Final from the
shaded jar.
2017-05-23\T\01:36:38.468 [INFO] Excluding io.netty:netty-resolver:jar:4.1.8.Final from the
shaded jar.
2017-05-23\T\01:36:38.468 [INFO] Excluding io.netty:netty-codec:jar:4.1.8.Final from the shaded
jar.
2017-05-23\T\01:36:38.468 [INFO] Excluding io.grpc:grpc-stub:jar:1.2.0 from the shaded jar.
2017-05-23\T\01:36:38.468 [INFO] Excluding io.grpc:grpc-all:jar:1.2.0 from the shaded jar.
2017-05-23\T\01:36:38.468 [INFO] Excluding io.grpc:grpc-okhttp:jar:1.2.0 from the shaded jar.
2017-05-23\T\01:36:38.468 [INFO] Excluding com.squareup.okhttp:okhttp:jar:2.5.0 from the shaded
jar.
2017-05-23\T\01:36:38.468 [INFO] Excluding com.squareup.okio:okio:jar:1.6.0 from the shaded
jar.
2017-05-23\T\01:36:38.468 [INFO] Excluding io.grpc:grpc-protobuf:jar:1.2.0 from the shaded
jar.
2017-05-23\T\01:36:38.468 [INFO] Excluding com.google.protobuf:protobuf-java-util:jar:3.2.0
from the shaded jar.
2017-05-23\T\01:36:38.468 [INFO] Excluding com.google.code.gson:gson:jar:2.7 from the shaded
jar.
2017-05-23\T\01:36:38.468 [INFO] Excluding io.grpc:grpc-protobuf-lite:jar:1.2.0 from the shaded
jar.
2017-05-23\T\01:36:38.468 [INFO] Excluding io.grpc:grpc-protobuf-nano:jar:1.2.0 from the shaded
jar.
2017-05-23\T\01:36:38.469 [INFO] Excluding com.google.protobuf.nano:protobuf-javanano:jar:3.0.0-alpha-5
from the shaded jar.
2017-05-23\T\01:36:38.469 [INFO] Excluding com.google.cloud.bigtable:bigtable-protos:jar:0.9.6.2
from the shaded jar.
2017-05-23\T\01:36:38.469 [INFO] Excluding com.google.cloud.bigtable:bigtable-client-core:jar:0.9.6.2
from the shaded jar.
2017-05-23\T\01:36:38.469 [INFO] Excluding commons-logging:commons-logging:jar:1.2 from the
shaded jar.
2017-05-23\T\01:36:38.469 [INFO] Excluding com.google.auth:google-auth-library-appengine:jar:0.6.0
from the shaded jar.
2017-05-23\T\01:36:38.469 [INFO] Excluding com.google.appengine:appengine-api-1.0-sdk:jar:1.9.34
from the shaded jar.
2017-05-23\T\01:36:38.469 [INFO] Excluding io.dropwizard.metrics:metrics-core:jar:3.1.2 from
the shaded jar.
2017-05-23\T\01:36:38.469 [INFO] Excluding com.google.api.grpc:grpc-google-common-protos:jar:0.1.0
from the shaded jar.
2017-05-23\T\01:36:38.469 [INFO] Excluding io.netty:netty-tcnative-boringssl-static:jar:1.1.33.Fork26
from the shaded jar.
2017-05-23\T\01:36:38.469 [INFO] Excluding com.google.api-client:google-api-client:jar:1.22.0
from the shaded jar.
2017-05-23\T\01:36:38.469 [INFO] Excluding com.google.oauth-client:google-oauth-client:jar:1.22.0
from the shaded jar.
2017-05-23\T\01:36:38.469 [INFO] Excluding com.google.apis:google-api-services-bigquery:jar:v2-rev295-1.22.0
from the shaded jar.
2017-05-23\T\01:36:38.469 [INFO] Excluding com.google.code.findbugs:jsr305:jar:3.0.1 from
the shaded jar.
2017-05-23\T\01:36:38.469 [INFO] Excluding com.google.http-client:google-http-client:jar:1.22.0
from the shaded jar.
2017-05-23\T\01:36:38.469 [INFO] Excluding org.apache.httpcomponents:httpclient:jar:4.0.1
from the shaded jar.
2017-05-23\T\01:36:38.469 [INFO] Excluding org.apache.httpcomponents:httpcore:jar:4.0.1 from
the shaded jar.
2017-05-23\T\01:36:38.469 [INFO] Excluding commons-codec:commons-codec:jar:1.3 from the shaded
jar.
2017-05-23\T\01:36:38.469 [INFO] Excluding com.google.cloud.bigdataoss:util:jar:1.4.5 from
the shaded jar.
2017-05-23\T\01:36:38.469 [INFO] Excluding com.google.api-client:google-api-client-java6:jar:1.22.0
from the shaded jar.
2017-05-23\T\01:36:38.469 [INFO] Excluding com.google.api-client:google-api-client-jackson2:jar:1.22.0
from the shaded jar.
2017-05-23\T\01:36:38.469 [INFO] Excluding com.google.oauth-client:google-oauth-client-java6:jar:1.22.0
from the shaded jar.
2017-05-23\T\01:36:38.469 [INFO] Excluding com.google.auth:google-auth-library-oauth2-http:jar:0.6.1
from the shaded jar.
2017-05-23\T\01:36:38.469 [INFO] Excluding com.google.auth:google-auth-library-credentials:jar:0.6.1
from the shaded jar.
2017-05-23\T\01:36:38.469 [INFO] Excluding org.apache.avro:avro:jar:1.8.1 from the shaded
jar.
2017-05-23\T\01:36:38.469 [INFO] Excluding org.codehaus.jackson:jackson-core-asl:jar:1.9.13
from the shaded jar.
2017-05-23\T\01:36:38.469 [INFO] Excluding org.codehaus.jackson:jackson-mapper-asl:jar:1.9.13
from the shaded jar.
2017-05-23\T\01:36:38.469 [INFO] Excluding com.thoughtworks.paranamer:paranamer:jar:2.7 from
the shaded jar.
2017-05-23\T\01:36:38.469 [INFO] Excluding org.tukaani:xz:jar:1.5 from the shaded jar.
2017-05-23\T\01:36:38.469 [INFO] Excluding com.google.apis:google-api-services-pubsub:jar:v1-rev10-1.22.0
from the shaded jar.
2017-05-23\T\01:36:38.469 [INFO] Including com.google.guava:guava:jar:20.0 in the shaded jar.
2017-05-23\T\01:36:38.469 [INFO] Excluding com.google.cloud.datastore:datastore-v1-proto-client:jar:1.4.0
from the shaded jar.
2017-05-23\T\01:36:38.469 [INFO] Excluding com.google.http-client:google-http-client-protobuf:jar:1.22.0
from the shaded jar.
2017-05-23\T\01:36:38.469 [INFO] Excluding com.google.http-client:google-http-client-jackson:jar:1.22.0
from the shaded jar.
2017-05-23\T\01:36:38.469 [INFO] Excluding com.google.cloud.datastore:datastore-v1-protos:jar:1.3.0
from the shaded jar.
2017-05-23\T\01:36:38.469 [INFO] Excluding joda-time:joda-time:jar:2.4 from the shaded jar.
2017-05-23\T\01:36:38.469 [INFO] Excluding org.slf4j:slf4j-api:jar:1.7.14 from the shaded
jar.
2017-05-23\T\01:36:38.469 [INFO] Excluding org.slf4j:slf4j-jdk14:jar:1.7.14 from the shaded
jar.
2017-05-23\T\01:36:38.469 [INFO] Excluding org.apache.beam:beam-sdks-common-runner-api:jar:2.1.0-SNAPSHOT
from the shaded jar.
2017-05-23\T\01:36:38.469 [INFO] Excluding org.apache.beam:beam-runners-core-construction-java:jar:2.1.0-SNAPSHOT
from the shaded jar.
2017-05-23\T\01:36:38.469 [INFO] Excluding org.apache.beam:beam-runners-google-cloud-dataflow-java:jar:2.1.0-SNAPSHOT
from the shaded jar.
2017-05-23\T\01:36:38.469 [INFO] Excluding com.google.apis:google-api-services-dataflow:jar:v1b3-rev196-1.22.0
from the shaded jar.
2017-05-23\T\01:36:38.469 [INFO] Excluding com.google.apis:google-api-services-clouddebugger:jar:v2-rev8-1.22.0
from the shaded jar.
2017-05-23\T\01:36:40.482 [INFO] Replacing original artifact with shaded artifact.
2017-05-23\T\01:36:40.482 [INFO] Replacing <https://builds.apache.org/job/beam_PostCommit_Java_JDK_Versions_Test/jdk=OpenJDK%208%20(on%20Ubuntu%20only),label=beam/ws/examples/java/target/beam-examples-java-2.1.0-SNAPSHOT.jar>
with <https://builds.apache.org/job/beam_PostCommit_Java_JDK_Versions_Test/jdk=OpenJDK%208%20(on%20Ubuntu%20only),label=beam/ws/examples/java/target/beam-examples-java-2.1.0-SNAPSHOT-shaded.jar>
2017-05-23\T\01:36:40.482 [INFO] Replacing original test artifact with shaded test artifact.
2017-05-23\T\01:36:40.482 [INFO] Replacing <https://builds.apache.org/job/beam_PostCommit_Java_JDK_Versions_Test/jdk=OpenJDK%208%20(on%20Ubuntu%20only),label=beam/ws/examples/java/target/beam-examples-java-2.1.0-SNAPSHOT-tests.jar>
with <https://builds.apache.org/job/beam_PostCommit_Java_JDK_Versions_Test/jdk=OpenJDK%208%20(on%20Ubuntu%20only),label=beam/ws/examples/java/target/beam-examples-java-2.1.0-SNAPSHOT-shaded-tests.jar>
2017-05-23\T\01:36:40.483 [INFO] Dependency-reduced POM written at: <https://builds.apache.org/job/beam_PostCommit_Java_JDK_Versions_Test/jdk=OpenJDK%208%20(on%20Ubuntu%20only),label=beam/ws/examples/java/dependency-reduced-pom.xml>
2017-05-23\T\01:36:40.572 [INFO] 
2017-05-23\T\01:36:40.572 [INFO] --- maven-failsafe-plugin:2.20:integration-test (default)
@ beam-examples-java ---
2017-05-23\T\01:36:40.576 [INFO] Failsafe report directory: <https://builds.apache.org/job/beam_PostCommit_Java_JDK_Versions_Test/jdk=OpenJDK%208%20(on%20Ubuntu%20only),label=beam/ws/examples/java/target/failsafe-reports>
2017-05-23\T\01:36:40.576 [INFO] parallel='all', perCoreThreadCount=true, threadCount=4, useUnlimitedThreads=false,
threadCountSuites=0, threadCountClasses=0, threadCountMethods=0, parallelOptimized=true
2017-05-23\T\01:36:40.578 [INFO] 
2017-05-23\T\01:36:40.578 [INFO] -------------------------------------------------------
2017-05-23\T\01:36:40.578 [INFO]  T E S T S
2017-05-23\T\01:36:40.578 [INFO] -------------------------------------------------------
2017-05-23\T\01:41:26.086 [INFO] Running org.apache.beam.examples.cookbook.BigQueryTornadoesIT
2017-05-23\T\01:41:26.098 [ERROR] Tests run: 1, Failures: 0, Errors: 1, Skipped: 0, Time elapsed:
22.274 s <<< FAILURE! - in org.apache.beam.examples.cookbook.BigQueryTornadoesIT
2017-05-23\T\01:41:26.099 [ERROR] testE2EBigQueryTornadoes(org.apache.beam.examples.cookbook.BigQueryTornadoesIT)
 Time elapsed: 22.274 s  <<< ERROR!
java.lang.IllegalArgumentException: AppliedPTransform{fullName=BigQueryIO.Write/BatchLoads/TempFilePrefixView/Combine.GloballyAsSingletonView/Combine.globally(Singleton)/Values/Values/Map/ParMultiDo(Anonymous),
inputs={Tag<org.apache.beam.sdk.values.PValueBase.<init>:92#e955fd8255d138c9>=BigQueryIO.Write/BatchLoads/TempFilePrefixView/Combine.GloballyAsSingletonView/Combine.globally(Singleton)/Combine.perKey(Singleton)/Combine.GroupedValues/ParDo(Anonymous)/ParMultiDo(Anonymous).out0
[PCollection]}, outputs={Tag<org.apache.beam.sdk.transforms.ParDo$SingleOutput.expand:618#2ada02c994b5879d>=BigQueryIO.Write/BatchLoads/TempFilePrefixView/Combine.GloballyAsSingletonView/Combine.globally(Singleton)/Values/Values/Map/ParMultiDo(Anonymous).out0
[PCollection]}, transform=ParMultiDo(Anonymous), pipeline=Pipeline#712002560} doesn't have
a name specified
	at org.apache.beam.runners.dataflow.repackaged.com.google.common.base.Preconditions.checkArgument(Preconditions.java:191)
	at org.apache.beam.runners.dataflow.DataflowPipelineTranslator$Translator.asOutputReference(DataflowPipelineTranslator.java:518)
	at org.apache.beam.runners.dataflow.DataflowPipelineTranslator$Translator.visitValue(DataflowPipelineTranslator.java:445)
	at org.apache.beam.sdk.runners.TransformHierarchy$Node.visit(TransformHierarchy.java:484)
	at org.apache.beam.sdk.runners.TransformHierarchy$Node.visit(TransformHierarchy.java:494)
	at org.apache.beam.sdk.runners.TransformHierarchy$Node.visit(TransformHierarchy.java:494)
	at org.apache.beam.sdk.runners.TransformHierarchy$Node.visit(TransformHierarchy.java:494)
	at org.apache.beam.sdk.runners.TransformHierarchy$Node.access$500(TransformHierarchy.java:232)
	at org.apache.beam.sdk.runners.TransformHierarchy.visit(TransformHierarchy.java:207)
	at org.apache.beam.sdk.Pipeline.traverseTopologically(Pipeline.java:440)
	at org.apache.beam.runners.dataflow.DataflowPipelineTranslator$Translator.translate(DataflowPipelineTranslator.java:381)
	at org.apache.beam.runners.dataflow.DataflowPipelineTranslator.translate(DataflowPipelineTranslator.java:171)
	at org.apache.beam.runners.dataflow.DataflowRunner.run(DataflowRunner.java:522)
	at org.apache.beam.runners.dataflow.TestDataflowRunner.run(TestDataflowRunner.java:97)
	at org.apache.beam.runners.dataflow.TestDataflowRunner.run(TestDataflowRunner.java:89)
	at org.apache.beam.runners.dataflow.TestDataflowRunner.run(TestDataflowRunner.java:54)
	at org.apache.beam.sdk.Pipeline.run(Pipeline.java:297)
	at org.apache.beam.sdk.Pipeline.run(Pipeline.java:283)
	at org.apache.beam.examples.cookbook.BigQueryTornadoes.main(BigQueryTornadoes.java:167)
	at org.apache.beam.examples.cookbook.BigQueryTornadoesIT.testE2EBigQueryTornadoes(BigQueryTornadoesIT.java:64)
	at sun.reflect.NativeMethodAccessorImpl.invoke0(Native Method)
	at sun.reflect.NativeMethodAccessorImpl.invoke(NativeMethodAccessorImpl.java:57)
	at sun.reflect.DelegatingMethodAccessorImpl.invoke(DelegatingMethodAccessorImpl.java:43)
	at java.lang.reflect.Method.invoke(Method.java:606)
	at org.junit.runners.model.FrameworkMethod$1.runReflectiveCall(FrameworkMethod.java:50)
	at org.junit.internal.runners.model.ReflectiveCallable.run(ReflectiveCallable.java:12)
	at org.junit.runners.model.FrameworkMethod.invokeExplosively(FrameworkMethod.java:47)
	at org.junit.internal.runners.statements.InvokeMethod.evaluate(InvokeMethod.java:17)
	at org.junit.runners.ParentRunner.runLeaf(ParentRunner.java:325)
	at org.junit.runners.BlockJUnit4ClassRunner.runChild(BlockJUnit4ClassRunner.java:78)
	at org.junit.runners.BlockJUnit4ClassRunner.runChild(BlockJUnit4ClassRunner.java:57)
	at org.junit.runners.ParentRunner$3.run(ParentRunner.java:290)
	at org.apache.maven.surefire.junitcore.pc.Scheduler$1.run(Scheduler.java:393)
	at java.util.concurrent.Executors$RunnableAdapter.call(Executors.java:473)
	at java.util.concurrent.FutureTask.run(FutureTask.java:262)
	at java.util.concurrent.ThreadPoolExecutor.runWorker(ThreadPoolExecutor.java:1145)
	at java.util.concurrent.ThreadPoolExecutor$Worker.run(ThreadPoolExecutor.java:615)
	at java.lang.Thread.run(Thread.java:745)

2017-05-23\T\01:41:26.099 [INFO] Running org.apache.beam.examples.WindowedWordCountIT
2017-05-23\T\01:41:26.113 [INFO] Tests run: 3, Failures: 0, Errors: 0, Skipped: 0, Time elapsed:
278.217 s - in org.apache.beam.examples.WindowedWordCountIT
2017-05-23\T\01:41:26.113 [INFO] Running org.apache.beam.examples.WordCountIT
2017-05-23\T\01:41:26.118 [INFO] Tests run: 1, Failures: 0, Errors: 0, Skipped: 0, Time elapsed:
246.808 s - in org.apache.beam.examples.WordCountIT
2017-05-23\T\01:41:26.705 [INFO] 
2017-05-23\T\01:41:26.705 [INFO] Results:
2017-05-23\T\01:41:26.705 [INFO] 
2017-05-23\T\01:41:26.705 [ERROR] Errors: 
2017-05-23\T\01:41:26.705 [ERROR]   BigQueryTornadoesIT.testE2EBigQueryTornadoes:64 » IllegalArgument
AppliedPTran...
2017-05-23\T\01:41:26.705 [INFO] 
2017-05-23\T\01:41:26.705 [ERROR] Tests run: 5, Failures: 0, Errors: 1, Skipped: 0
2017-05-23\T\01:41:26.705 [INFO] 
2017-05-23\T\01:41:26.709 [INFO] 
2017-05-23\T\01:41:26.709 [INFO] --- maven-dependency-plugin:3.0.0:analyze-only (default)
@ beam-examples-java ---
2017-05-23\T\01:41:26.814 [INFO] No dependency problems found
2017-05-23\T\01:41:26.815 [INFO] 
2017-05-23\T\01:41:26.815 [INFO] --- maven-failsafe-plugin:2.20:verify (default) @ beam-examples-java
---
2017-05-23\T\01:41:26.815 [INFO] Failsafe report directory: <https://builds.apache.org/job/beam_PostCommit_Java_JDK_Versions_Test/jdk=OpenJDK%208%20(on%20Ubuntu%20only),label=beam/ws/examples/java/target/failsafe-reports>
2017-05-23\T\01:41:26.819 [INFO] ------------------------------------------------------------------------
2017-05-23\T\01:41:26.819 [INFO] Reactor Summary:
2017-05-23\T\01:41:26.819 [INFO] 
2017-05-23\T\01:41:26.819 [INFO] Apache Beam :: Parent .............................. SUCCESS
[ 43.944 s]
2017-05-23\T\01:41:26.819 [INFO] Apache Beam :: SDKs :: Java :: Build Tools ......... SUCCESS
[  5.871 s]
2017-05-23\T\01:41:26.819 [INFO] Apache Beam :: SDKs ................................ SUCCESS
[  0.505 s]
2017-05-23\T\01:41:26.820 [INFO] Apache Beam :: SDKs :: Common ...................... SUCCESS
[  0.509 s]
2017-05-23\T\01:41:26.820 [INFO] Apache Beam :: SDKs :: Common :: Fn API ............ SUCCESS
[ 10.816 s]
2017-05-23\T\01:41:26.820 [INFO] Apache Beam :: SDKs :: Common :: Runner API ........ SUCCESS
[  1.669 s]
2017-05-23\T\01:41:26.820 [INFO] Apache Beam :: SDKs :: Java ........................ SUCCESS
[  1.027 s]
2017-05-23\T\01:41:26.820 [INFO] Apache Beam :: SDKs :: Java :: Core ................ SUCCESS
[01:42 min]
2017-05-23\T\01:41:26.820 [INFO] Apache Beam :: SDKs :: Java :: IO .................. SUCCESS
[  0.425 s]
2017-05-23\T\01:41:26.820 [INFO] Apache Beam :: SDKs :: Java :: IO :: Common ........ SUCCESS
[  2.908 s]
2017-05-23\T\01:41:26.820 [INFO] Apache Beam :: Runners ............................. SUCCESS
[  0.410 s]
2017-05-23\T\01:41:26.820 [INFO] Apache Beam :: Runners :: Core Construction Java ... SUCCESS
[ 17.830 s]
2017-05-23\T\01:41:26.820 [INFO] Apache Beam :: Runners :: Core Java ................ SUCCESS
[ 26.631 s]
2017-05-23\T\01:41:26.820 [INFO] Apache Beam :: Runners :: Direct Java .............. SUCCESS
[02:52 min]
2017-05-23\T\01:41:26.820 [INFO] Apache Beam :: SDKs :: Java :: IO :: Elasticsearch . SUCCESS
[ 30.977 s]
2017-05-23\T\01:41:26.820 [INFO] Apache Beam :: SDKs :: Java :: Extensions .......... SUCCESS
[  0.380 s]
2017-05-23\T\01:41:26.820 [INFO] Apache Beam :: SDKs :: Java :: Extensions :: Google Cloud
Platform Core SUCCESS [ 32.641 s]
2017-05-23\T\01:41:26.820 [INFO] Apache Beam :: SDKs :: Java :: Extensions :: Protobuf SUCCESS
[  8.802 s]
2017-05-23\T\01:41:26.820 [INFO] Apache Beam :: SDKs :: Java :: IO :: Google Cloud Platform
SUCCESS [01:01 min]
2017-05-23\T\01:41:26.821 [INFO] Apache Beam :: SDKs :: Java :: IO :: Hadoop Common . SUCCESS
[ 12.606 s]
2017-05-23\T\01:41:26.821 [INFO] Apache Beam :: SDKs :: Java :: IO :: Hadoop File System SUCCESS
[ 39.605 s]
2017-05-23\T\01:41:26.821 [INFO] Apache Beam :: SDKs :: Java :: IO :: Hadoop ........ SUCCESS
[  2.663 s]
2017-05-23\T\01:41:26.821 [INFO] Apache Beam :: SDKs :: Java :: IO :: Hadoop :: input-format
SUCCESS [ 11.857 s]
2017-05-23\T\01:41:26.821 [INFO] Apache Beam :: SDKs :: Java :: IO :: HBase ......... SUCCESS
[ 59.926 s]
2017-05-23\T\01:41:26.821 [INFO] Apache Beam :: Runners :: Google Cloud Dataflow .... SUCCESS
[08:54 min]
2017-05-23\T\01:41:26.821 [INFO] Apache Beam :: SDKs :: Java :: IO :: JDBC .......... SUCCESS
[ 21.993 s]
2017-05-23\T\01:41:26.821 [INFO] Apache Beam :: SDKs :: Java :: IO :: JMS ........... SUCCESS
[ 12.895 s]
2017-05-23\T\01:41:26.821 [INFO] Apache Beam :: SDKs :: Java :: IO :: Kafka ......... SUCCESS
[ 28.671 s]
2017-05-23\T\01:41:26.821 [INFO] Apache Beam :: SDKs :: Java :: IO :: Kinesis ....... SUCCESS
[ 16.794 s]
2017-05-23\T\01:41:26.821 [INFO] Apache Beam :: SDKs :: Java :: IO :: MongoDB ....... SUCCESS
[ 31.414 s]
2017-05-23\T\01:41:26.821 [INFO] Apache Beam :: SDKs :: Java :: IO :: MQTT .......... SUCCESS
[ 14.574 s]
2017-05-23\T\01:41:26.821 [INFO] Apache Beam :: SDKs :: Java :: IO :: XML ........... SUCCESS
[ 19.441 s]
2017-05-23\T\01:41:26.821 [INFO] Apache Beam :: SDKs :: Java :: Maven Archetypes .... SUCCESS
[  0.425 s]
2017-05-23\T\01:41:26.821 [INFO] Apache Beam :: SDKs :: Java :: Maven Archetypes :: Starter
SUCCESS [ 14.849 s]
2017-05-23\T\01:41:26.821 [INFO] Apache Beam :: Examples ............................ SUCCESS
[  0.394 s]
2017-05-23\T\01:41:26.821 [INFO] Apache Beam :: Examples :: Java .................... FAILURE
[05:17 min]
2017-05-23\T\01:41:26.822 [INFO] Apache Beam :: SDKs :: Java :: Maven Archetypes :: Examples
SKIPPED
2017-05-23\T\01:41:26.822 [INFO] Apache Beam :: SDKs :: Java :: Extensions :: Jackson SKIPPED
2017-05-23\T\01:41:26.822 [INFO] Apache Beam :: SDKs :: Java :: Extensions :: Join library
SKIPPED
2017-05-23\T\01:41:26.822 [INFO] Apache Beam :: SDKs :: Java :: Extensions :: Sorter  SKIPPED
2017-05-23\T\01:41:26.822 [INFO] Apache Beam :: Runners :: Flink .................... SKIPPED
2017-05-23\T\01:41:26.822 [INFO] Apache Beam :: Runners :: Spark .................... SKIPPED
2017-05-23\T\01:41:26.822 [INFO] Apache Beam :: SDKs :: Java :: Aggregated Javadoc .. SKIPPED
2017-05-23\T\01:41:26.822 [INFO] ------------------------------------------------------------------------
2017-05-23\T\01:41:26.822 [INFO] BUILD FAILURE
2017-05-23\T\01:41:26.822 [INFO] ------------------------------------------------------------------------
2017-05-23\T\01:41:26.822 [INFO] Total time: 27:46 min
2017-05-23\T\01:41:26.822 [INFO] Finished at: 2017-05-23T01:41:26+00:00
2017-05-23\T\01:41:27.519 [INFO] Final Memory: 204M/1259M
2017-05-23\T\01:41:27.519 [INFO] ------------------------------------------------------------------------
2017-05-23\T\01:41:27.520 [ERROR] Failed to execute goal org.apache.maven.plugins:maven-failsafe-plugin:2.20:verify
(default) on project beam-examples-java: There are test failures.
2017-05-23\T\01:41:27.520 [ERROR] 
2017-05-23\T\01:41:27.520 [ERROR] Please refer to <https://builds.apache.org/job/beam_PostCommit_Java_JDK_Versions_Test/jdk=OpenJDK%208%20(on%20Ubuntu%20only),label=beam/ws/examples/java/target/failsafe-reports>
for the individual test results.
2017-05-23\T\01:41:27.520 [ERROR] Please refer to dump files (if any exist) [date]-jvmRun[N].dump,
[date].dumpstream and [date]-jvmRun[N].dumpstream.
2017-05-23\T\01:41:27.520 [ERROR] -> [Help 1]
org.apache.maven.lifecycle.LifecycleExecutionException: Failed to execute goal org.apache.maven.plugins:maven-failsafe-plugin:2.20:verify
(default) on project beam-examples-java: There are test failures.

Please refer to <https://builds.apache.org/job/beam_PostCommit_Java_JDK_Versions_Test/jdk=OpenJDK%208%20(on%20Ubuntu%20only),label=beam/ws/examples/java/target/failsafe-reports>
for the individual test results.
Please refer to dump files (if any exist) [date]-jvmRun[N].dump, [date].dumpstream and [date]-jvmRun[N].dumpstream.
	at org.apache.maven.lifecycle.internal.MojoExecutor.execute(MojoExecutor.java:212)
	at org.apache.maven.lifecycle.internal.MojoExecutor.execute(MojoExecutor.java:153)
	at org.apache.maven.lifecycle.internal.MojoExecutor.execute(MojoExecutor.java:145)
	at org.apache.maven.lifecycle.internal.LifecycleModuleBuilder.buildProject(LifecycleModuleBuilder.java:116)
	at org.apache.maven.lifecycle.internal.LifecycleModuleBuilder.buildProject(LifecycleModuleBuilder.java:80)
	at org.apache.maven.lifecycle.internal.builder.singlethreaded.SingleThreadedBuilder.build(SingleThreadedBuilder.java:51)
	at org.apache.maven.lifecycle.internal.LifecycleStarter.execute(LifecycleStarter.java:128)
	at org.apache.maven.DefaultMaven.doExecute(DefaultMaven.java:307)
	at org.apache.maven.DefaultMaven.doExecute(DefaultMaven.java:193)
	at org.apache.maven.DefaultMaven.execute(DefaultMaven.java:106)
	at org.apache.maven.cli.MavenCli.execute(MavenCli.java:862)
	at org.apache.maven.cli.MavenCli.doMain(MavenCli.java:286)
	at org.apache.maven.cli.MavenCli.main(MavenCli.java:197)
	at sun.reflect.NativeMethodAccessorImpl.invoke0(Native Method)
	at sun.reflect.NativeMethodAccessorImpl.invoke(NativeMethodAccessorImpl.java:57)
	at sun.reflect.DelegatingMethodAccessorImpl.invoke(DelegatingMethodAccessorImpl.java:43)
	at java.lang.reflect.Method.invoke(Method.java:606)
	at org.codehaus.plexus.classworlds.launcher.Launcher.launchEnhanced(Launcher.java:289)
	at org.codehaus.plexus.classworlds.launcher.Launcher.launch(Launcher.java:229)
	at org.codehaus.plexus.classworlds.launcher.Launcher.mainWithExitCode(Launcher.java:415)
	at org.codehaus.plexus.classworlds.launcher.Launcher.main(Launcher.java:356)
Caused by: org.apache.maven.plugin.MojoFailureException: There are test failures.

Please refer to <https://builds.apache.org/job/beam_PostCommit_Java_JDK_Versions_Test/jdk=OpenJDK%208%20(on%20Ubuntu%20only),label=beam/ws/examples/java/target/failsafe-reports>
for the individual test results.
Please refer to dump files (if any exist) [date]-jvmRun[N].dump, [date].dumpstream and [date]-jvmRun[N].dumpstream.
	at org.apache.maven.plugin.surefire.SurefireHelper.throwException(SurefireHelper.java:204)
	at org.apache.maven.plugin.surefire.SurefireHelper.reportExecution(SurefireHelper.java:98)
	at org.apache.maven.plugin.failsafe.VerifyMojo.execute(VerifyMojo.java:191)
	at org.apache.maven.plugin.DefaultBuildPluginManager.executeMojo(DefaultBuildPluginManager.java:134)
	at org.apache.maven.lifecycle.internal.MojoExecutor.execute(MojoExecutor.java:208)
	... 20 more
2017-05-23\T\01:41:27.521 [ERROR] 
2017-05-23\T\01:41:27.521 [ERROR] Re-run Maven using the -X switch to enable full debug logging.
2017-05-23\T\01:41:27.521 [ERROR] 
2017-05-23\T\01:41:27.521 [ERROR] For more information about the errors and possible solutions,
please read the following articles:
2017-05-23\T\01:41:27.521 [ERROR] [Help 1] http://cwiki.apache.org/confluence/display/MAVEN/MojoFailureException
2017-05-23\T\01:41:27.522 [ERROR] 
2017-05-23\T\01:41:27.522 [ERROR] After correcting the problems, you can resume the build
with the command
2017-05-23\T\01:41:27.522 [ERROR]   mvn <goals> -rf :beam-examples-java
Build step 'Invoke top-level Maven targets' marked build as failure

Mime
View raw message