beam-commits mailing list archives

Site index · List index
Message view « Date » · « Thread »
Top « Date » · « Thread »
From Apache Jenkins Server <jenk...@builds.apache.org>
Subject Build failed in Jenkins: beam_PostCommit_Java_MavenInstall #3601
Date Wed, 03 May 2017 00:10:10 GMT
See <https://builds.apache.org/job/beam_PostCommit_Java_MavenInstall/3601/display/redirect?page=changes>

Changes:

[davor] Include LICENSE and NOTICE in python dist files

------------------------------------------
[...truncated 598.00 KB...]
2017-05-03T00:08:40.621 [INFO] <https://builds.apache.org/job/beam_PostCommit_Java_MavenInstall/ws/runners/direct-java/src/main/java/org/apache/beam/runners/direct/CopyOnAccessInMemoryStateInternals.java>:
Recompile with -Xlint:deprecation for details.
2017-05-03T00:08:40.621 [INFO] <https://builds.apache.org/job/beam_PostCommit_Java_MavenInstall/ws/runners/direct-java/src/main/java/org/apache/beam/runners/direct/TestStreamEvaluatorFactory.java>:
Some input files use unchecked or unsafe operations.
2017-05-03T00:08:40.621 [INFO] <https://builds.apache.org/job/beam_PostCommit_Java_MavenInstall/ws/runners/direct-java/src/main/java/org/apache/beam/runners/direct/TestStreamEvaluatorFactory.java>:
Recompile with -Xlint:unchecked for details.
[WARNING] Cannot calculate digest of mojo class, because mojo wasn't loaded from a jar, but
from: <https://builds.apache.org/job/beam_PostCommit_Java_MavenInstall/ws/.repository/org/apache/maven/plugins/maven-compiler-plugin/3.6.1/maven-compiler-plugin-3.6.1.jar>
2017-05-03T00:08:41.007 [INFO] 
2017-05-03T00:08:41.007 [INFO] --- maven-resources-plugin:3.0.2:testResources (default-testResources)
@ beam-runners-direct-java ---
2017-05-03T00:08:41.009 [INFO] Using 'UTF-8' encoding to copy filtered resources.
2017-05-03T00:08:41.009 [INFO] skip non existing resourceDirectory <https://builds.apache.org/job/beam_PostCommit_Java_MavenInstall/ws/runners/direct-java/src/test/resources>
2017-05-03T00:08:41.010 [INFO] Copying 3 resources
[WARNING] Cannot calculate digest of mojo class, because mojo wasn't loaded from a jar, but
from: <https://builds.apache.org/job/beam_PostCommit_Java_MavenInstall/ws/.repository/org/apache/maven/plugins/maven-resources-plugin/3.0.2/maven-resources-plugin-3.0.2.jar>
2017-05-03T00:08:41.098 [INFO] 
2017-05-03T00:08:41.098 [INFO] --- maven-compiler-plugin:3.6.1:testCompile (default-testCompile)
@ beam-runners-direct-java ---
2017-05-03T00:08:41.122 [INFO] Changes detected - recompiling the module!
2017-05-03T00:08:41.122 [INFO] Compiling 39 source files to <https://builds.apache.org/job/beam_PostCommit_Java_MavenInstall/ws/runners/direct-java/target/test-classes>
2017-05-03T00:08:42.457 [INFO] <https://builds.apache.org/job/beam_PostCommit_Java_MavenInstall/ws/runners/direct-java/src/test/java/org/apache/beam/runners/direct/DirectTimerInternalsTest.java>:
Some input files use or override a deprecated API.
2017-05-03T00:08:42.457 [INFO] <https://builds.apache.org/job/beam_PostCommit_Java_MavenInstall/ws/runners/direct-java/src/test/java/org/apache/beam/runners/direct/DirectTimerInternalsTest.java>:
Recompile with -Xlint:deprecation for details.
2017-05-03T00:08:42.457 [INFO] <https://builds.apache.org/job/beam_PostCommit_Java_MavenInstall/ws/runners/direct-java/src/test/java/org/apache/beam/runners/direct/TestStreamEvaluatorFactoryTest.java>:
Some input files use unchecked or unsafe operations.
2017-05-03T00:08:42.458 [INFO] <https://builds.apache.org/job/beam_PostCommit_Java_MavenInstall/ws/runners/direct-java/src/test/java/org/apache/beam/runners/direct/TestStreamEvaluatorFactoryTest.java>:
Recompile with -Xlint:unchecked for details.
[WARNING] Cannot calculate digest of mojo class, because mojo wasn't loaded from a jar, but
from: <https://builds.apache.org/job/beam_PostCommit_Java_MavenInstall/ws/.repository/org/apache/maven/plugins/maven-compiler-plugin/3.6.1/maven-compiler-plugin-3.6.1.jar>
2017-05-03T00:08:42.550 [INFO] 
2017-05-03T00:08:42.550 [INFO] --- maven-checkstyle-plugin:2.17:check (default) @ beam-runners-direct-java
---
2017-05-03T00:08:47.928 [INFO] Starting audit...
Audit done.
[WARNING] Cannot calculate digest of mojo class, because mojo wasn't loaded from a jar, but
from: <https://builds.apache.org/job/beam_PostCommit_Java_MavenInstall/ws/.repository/org/apache/maven/plugins/maven-checkstyle-plugin/2.17/maven-checkstyle-plugin-2.17.jar>
2017-05-03T00:08:48.022 [INFO] 
2017-05-03T00:08:48.023 [INFO] >>> findbugs-maven-plugin:3.0.4:check (default) >
:findbugs @ beam-runners-direct-java >>>
2017-05-03T00:08:48.038 [INFO] 
2017-05-03T00:08:48.038 [INFO] --- findbugs-maven-plugin:3.0.4:findbugs (findbugs) @ beam-runners-direct-java
---
2017-05-03T00:08:48.046 [INFO] Fork Value is true
[WARNING] Cannot calculate digest of mojo class, because mojo wasn't loaded from a jar, but
from: <https://builds.apache.org/job/beam_PostCommit_Java_MavenInstall/ws/.repository/org/codehaus/mojo/findbugs-maven-plugin/3.0.4/findbugs-maven-plugin-3.0.4.jar>
[WARNING] Cannot calculate digest of mojo class, because mojo wasn't loaded from a jar, but
from: <https://builds.apache.org/job/beam_PostCommit_Java_MavenInstall/ws/.repository/org/codehaus/mojo/findbugs-maven-plugin/3.0.4/findbugs-maven-plugin-3.0.4.jar>
[WARNING] Cannot calculate digest of mojo class, because mojo wasn't loaded from a jar, but
from: <https://builds.apache.org/job/beam_PostCommit_Java_MavenInstall/ws/.repository/org/codehaus/mojo/findbugs-maven-plugin/3.0.4/findbugs-maven-plugin-3.0.4.jar>
[JENKINS] Archiving disabled
2017-05-03T00:08:50.530 [INFO]                                                           
             
2017-05-03T00:08:50.530 [INFO] ------------------------------------------------------------------------
2017-05-03T00:08:50.530 [INFO] Skipping Apache Beam :: Parent
2017-05-03T00:08:50.530 [INFO] This project has been banned from the build due to previous
failures.
2017-05-03T00:08:50.530 [INFO] ------------------------------------------------------------------------
[JENKINS] Archiving disabled
[JENKINS] Archiving disabled
[JENKINS] Archiving disabled
[JENKINS] Archiving disabled
[JENKINS] Archiving disabled
[JENKINS] Archiving disabled
[JENKINS] Archiving disabled
[JENKINS] Archiving disabled
[JENKINS] Archiving disabled
[JENKINS] Archiving disabled
[JENKINS] Archiving disabled
[JENKINS] Archiving disabled
[JENKINS] Archiving disabled
[JENKINS] Archiving disabled
[JENKINS] Archiving disabled
[JENKINS] Archiving disabled
[JENKINS] Archiving disabled
[JENKINS] Archiving disabled
[JENKINS] Archiving disabled
[JENKINS] Archiving disabled
[JENKINS] Archiving disabled
[JENKINS] Archiving disabled
[JENKINS] Archiving disabled
[JENKINS] Archiving disabled
[JENKINS] Archiving disabled
[JENKINS] Archiving disabled
[JENKINS] Archiving disabled
[JENKINS] Archiving disabled
[JENKINS] Archiving disabled
[JENKINS] Archiving disabled
[JENKINS] Archiving disabled
[JENKINS] Archiving disabled
[JENKINS] Archiving disabled
[JENKINS] Archiving disabled
[JENKINS] Archiving disabled
[JENKINS] Archiving disabled
[JENKINS] Archiving disabled
[JENKINS] Archiving disabled
[JENKINS] Archiving disabled
[JENKINS] Archiving disabled
[JENKINS] Archiving disabled
[JENKINS] Archiving disabled
[JENKINS] Archiving disabled
[JENKINS] Archiving disabled
[JENKINS] Archiving disabled
[JENKINS] Archiving disabled
2017-05-03T00:09:04.814 [INFO] ------------------------------------------------------------------------
2017-05-03T00:09:04.814 [INFO] Reactor Summary:
2017-05-03T00:09:04.814 [INFO] 
2017-05-03T00:09:04.814 [INFO] Apache Beam :: Parent .............................. SUCCESS
[ 40.205 s]
2017-05-03T00:09:04.814 [INFO] Apache Beam :: SDKs :: Java :: Build Tools ......... SUCCESS
[ 11.807 s]
2017-05-03T00:09:04.814 [INFO] Apache Beam :: SDKs ................................ SUCCESS
[  6.474 s]
2017-05-03T00:09:04.814 [INFO] Apache Beam :: SDKs :: Common ...................... SUCCESS
[  1.905 s]
2017-05-03T00:09:04.814 [INFO] Apache Beam :: SDKs :: Common :: Fn API ............ SUCCESS
[ 23.720 s]
2017-05-03T00:09:04.814 [INFO] Apache Beam :: SDKs :: Common :: Runner API ........ SUCCESS
[ 19.779 s]
2017-05-03T00:09:04.814 [INFO] Apache Beam :: SDKs :: Java ........................ SUCCESS
[  2.385 s]
2017-05-03T00:09:04.814 [INFO] Apache Beam :: SDKs :: Java :: Core ................ SUCCESS
[03:35 min]
2017-05-03T00:09:04.814 [INFO] Apache Beam :: SDKs :: Java :: IO .................. SUCCESS
[  3.651 s]
2017-05-03T00:09:04.815 [INFO] Apache Beam :: SDKs :: Java :: IO :: Common ........ SUCCESS
[  5.650 s]
2017-05-03T00:09:04.815 [INFO] Apache Beam :: Runners ............................. SUCCESS
[  4.905 s]
2017-05-03T00:09:04.815 [INFO] Apache Beam :: Runners :: Core Construction Java ... SUCCESS
[ 32.797 s]
2017-05-03T00:09:04.815 [INFO] Apache Beam :: Runners :: Core Java ................ SUCCESS
[01:11 min]
2017-05-03T00:09:04.815 [INFO] Apache Beam :: Runners :: Direct Java .............. FAILURE
[ 14.228 s]
2017-05-03T00:09:04.815 [INFO] Apache Beam :: SDKs :: Java :: IO :: Elasticsearch . SKIPPED
2017-05-03T00:09:04.815 [INFO] Apache Beam :: SDKs :: Java :: Extensions .......... SKIPPED
2017-05-03T00:09:04.815 [INFO] Apache Beam :: SDKs :: Java :: Extensions :: Google Cloud Platform
Core SKIPPED
2017-05-03T00:09:04.815 [INFO] Apache Beam :: SDKs :: Java :: Extensions :: Protobuf SKIPPED
2017-05-03T00:09:04.815 [INFO] Apache Beam :: SDKs :: Java :: IO :: Google Cloud Platform
SKIPPED
2017-05-03T00:09:04.815 [INFO] Apache Beam :: SDKs :: Java :: IO :: Hadoop Common . SKIPPED
2017-05-03T00:09:04.815 [INFO] Apache Beam :: SDKs :: Java :: IO :: Hadoop File System SKIPPED
2017-05-03T00:09:04.815 [INFO] Apache Beam :: SDKs :: Java :: IO :: Hadoop ........ SKIPPED
2017-05-03T00:09:04.815 [INFO] Apache Beam :: SDKs :: Java :: IO :: Hadoop :: input-format
SKIPPED
2017-05-03T00:09:04.815 [INFO] Apache Beam :: Runners :: Google Cloud Dataflow .... SKIPPED
2017-05-03T00:09:04.815 [INFO] Apache Beam :: SDKs :: Java :: IO :: Hadoop :: jdk1.8-tests
SKIPPED
2017-05-03T00:09:04.815 [INFO] Apache Beam :: SDKs :: Java :: IO :: HBase ......... SKIPPED
2017-05-03T00:09:04.815 [INFO] Apache Beam :: SDKs :: Java :: IO :: JDBC .......... SKIPPED
2017-05-03T00:09:04.815 [INFO] Apache Beam :: SDKs :: Java :: IO :: JMS ........... SKIPPED
2017-05-03T00:09:04.815 [INFO] Apache Beam :: SDKs :: Java :: IO :: Kafka ......... SKIPPED
2017-05-03T00:09:04.815 [INFO] Apache Beam :: SDKs :: Java :: IO :: Kinesis ....... SKIPPED
2017-05-03T00:09:04.815 [INFO] Apache Beam :: SDKs :: Java :: IO :: MongoDB ....... SKIPPED
2017-05-03T00:09:04.815 [INFO] Apache Beam :: SDKs :: Java :: IO :: MQTT .......... SKIPPED
2017-05-03T00:09:04.815 [INFO] Apache Beam :: SDKs :: Java :: IO :: XML ........... SKIPPED
2017-05-03T00:09:04.815 [INFO] Apache Beam :: SDKs :: Java :: Maven Archetypes .... SKIPPED
2017-05-03T00:09:04.815 [INFO] Apache Beam :: SDKs :: Java :: Maven Archetypes :: Starter
SKIPPED
2017-05-03T00:09:04.815 [INFO] Apache Beam :: SDKs :: Java :: Maven Archetypes :: Examples
SKIPPED
2017-05-03T00:09:04.815 [INFO] Apache Beam :: SDKs :: Java :: Maven Archetypes :: Examples
- Java 8 SKIPPED
2017-05-03T00:09:04.815 [INFO] Apache Beam :: SDKs :: Java :: Extensions :: Jackson SKIPPED
2017-05-03T00:09:04.815 [INFO] Apache Beam :: SDKs :: Java :: Extensions :: Join library SKIPPED
2017-05-03T00:09:04.815 [INFO] Apache Beam :: SDKs :: Java :: Extensions :: Sorter  SKIPPED
2017-05-03T00:09:04.815 [INFO] Apache Beam :: SDKs :: Java :: Harness ............. SKIPPED
2017-05-03T00:09:04.815 [INFO] Apache Beam :: SDKs :: Java :: Java 8 Tests ........ SKIPPED
2017-05-03T00:09:04.815 [INFO] Apache Beam :: SDKs :: Python ...................... SKIPPED
2017-05-03T00:09:04.815 [INFO] Apache Beam :: Runners :: Flink .................... SKIPPED
2017-05-03T00:09:04.815 [INFO] Apache Beam :: Runners :: Spark .................... SKIPPED
2017-05-03T00:09:04.815 [INFO] Apache Beam :: Runners :: Apex ..................... SKIPPED
2017-05-03T00:09:04.815 [INFO] Apache Beam :: Examples ............................ SKIPPED
2017-05-03T00:09:04.815 [INFO] Apache Beam :: Examples :: Java .................... SKIPPED
2017-05-03T00:09:04.815 [INFO] Apache Beam :: Examples :: Java 8 .................. SKIPPED
2017-05-03T00:09:04.815 [INFO] Apache Beam :: SDKs :: Java :: Aggregated Javadoc .. SKIPPED
2017-05-03T00:09:04.815 [INFO] ------------------------------------------------------------------------
2017-05-03T00:09:04.815 [INFO] BUILD FAILURE
2017-05-03T00:09:04.815 [INFO] ------------------------------------------------------------------------
2017-05-03T00:09:04.815 [INFO] Total time: 08:11 min
2017-05-03T00:09:04.815 [INFO] Finished at: 2017-05-03T00:09:04+00:00
2017-05-03T00:09:05.739 [INFO] Final Memory: 130M/1557M
2017-05-03T00:09:05.739 [INFO] ------------------------------------------------------------------------
Waiting for Jenkins to finish collecting data
2017-05-03T00:09:39.347 [ERROR] Failed to execute goal org.codehaus.mojo:findbugs-maven-plugin:3.0.4:findbugs
(findbugs) on project beam-runners-direct-java: Execution findbugs of goal org.codehaus.mojo:findbugs-maven-plugin:3.0.4:findbugs
failed: The following error occurred while executing this line:
2017-05-03T00:09:39.347 [ERROR] Unable to find jar:<https://builds.apache.org/job/beam_PostCommit_Java_MavenInstall/ws/.repository/org/apache/ant/ant/1.9.4/ant-1.9.4.jar!/org/apache/tools/ant/antlib.xml>:
<https://builds.apache.org/job/beam_PostCommit_Java_MavenInstall/ws/.repository/org/apache/ant/ant/1.9.4/ant-1.9.4.jar>
(No such file or directory)
2017-05-03T00:09:39.347 [ERROR] -> [Help 1]
org.apache.maven.lifecycle.LifecycleExecutionException: Failed to execute goal org.codehaus.mojo:findbugs-maven-plugin:3.0.4:findbugs
(findbugs) on project beam-runners-direct-java: Execution findbugs of goal org.codehaus.mojo:findbugs-maven-plugin:3.0.4:findbugs
failed: The following error occurred while executing this line:
Unable to find jar:<https://builds.apache.org/job/beam_PostCommit_Java_MavenInstall/ws/.repository/org/apache/ant/ant/1.9.4/ant-1.9.4.jar!/org/apache/tools/ant/antlib.xml>
	at org.apache.maven.lifecycle.internal.MojoExecutor.execute(MojoExecutor.java:224)
	at org.apache.maven.lifecycle.internal.MojoExecutor.execute(MojoExecutor.java:153)
	at org.apache.maven.lifecycle.internal.MojoExecutor.execute(MojoExecutor.java:145)
	at org.apache.maven.lifecycle.internal.MojoExecutor.executeForkedExecutions(MojoExecutor.java:364)
	at org.apache.maven.lifecycle.internal.MojoExecutor.execute(MojoExecutor.java:198)
	at org.apache.maven.lifecycle.internal.MojoExecutor.execute(MojoExecutor.java:153)
	at org.apache.maven.lifecycle.internal.MojoExecutor.execute(MojoExecutor.java:145)
	at org.apache.maven.lifecycle.internal.LifecycleModuleBuilder.buildProject(LifecycleModuleBuilder.java:116)
	at org.apache.maven.lifecycle.internal.LifecycleModuleBuilder.buildProject(LifecycleModuleBuilder.java:80)
	at org.apache.maven.lifecycle.internal.builder.singlethreaded.SingleThreadedBuilder.build(SingleThreadedBuilder.java:51)
	at org.apache.maven.lifecycle.internal.LifecycleStarter.execute(LifecycleStarter.java:128)
	at org.apache.maven.DefaultMaven.doExecute(DefaultMaven.java:307)
	at org.apache.maven.DefaultMaven.doExecute(DefaultMaven.java:193)
	at org.apache.maven.DefaultMaven.execute(DefaultMaven.java:106)
	at org.jvnet.hudson.maven3.launcher.Maven33Launcher.main(Maven33Launcher.java:129)
	at sun.reflect.NativeMethodAccessorImpl.invoke0(Native Method)
	at sun.reflect.NativeMethodAccessorImpl.invoke(NativeMethodAccessorImpl.java:62)
	at sun.reflect.DelegatingMethodAccessorImpl.invoke(DelegatingMethodAccessorImpl.java:43)
	at java.lang.reflect.Method.invoke(Method.java:498)
	at org.codehaus.plexus.classworlds.launcher.Launcher.launchStandard(Launcher.java:330)
	at org.codehaus.plexus.classworlds.launcher.Launcher.launch(Launcher.java:238)
	at jenkins.maven3.agent.Maven33Main.launch(Maven33Main.java:176)
	at sun.reflect.NativeMethodAccessorImpl.invoke0(Native Method)
	at sun.reflect.NativeMethodAccessorImpl.invoke(NativeMethodAccessorImpl.java:62)
	at sun.reflect.DelegatingMethodAccessorImpl.invoke(DelegatingMethodAccessorImpl.java:43)
	at java.lang.reflect.Method.invoke(Method.java:498)
	at hudson.maven.Maven3Builder.call(Maven3Builder.java:139)
	at hudson.maven.Maven3Builder.call(Maven3Builder.java:70)
	at hudson.remoting.UserRequest.perform(UserRequest.java:153)
	at hudson.remoting.UserRequest.perform(UserRequest.java:50)
	at hudson.remoting.Request$2.run(Request.java:336)
	at hudson.remoting.InterceptingExecutorService$1.call(InterceptingExecutorService.java:68)
	at java.util.concurrent.FutureTask.run(FutureTask.java:266)
	at java.util.concurrent.ThreadPoolExecutor.runWorker(ThreadPoolExecutor.java:1142)
	at java.util.concurrent.ThreadPoolExecutor$Worker.run(ThreadPoolExecutor.java:617)
	at java.lang.Thread.run(Thread.java:745)
Caused by: org.apache.maven.plugin.PluginExecutionException: Execution findbugs of goal org.codehaus.mojo:findbugs-maven-plugin:3.0.4:findbugs
failed: The following error occurred while executing this line:
Unable to find jar:<https://builds.apache.org/job/beam_PostCommit_Java_MavenInstall/ws/.repository/org/apache/ant/ant/1.9.4/ant-1.9.4.jar!/org/apache/tools/ant/antlib.xml>
	at org.apache.maven.plugin.DefaultBuildPluginManager.executeMojo(DefaultBuildPluginManager.java:145)
	at org.apache.maven.lifecycle.internal.MojoExecutor.execute(MojoExecutor.java:208)
	... 35 more
Caused by: : The following error occurred while executing this line:
Unable to find jar:<https://builds.apache.org/job/beam_PostCommit_Java_MavenInstall/ws/.repository/org/apache/ant/ant/1.9.4/ant-1.9.4.jar!/org/apache/tools/ant/antlib.xml>
	at org.apache.tools.ant.ProjectHelper.addLocationToBuildException(ProjectHelper.java:568)
	at org.apache.tools.ant.taskdefs.Definer.loadAntlib(Definer.java:430)
	at org.apache.tools.ant.taskdefs.Definer.execute(Definer.java:277)
	at org.apache.tools.ant.ComponentHelper.checkNamespace(ComponentHelper.java:874)
	at org.apache.tools.ant.ComponentHelper.getDefinition(ComponentHelper.java:307)
	at org.apache.tools.ant.ComponentHelper.createComponent(ComponentHelper.java:284)
	at org.apache.tools.ant.ComponentHelper.createComponent(ComponentHelper.java:263)
	at org.apache.tools.ant.UnknownElement.makeObject(UnknownElement.java:429)
	at org.apache.tools.ant.UnknownElement.maybeConfigure(UnknownElement.java:163)
	at groovy.util.AntBuilder.performTask(AntBuilder.java:322)
	at groovy.util.AntBuilder.nodeCompleted(AntBuilder.java:272)
	at groovy.util.BuilderSupport.doInvokeMethod(BuilderSupport.java:154)
	at groovy.util.AntBuilder.doInvokeMethod(AntBuilder.java:207)
	at groovy.util.BuilderSupport.invokeMethod(BuilderSupport.java:67)
	at org.codehaus.groovy.runtime.callsite.PogoMetaClassSite.call(PogoMetaClassSite.java:48)
	at org.codehaus.groovy.runtime.callsite.AbstractCallSite.call(AbstractCallSite.java:133)
	at org.codehaus.mojo.findbugs.FindBugsMojo.executeFindbugs(FindBugsMojo.groovy:1049)
	at sun.reflect.NativeMethodAccessorImpl.invoke0(Native Method)
	at sun.reflect.NativeMethodAccessorImpl.invoke(NativeMethodAccessorImpl.java:62)
	at sun.reflect.DelegatingMethodAccessorImpl.invoke(DelegatingMethodAccessorImpl.java:43)
	at java.lang.reflect.Method.invoke(Method.java:498)
	at org.codehaus.groovy.runtime.callsite.PogoMetaMethodSite$PogoCachedMethodSiteNoUnwrapNoCoerce.invoke(PogoMetaMethodSite.java:210)
	at org.codehaus.groovy.runtime.callsite.PogoMetaMethodSite.callCurrent(PogoMetaMethodSite.java:59)
	at org.codehaus.groovy.runtime.callsite.AbstractCallSite.callCurrent(AbstractCallSite.java:166)
	at org.codehaus.mojo.findbugs.FindBugsMojo.canGenerateReport(FindBugsMojo.groovy:562)
	at org.codehaus.mojo.findbugs.FindBugsMojo.execute(FindBugsMojo.groovy:701)
	at org.apache.maven.plugin.DefaultBuildPluginManager.executeMojo(DefaultBuildPluginManager.java:134)
	... 36 more
Caused by: Unable to find jar:<https://builds.apache.org/job/beam_PostCommit_Java_MavenInstall/ws/.repository/org/apache/ant/ant/1.9.4/ant-1.9.4.jar!/org/apache/tools/ant/antlib.xml>
	at org.apache.tools.ant.taskdefs.Antlib.createAntlib(Antlib.java:71)
	at org.apache.tools.ant.taskdefs.Definer.loadAntlib(Definer.java:425)
	... 61 more
Caused by: java.io.FileNotFoundException: <https://builds.apache.org/job/beam_PostCommit_Java_MavenInstall/ws/.repository/org/apache/ant/ant/1.9.4/ant-1.9.4.jar>
(No such file or directory)
	at java.util.zip.ZipFile.open(Native Method)
	at java.util.zip.ZipFile.<init>(ZipFile.java:219)
	at java.util.zip.ZipFile.<init>(ZipFile.java:149)
	at java.util.jar.JarFile.<init>(JarFile.java:166)
	at java.util.jar.JarFile.<init>(JarFile.java:103)
	at sun.net.www.protocol.jar.URLJarFile.<init>(URLJarFile.java:93)
	at sun.net.www.protocol.jar.URLJarFile.getJarFile(URLJarFile.java:69)
	at sun.net.www.protocol.jar.JarFileFactory.get(JarFileFactory.java:99)
	at sun.net.www.protocol.jar.JarURLConnection.connect(JarURLConnection.java:122)
	at org.apache.tools.ant.taskdefs.Antlib.createAntlib(Antlib.java:69)
	... 62 more
2017-05-03T00:09:39.349 [ERROR] 
2017-05-03T00:09:39.350 [ERROR] Re-run Maven using the -X switch to enable full debug logging.
2017-05-03T00:09:39.350 [ERROR] 
2017-05-03T00:09:39.350 [ERROR] For more information about the errors and possible solutions,
please read the following articles:
2017-05-03T00:09:39.350 [ERROR] [Help 1] http://cwiki.apache.org/confluence/display/MAVEN/PluginExecutionException
2017-05-03T00:09:39.350 [ERROR] 
2017-05-03T00:09:39.350 [ERROR] After correcting the problems, you can resume the build with
the command
2017-05-03T00:09:39.351 [ERROR]   mvn <goals> -rf :beam-runners-direct-java
channel stopped
Not sending mail to unregistered user kirpichov@google.com
Not sending mail to unregistered user wtanaka@yahoo.com
Not sending mail to unregistered user klk@google.com

Mime
View raw message