beam-commits mailing list archives

Site index · List index
Message view « Date » · « Thread »
Top « Date » · « Thread »
From Apache Jenkins Server <jenk...@builds.apache.org>
Subject Build failed in Jenkins: beam_PostCommit_Java_ValidatesRunner_Flink #2957
Date Sun, 28 May 2017 12:02:46 GMT
See <https://builds.apache.org/job/beam_PostCommit_Java_ValidatesRunner_Flink/2957/display/redirect>

------------------------------------------
[...truncated 254.28 KB...]
2017-05-28T12:02:18.735 [INFO] Downloaded: https://repo.maven.apache.org/maven2/org/apache/maven/maven-toolchain/2.2.1/maven-toolchain-2.2.1.jar
(37 KB at 266.2 KB/sec)
2017-05-28T12:02:18.743 [INFO] Downloaded: https://repo.maven.apache.org/maven2/org/apache/maven/plugin-tools/maven-plugin-annotations/3.3/maven-plugin-annotations-3.3.jar
(14 KB at 93.9 KB/sec)
[JENKINS] Recording test results2017-05-28T12:02:19.114 [INFO] 
2017-05-28T12:02:19.114 [INFO] --- build-helper-maven-plugin:3.0.0:regex-properties (render-artifact-id)
@ beam-sdks-java-build-tools ---

2017-05-28T12:02:19.245 [INFO] 
2017-05-28T12:02:19.245 [INFO] --- maven-jar-plugin:3.0.2:jar (default-jar) @ beam-sdks-java-build-tools
---
2017-05-28T12:02:19.282 [INFO] Building jar: <https://builds.apache.org/job/beam_PostCommit_Java_ValidatesRunner_Flink/ws/sdks/java/build-tools/target/beam-sdks-java-build-tools-2.1.0-SNAPSHOT.jar>
2017-05-28T12:02:19.374 [INFO] 
2017-05-28T12:02:19.374 [INFO] --- maven-site-plugin:3.5.1:attach-descriptor (attach-descriptor)
@ beam-sdks-java-build-tools ---
2017-05-28T12:02:19.475 [INFO] 
2017-05-28T12:02:19.475 [INFO] --- maven-jar-plugin:3.0.2:test-jar (default-test-jar) @ beam-sdks-java-build-tools
---
2017-05-28T12:02:19.480 [INFO] Building jar: <https://builds.apache.org/job/beam_PostCommit_Java_ValidatesRunner_Flink/ws/sdks/java/build-tools/target/beam-sdks-java-build-tools-2.1.0-SNAPSHOT-tests.jar>
2017-05-28T12:02:19.543 [INFO] 
2017-05-28T12:02:19.543 [INFO] --- maven-shade-plugin:3.0.0:shade (bundle-and-repackage) @
beam-sdks-java-build-tools ---
2017-05-28T12:02:19.581 [INFO] Replacing original artifact with shaded artifact.
2017-05-28T12:02:19.581 [INFO] Replacing <https://builds.apache.org/job/beam_PostCommit_Java_ValidatesRunner_Flink/ws/sdks/java/build-tools/target/beam-sdks-java-build-tools-2.1.0-SNAPSHOT.jar>
with <https://builds.apache.org/job/beam_PostCommit_Java_ValidatesRunner_Flink/ws/sdks/java/build-tools/target/beam-sdks-java-build-tools-2.1.0-SNAPSHOT-shaded.jar>
2017-05-28T12:02:19.581 [INFO] Replacing original test artifact with shaded test artifact.
2017-05-28T12:02:19.581 [INFO] Replacing <https://builds.apache.org/job/beam_PostCommit_Java_ValidatesRunner_Flink/ws/sdks/java/build-tools/target/beam-sdks-java-build-tools-2.1.0-SNAPSHOT-tests.jar>
with <https://builds.apache.org/job/beam_PostCommit_Java_ValidatesRunner_Flink/ws/sdks/java/build-tools/target/beam-sdks-java-build-tools-2.1.0-SNAPSHOT-shaded-tests.jar>
2017-05-28T12:02:19.631 [INFO] 
2017-05-28T12:02:19.631 [INFO] --- maven-dependency-plugin:3.0.1:analyze-only (default) @
beam-sdks-java-build-tools ---
2017-05-28T12:02:19.656 [INFO] No dependency problems found
[JENKINS] Archiving disabled
2017-05-28T12:02:20.522 [INFO]                                                           
             
2017-05-28T12:02:20.522 [INFO] ------------------------------------------------------------------------
2017-05-28T12:02:20.522 [INFO] Building Apache Beam :: SDKs 2.1.0-SNAPSHOT
2017-05-28T12:02:20.522 [INFO] ------------------------------------------------------------------------
2017-05-28T12:02:20.525 [INFO] 
2017-05-28T12:02:20.525 [INFO] --- maven-clean-plugin:3.0.0:clean (default-clean) @ beam-sdks-parent
---
2017-05-28T12:02:20.527 [INFO] Deleting <https://builds.apache.org/job/beam_PostCommit_Java_ValidatesRunner_Flink/ws/sdks>
(includes = [**/*.pyc, **/*.egg-info/, **/sdks/python/LICENSE, **/sdks/python/NOTICE, **/sdks/python/README.md],
excludes = [])
2017-05-28T12:02:20.660 [INFO] 
2017-05-28T12:02:20.660 [INFO] --- maven-enforcer-plugin:1.4.1:enforce (enforce) @ beam-sdks-parent
---
2017-05-28T12:02:20.711 [INFO] 
2017-05-28T12:02:20.711 [INFO] --- maven-enforcer-plugin:1.4.1:enforce (enforce-banned-dependencies)
@ beam-sdks-parent ---
2017-05-28T12:02:20.763 [INFO] 
2017-05-28T12:02:20.763 [INFO] --- maven-remote-resources-plugin:1.5:process (process-resource-bundles)
@ beam-sdks-parent ---
2017-05-28T12:02:20.822 [INFO] 
2017-05-28T12:02:20.823 [INFO] --- maven-checkstyle-plugin:2.17:check (default) @ beam-sdks-parent
---
2017-05-28T12:02:21.699 [INFO] Starting audit...
Audit done.
2017-05-28T12:02:21.749 [INFO] 
2017-05-28T12:02:21.749 [INFO] --- build-helper-maven-plugin:3.0.0:regex-properties (render-artifact-id)
@ beam-sdks-parent ---
2017-05-28T12:02:21.800 [INFO] 
2017-05-28T12:02:21.800 [INFO] --- maven-site-plugin:3.5.1:attach-descriptor (attach-descriptor)
@ beam-sdks-parent ---
2017-05-28T12:02:21.957 [INFO] 
2017-05-28T12:02:21.957 [INFO] --- maven-jar-plugin:3.0.2:jar (default-jar) @ beam-sdks-parent
---
2017-05-28T12:02:21.958 [INFO] Skipping packaging of the jar
2017-05-28T12:02:22.116 [INFO] 
2017-05-28T12:02:22.116 [INFO] --- maven-jar-plugin:3.0.2:test-jar (default-test-jar) @ beam-sdks-parent
---
2017-05-28T12:02:22.117 [INFO] Skipping packaging of the test-jar
2017-05-28T12:02:22.167 [INFO] 
2017-05-28T12:02:22.167 [INFO] --- maven-shade-plugin:3.0.0:shade (bundle-and-repackage) @
beam-sdks-parent ---
2017-05-28T12:02:22.170 [INFO] Replacing original artifact with shaded artifact.
2017-05-28T12:02:22.220 [INFO] 
2017-05-28T12:02:22.220 [INFO] --- maven-dependency-plugin:3.0.1:analyze-only (default) @
beam-sdks-parent ---
2017-05-28T12:02:22.220 [INFO] Skipping pom project
[JENKINS] Archiving disabled
2017-05-28T12:02:23.037 [INFO]                                                           
             
2017-05-28T12:02:23.037 [INFO] ------------------------------------------------------------------------
2017-05-28T12:02:23.037 [INFO] Building Apache Beam :: SDKs :: Common 2.1.0-SNAPSHOT
2017-05-28T12:02:23.037 [INFO] ------------------------------------------------------------------------
2017-05-28T12:02:23.040 [INFO] 
2017-05-28T12:02:23.040 [INFO] --- maven-clean-plugin:3.0.0:clean (default-clean) @ beam-sdks-common-parent
---
2017-05-28T12:02:23.042 [INFO] Deleting <https://builds.apache.org/job/beam_PostCommit_Java_ValidatesRunner_Flink/ws/sdks/common>
(includes = [**/*.pyc, **/*.egg-info/, **/sdks/python/LICENSE, **/sdks/python/NOTICE, **/sdks/python/README.md],
excludes = [])
2017-05-28T12:02:23.093 [INFO] 
2017-05-28T12:02:23.093 [INFO] --- maven-enforcer-plugin:1.4.1:enforce (enforce) @ beam-sdks-common-parent
---
2017-05-28T12:02:23.217 [INFO] 
2017-05-28T12:02:23.217 [INFO] --- maven-enforcer-plugin:1.4.1:enforce (enforce-banned-dependencies)
@ beam-sdks-common-parent ---
2017-05-28T12:02:23.327 [INFO] 
2017-05-28T12:02:23.327 [INFO] --- maven-remote-resources-plugin:1.5:process (process-resource-bundles)
@ beam-sdks-common-parent ---
2017-05-28T12:02:23.444 [INFO] 
2017-05-28T12:02:23.444 [INFO] --- maven-checkstyle-plugin:2.17:check (default) @ beam-sdks-common-parent
---
2017-05-28T12:02:26.324 [INFO] Starting audit...
Audit done.
2017-05-28T12:02:26.374 [INFO] 
2017-05-28T12:02:26.374 [INFO] --- build-helper-maven-plugin:3.0.0:regex-properties (render-artifact-id)
@ beam-sdks-common-parent ---
2017-05-28T12:02:26.480 [INFO] 
2017-05-28T12:02:26.480 [INFO] --- maven-site-plugin:3.5.1:attach-descriptor (attach-descriptor)
@ beam-sdks-common-parent ---
2017-05-28T12:02:26.579 [INFO] 
2017-05-28T12:02:26.579 [INFO] --- maven-jar-plugin:3.0.2:jar (default-jar) @ beam-sdks-common-parent
---
2017-05-28T12:02:26.580 [INFO] Skipping packaging of the jar
2017-05-28T12:02:26.716 [INFO] 
2017-05-28T12:02:26.717 [INFO] --- maven-jar-plugin:3.0.2:test-jar (default-test-jar) @ beam-sdks-common-parent
---
2017-05-28T12:02:26.717 [INFO] Skipping packaging of the test-jar
2017-05-28T12:02:26.767 [INFO] 
2017-05-28T12:02:26.767 [INFO] --- maven-shade-plugin:3.0.0:shade (bundle-and-repackage) @
beam-sdks-common-parent ---
2017-05-28T12:02:26.772 [INFO] Replacing original artifact with shaded artifact.
2017-05-28T12:02:26.822 [INFO] 
2017-05-28T12:02:26.822 [INFO] --- maven-dependency-plugin:3.0.1:analyze-only (default) @
beam-sdks-common-parent ---
2017-05-28T12:02:26.823 [INFO] Skipping pom project
[JENKINS] Archiving disabled
2017-05-28T12:02:27.431 [INFO]                                                           
             
2017-05-28T12:02:27.431 [INFO] ------------------------------------------------------------------------
2017-05-28T12:02:27.431 [INFO] Building Apache Beam :: SDKs :: Common :: Fn API 2.1.0-SNAPSHOT
2017-05-28T12:02:27.431 [INFO] ------------------------------------------------------------------------
2017-05-28T12:02:27.432 [INFO] Downloading: https://repo.maven.apache.org/maven2/org/xolstice/maven/plugins/protobuf-maven-plugin/0.5.0/protobuf-maven-plugin-0.5.0.pom
[INFO] I/O exception (java.net.SocketException) caught when processing request to {s}->https://repo.maven.apache.org:443:
Connection reset
[INFO] Retrying request to {s}->https://repo.maven.apache.org:443
[INFO] I/O exception (java.net.SocketException) caught when processing request to {s}->https://repo.maven.apache.org:443:
Connection reset
[INFO] Retrying request to {s}->https://repo.maven.apache.org:443
[INFO] I/O exception (java.net.SocketException) caught when processing request to {s}->https://repo.maven.apache.org:443:
Connection reset
[INFO] Retrying request to {s}->https://repo.maven.apache.org:443
[JENKINS] Archiving disabled
[JENKINS] Archiving disabled
[JENKINS] Archiving disabled
[JENKINS] Archiving disabled
[JENKINS] Archiving disabled
[JENKINS] Archiving disabled
[JENKINS] Archiving disabled
[JENKINS] Archiving disabled
[JENKINS] Archiving disabled
[JENKINS] Archiving disabled
[JENKINS] Archiving disabled
[JENKINS] Archiving disabled
[JENKINS] Archiving disabled
2017-05-28T12:02:30.781 [INFO] ------------------------------------------------------------------------
2017-05-28T12:02:30.781 [INFO] Reactor Summary:
2017-05-28T12:02:30.781 [INFO] 
2017-05-28T12:02:30.781 [INFO] Apache Beam :: Parent .............................. SUCCESS
[ 24.080 s]
2017-05-28T12:02:30.782 [INFO] Apache Beam :: SDKs :: Java :: Build Tools ......... SUCCESS
[  8.690 s]
2017-05-28T12:02:30.782 [INFO] Apache Beam :: SDKs ................................ SUCCESS
[  1.932 s]
2017-05-28T12:02:30.782 [INFO] Apache Beam :: SDKs :: Common ...................... SUCCESS
[  3.994 s]
2017-05-28T12:02:30.782 [INFO] Apache Beam :: SDKs :: Common :: Fn API ............ FAILURE
[  0.232 s]
2017-05-28T12:02:30.782 [INFO] Apache Beam :: SDKs :: Common :: Runner API ........ SKIPPED
2017-05-28T12:02:30.782 [INFO] Apache Beam :: SDKs :: Java ........................ SKIPPED
2017-05-28T12:02:30.782 [INFO] Apache Beam :: SDKs :: Java :: Core ................ SKIPPED
2017-05-28T12:02:30.782 [INFO] Apache Beam :: Runners ............................. SKIPPED
2017-05-28T12:02:30.782 [INFO] Apache Beam :: Runners :: Core Construction Java ... SKIPPED
2017-05-28T12:02:30.782 [INFO] Apache Beam :: Runners :: Core Java ................ SKIPPED
2017-05-28T12:02:30.782 [INFO] Apache Beam :: Runners :: Flink .................... SKIPPED
2017-05-28T12:02:30.782 [INFO] ------------------------------------------------------------------------
2017-05-28T12:02:30.782 [INFO] BUILD FAILURE
2017-05-28T12:02:30.782 [INFO] ------------------------------------------------------------------------
2017-05-28T12:02:30.782 [INFO] Total time: 01:06 min
2017-05-28T12:02:30.782 [INFO] Finished at: 2017-05-28T12:02:30+00:00
2017-05-28T12:02:31.471 [INFO] Final Memory: 78M/987M
2017-05-28T12:02:31.471 [INFO] ------------------------------------------------------------------------
2017-05-28T12:02:31.471 [WARNING] The requested profile "validates-runner-tests" could not
be activated because it does not exist.
Waiting for Jenkins to finish collecting data
2017-05-28T12:02:37.757 [ERROR] Plugin org.xolstice.maven.plugins:protobuf-maven-plugin:0.5.0
or one of its dependencies could not be resolved: Failed to read artifact descriptor for org.xolstice.maven.plugins:protobuf-maven-plugin:jar:0.5.0:
Could not transfer artifact org.xolstice.maven.plugins:protobuf-maven-plugin:pom:0.5.0 from/to
central (https://repo.maven.apache.org/maven2): Connection reset -> [Help 1]
org.apache.maven.plugin.PluginResolutionException: Plugin org.xolstice.maven.plugins:protobuf-maven-plugin:0.5.0
or one of its dependencies could not be resolved: Failed to read artifact descriptor for org.xolstice.maven.plugins:protobuf-maven-plugin:jar:0.5.0
	at org.apache.maven.plugin.internal.DefaultPluginDependenciesResolver.resolve(DefaultPluginDependenciesResolver.java:117)
	at org.apache.maven.plugin.internal.DefaultMavenPluginManager.getPluginDescriptor(DefaultMavenPluginManager.java:179)
	at org.apache.maven.plugin.internal.DefaultMavenPluginManager.getMojoDescriptor(DefaultMavenPluginManager.java:298)
	at org.apache.maven.plugin.DefaultBuildPluginManager.getMojoDescriptor(DefaultBuildPluginManager.java:241)
	at org.apache.maven.lifecycle.internal.DefaultLifecycleMappingDelegate.calculateLifecycleMappings(DefaultLifecycleMappingDelegate.java:110)
	at org.apache.maven.lifecycle.internal.DefaultLifecycleExecutionPlanCalculator.calculateLifecycleMappings(DefaultLifecycleExecutionPlanCalculator.java:266)
	at org.apache.maven.lifecycle.internal.DefaultLifecycleExecutionPlanCalculator.calculateMojoExecutions(DefaultLifecycleExecutionPlanCalculator.java:217)
	at org.apache.maven.lifecycle.internal.DefaultLifecycleExecutionPlanCalculator.calculateExecutionPlan(DefaultLifecycleExecutionPlanCalculator.java:127)
	at org.apache.maven.lifecycle.internal.DefaultLifecycleExecutionPlanCalculator.calculateExecutionPlan(DefaultLifecycleExecutionPlanCalculator.java:145)
	at org.apache.maven.lifecycle.internal.builder.BuilderCommon.resolveBuildPlan(BuilderCommon.java:96)
	at org.apache.maven.lifecycle.internal.LifecycleModuleBuilder.buildProject(LifecycleModuleBuilder.java:109)
	at org.apache.maven.lifecycle.internal.LifecycleModuleBuilder.buildProject(LifecycleModuleBuilder.java:80)
	at org.apache.maven.lifecycle.internal.builder.singlethreaded.SingleThreadedBuilder.build(SingleThreadedBuilder.java:51)
	at org.apache.maven.lifecycle.internal.LifecycleStarter.execute(LifecycleStarter.java:128)
	at org.apache.maven.DefaultMaven.doExecute(DefaultMaven.java:307)
	at org.apache.maven.DefaultMaven.doExecute(DefaultMaven.java:193)
	at org.apache.maven.DefaultMaven.execute(DefaultMaven.java:106)
	at org.jvnet.hudson.maven3.launcher.Maven33Launcher.main(Maven33Launcher.java:129)
	at sun.reflect.NativeMethodAccessorImpl.invoke0(Native Method)
	at sun.reflect.NativeMethodAccessorImpl.invoke(NativeMethodAccessorImpl.java:62)
	at sun.reflect.DelegatingMethodAccessorImpl.invoke(DelegatingMethodAccessorImpl.java:43)
	at java.lang.reflect.Method.invoke(Method.java:498)
	at org.codehaus.plexus.classworlds.launcher.Launcher.launchStandard(Launcher.java:330)
	at org.codehaus.plexus.classworlds.launcher.Launcher.launch(Launcher.java:238)
	at jenkins.maven3.agent.Maven33Main.launch(Maven33Main.java:176)
	at sun.reflect.NativeMethodAccessorImpl.invoke0(Native Method)
	at sun.reflect.NativeMethodAccessorImpl.invoke(NativeMethodAccessorImpl.java:62)
	at sun.reflect.DelegatingMethodAccessorImpl.invoke(DelegatingMethodAccessorImpl.java:43)
	at java.lang.reflect.Method.invoke(Method.java:498)
	at hudson.maven.Maven3Builder.call(Maven3Builder.java:139)
	at hudson.maven.Maven3Builder.call(Maven3Builder.java:70)
	at hudson.remoting.UserRequest.perform(UserRequest.java:153)
	at hudson.remoting.UserRequest.perform(UserRequest.java:50)
	at hudson.remoting.Request$2.run(Request.java:336)
	at hudson.remoting.InterceptingExecutorService$1.call(InterceptingExecutorService.java:68)
	at java.util.concurrent.FutureTask.run(FutureTask.java:266)
	at java.util.concurrent.ThreadPoolExecutor.runWorker(ThreadPoolExecutor.java:1142)
	at java.util.concurrent.ThreadPoolExecutor$Worker.run(ThreadPoolExecutor.java:617)
	at java.lang.Thread.run(Thread.java:745)
Caused by: org.eclipse.aether.resolution.ArtifactDescriptorException: Failed to read artifact
descriptor for org.xolstice.maven.plugins:protobuf-maven-plugin:jar:0.5.0
	at org.apache.maven.repository.internal.DefaultArtifactDescriptorReader.loadPom(DefaultArtifactDescriptorReader.java:302)
	at org.apache.maven.repository.internal.DefaultArtifactDescriptorReader.readArtifactDescriptor(DefaultArtifactDescriptorReader.java:218)
	at org.eclipse.aether.internal.impl.DefaultRepositorySystem.readArtifactDescriptor(DefaultRepositorySystem.java:287)
	at org.apache.maven.plugin.internal.DefaultPluginDependenciesResolver.resolve(DefaultPluginDependenciesResolver.java:103)
	... 38 more
Caused by: org.eclipse.aether.resolution.ArtifactResolutionException: Could not transfer artifact
org.xolstice.maven.plugins:protobuf-maven-plugin:pom:0.5.0 from/to central (https://repo.maven.apache.org/maven2):
Connection reset
	at org.eclipse.aether.internal.impl.DefaultArtifactResolver.resolve(DefaultArtifactResolver.java:444)
	at org.eclipse.aether.internal.impl.DefaultArtifactResolver.resolveArtifacts(DefaultArtifactResolver.java:246)
	at org.eclipse.aether.internal.impl.DefaultArtifactResolver.resolveArtifact(DefaultArtifactResolver.java:223)
	at org.apache.maven.repository.internal.DefaultArtifactDescriptorReader.loadPom(DefaultArtifactDescriptorReader.java:287)
	... 41 more
Caused by: org.eclipse.aether.transfer.ArtifactTransferException: Could not transfer artifact
org.xolstice.maven.plugins:protobuf-maven-plugin:pom:0.5.0 from/to central (https://repo.maven.apache.org/maven2):
Connection reset
	at org.eclipse.aether.connector.basic.ArtifactTransportListener.transferFailed(ArtifactTransportListener.java:43)
	at org.eclipse.aether.connector.basic.BasicRepositoryConnector$TaskRunner.run(BasicRepositoryConnector.java:355)
	at org.eclipse.aether.util.concurrency.RunnableErrorForwarder$1.run(RunnableErrorForwarder.java:67)
	at org.eclipse.aether.connector.basic.BasicRepositoryConnector$DirectExecutor.execute(BasicRepositoryConnector.java:581)
	at org.eclipse.aether.connector.basic.BasicRepositoryConnector.get(BasicRepositoryConnector.java:249)
	at org.eclipse.aether.internal.impl.DefaultArtifactResolver.performDownloads(DefaultArtifactResolver.java:520)
	at org.eclipse.aether.internal.impl.DefaultArtifactResolver.resolve(DefaultArtifactResolver.java:421)
	... 44 more
Caused by: org.apache.maven.wagon.TransferFailedException: Connection reset
	at org.apache.maven.wagon.providers.http.AbstractHttpClientWagon.fillInputData(AbstractHttpClientWagon.java:1066)
	at org.apache.maven.wagon.providers.http.AbstractHttpClientWagon.fillInputData(AbstractHttpClientWagon.java:960)
	at org.apache.maven.wagon.StreamWagon.getInputStream(StreamWagon.java:116)
	at org.apache.maven.wagon.StreamWagon.getIfNewer(StreamWagon.java:88)
	at org.apache.maven.wagon.StreamWagon.get(StreamWagon.java:61)
	at org.eclipse.aether.transport.wagon.WagonTransporter$GetTaskRunner.run(WagonTransporter.java:560)
	at org.eclipse.aether.transport.wagon.WagonTransporter.execute(WagonTransporter.java:427)
	at org.eclipse.aether.transport.wagon.WagonTransporter.get(WagonTransporter.java:404)
	at org.eclipse.aether.connector.basic.BasicRepositoryConnector$GetTaskRunner.runTask(BasicRepositoryConnector.java:447)
	at org.eclipse.aether.connector.basic.BasicRepositoryConnector$TaskRunner.run(BasicRepositoryConnector.java:350)
	... 49 more
Caused by: java.net.SocketException: Connection reset
	at java.net.SocketInputStream.read(SocketInputStream.java:210)
	at java.net.SocketInputStream.read(SocketInputStream.java:141)
	at sun.security.ssl.InputRecord.readFully(InputRecord.java:465)
	at sun.security.ssl.InputRecord.read(InputRecord.java:503)
	at sun.security.ssl.SSLSocketImpl.readRecord(SSLSocketImpl.java:973)
	at sun.security.ssl.SSLSocketImpl.readDataRecord(SSLSocketImpl.java:930)
	at sun.security.ssl.AppInputStream.read(AppInputStream.java:105)
	at org.apache.maven.wagon.providers.http.httpclient.impl.io.SessionInputBufferImpl.streamRead(SessionInputBufferImpl.java:136)
	at org.apache.maven.wagon.providers.http.httpclient.impl.io.SessionInputBufferImpl.fillBuffer(SessionInputBufferImpl.java:152)
	at org.apache.maven.wagon.providers.http.httpclient.impl.io.SessionInputBufferImpl.readLine(SessionInputBufferImpl.java:270)
	at org.apache.maven.wagon.providers.http.httpclient.impl.conn.DefaultHttpResponseParser.parseHead(DefaultHttpResponseParser.java:140)
	at org.apache.maven.wagon.providers.http.httpclient.impl.conn.DefaultHttpResponseParser.parseHead(DefaultHttpResponseParser.java:57)
	at org.apache.maven.wagon.providers.http.httpclient.impl.io.AbstractMessageParser.parse(AbstractMessageParser.java:260)
	at org.apache.maven.wagon.providers.http.httpclient.impl.DefaultBHttpClientConnection.receiveResponseHeader(DefaultBHttpClientConnection.java:161)
	at org.apache.maven.wagon.providers.http.httpclient.impl.conn.CPoolProxy.receiveResponseHeader(CPoolProxy.java:153)
	at org.apache.maven.wagon.providers.http.httpclient.protocol.HttpRequestExecutor.doReceiveResponse(HttpRequestExecutor.java:271)
	at org.apache.maven.wagon.providers.http.httpclient.protocol.HttpRequestExecutor.execute(HttpRequestExecutor.java:123)
	at org.apache.maven.wagon.providers.http.httpclient.impl.execchain.MainClientExec.execute(MainClientExec.java:254)
	at org.apache.maven.wagon.providers.http.httpclient.impl.execchain.ProtocolExec.execute(ProtocolExec.java:195)
	at org.apache.maven.wagon.providers.http.httpclient.impl.execchain.RetryExec.execute(RetryExec.java:86)
	at org.apache.maven.wagon.providers.http.httpclient.impl.execchain.RedirectExec.execute(RedirectExec.java:108)
	at org.apache.maven.wagon.providers.http.httpclient.impl.client.InternalHttpClient.doExecute(InternalHttpClient.java:184)
	at org.apache.maven.wagon.providers.http.httpclient.impl.client.CloseableHttpClient.execute(CloseableHttpClient.java:82)
	at org.apache.maven.wagon.providers.http.AbstractHttpClientWagon.execute(AbstractHttpClientWagon.java:832)
	at org.apache.maven.wagon.providers.http.AbstractHttpClientWagon.fillInputData(AbstractHttpClientWagon.java:983)
	... 58 more
2017-05-28T12:02:37.759 [ERROR] 
2017-05-28T12:02:37.759 [ERROR] Re-run Maven using the -X switch to enable full debug logging.
2017-05-28T12:02:37.759 [ERROR] 
2017-05-28T12:02:37.759 [ERROR] For more information about the errors and possible solutions,
please read the following articles:
2017-05-28T12:02:37.759 [ERROR] [Help 1] http://cwiki.apache.org/confluence/display/MAVEN/PluginResolutionException
channel stopped
Not sending mail to unregistered user kirpichov@google.com
Not sending mail to unregistered user klk@google.com
Not sending mail to unregistered user hepei.hp@alibaba-inc.com

Mime
View raw message