beam-commits mailing list archives

Site index · List index
Message view « Date » · « Thread »
Top « Date » · « Thread »
From Apache Jenkins Server <jenk...@builds.apache.org>
Subject Build failed in Jenkins: beam_PostCommit_Java_MavenInstall #3973
Date Wed, 31 May 2017 18:53:36 GMT
See <https://builds.apache.org/job/beam_PostCommit_Java_MavenInstall/3973/display/redirect?page=changes>

Changes:

[tgroh] Reduce Prevalence of PValue in the DirectRunner

------------------------------------------
[...truncated 3.07 MB...]
2017-05-31T18:51:34.267 [INFO] Downloaded: https://repo.maven.apache.org/maven2/org/apache/sling/org.apache.sling.commons.json/2.0.6/org.apache.sling.commons.json-2.0.6.jar
(47 KB at 52.1 KB/sec)
2017-05-31T18:51:34.267 [INFO] Downloading: https://repo.maven.apache.org/maven2/org/apache/flink/flink-runtime_2.10/1.2.1/flink-runtime_2.10-1.2.1-tests.jar
2017-05-31T18:51:34.311 [INFO] Downloaded: https://repo.maven.apache.org/maven2/org/scala-lang/scala-library/2.10.4/scala-library-2.10.4.jar
(6960 KB at 7387.8 KB/sec)
2017-05-31T18:51:34.311 [INFO] Downloading: https://repo.maven.apache.org/maven2/org/apache/flink/flink-streaming-java_2.10/1.2.1/flink-streaming-java_2.10-1.2.1-tests.jar
2017-05-31T18:51:34.337 [INFO] Downloaded: https://repo.maven.apache.org/maven2/org/apache/flink/flink-core/1.2.1/flink-core-1.2.1-tests.jar
(716 KB at 739.5 KB/sec)
2017-05-31T18:51:34.337 [INFO] Downloading: https://repo.maven.apache.org/maven2/org/apache/flink/flink-test-utils_2.10/1.2.1/flink-test-utils_2.10-1.2.1.jar
2017-05-31T18:51:34.411 [INFO] Downloaded: https://repo.maven.apache.org/maven2/org/apache/flink/flink-streaming-java_2.10/1.2.1/flink-streaming-java_2.10-1.2.1-tests.jar
(953 KB at 914.5 KB/sec)
2017-05-31T18:51:34.411 [INFO] Downloading: https://repo.maven.apache.org/maven2/org/apache/flink/flink-test-utils-junit/1.2.1/flink-test-utils-junit-1.2.1.jar
2017-05-31T18:51:34.439 [INFO] Downloaded: https://repo.maven.apache.org/maven2/org/apache/flink/flink-test-utils-junit/1.2.1/flink-test-utils-junit-1.2.1.jar
(24 KB at 21.5 KB/sec)
2017-05-31T18:51:34.439 [INFO] Downloading: https://repo.maven.apache.org/maven2/org/apache/curator/curator-test/2.8.0/curator-test-2.8.0.jar
2017-05-31T18:51:34.471 [INFO] Downloaded: https://repo.maven.apache.org/maven2/org/apache/curator/curator-test/2.8.0/curator-test-2.8.0.jar
(39 KB at 35.3 KB/sec)
2017-05-31T18:51:34.498 [INFO] Downloaded: https://repo.maven.apache.org/maven2/org/apache/flink/flink-streaming-java_2.10/1.2.1/flink-streaming-java_2.10-1.2.1.jar
(3035 KB at 2687.5 KB/sec)
2017-05-31T18:51:34.519 [INFO] Downloaded: https://repo.maven.apache.org/maven2/org/apache/flink/flink-runtime_2.10/1.2.1/flink-runtime_2.10-1.2.1-tests.jar
(2432 KB at 2114.5 KB/sec)
2017-05-31T18:51:34.566 [INFO] Downloaded: https://repo.maven.apache.org/maven2/org/apache/flink/flink-test-utils_2.10/1.2.1/flink-test-utils_2.10-1.2.1.jar
(2366 KB at 1976.4 KB/sec)
2017-05-31T18:51:34.898 [INFO] Downloaded: https://repo.maven.apache.org/maven2/org/apache/flink/flink-shaded-hadoop2/1.2.1/flink-shaded-hadoop2-1.2.1.jar
(17860 KB at 11672.8 KB/sec)
2017-05-31T18:51:34.912 [INFO] 
2017-05-31T18:51:34.912 [INFO] --- maven-clean-plugin:3.0.0:clean (default-clean) @ beam-runners-flink_2.10
---
2017-05-31T18:51:34.928 [INFO] Deleting <https://builds.apache.org/job/beam_PostCommit_Java_MavenInstall/ws/runners/flink>
(includes = [**/*.pyc, **/*.egg-info/, **/sdks/python/LICENSE, **/sdks/python/NOTICE, **/sdks/python/README.md],
excludes = [])
2017-05-31T18:51:35.298 [INFO] 
2017-05-31T18:51:35.298 [INFO] --- maven-enforcer-plugin:1.4.1:enforce (enforce) @ beam-runners-flink_2.10
---
2017-05-31T18:51:38.083 [INFO] 
2017-05-31T18:51:38.083 [INFO] --- maven-enforcer-plugin:1.4.1:enforce (enforce-banned-dependencies)
@ beam-runners-flink_2.10 ---
2017-05-31T18:51:38.153 [INFO] 
2017-05-31T18:51:38.153 [INFO] --- maven-remote-resources-plugin:1.5:process (process-resource-bundles)
@ beam-runners-flink_2.10 ---
2017-05-31T18:51:38.681 [INFO] 
2017-05-31T18:51:38.681 [INFO] --- maven-resources-plugin:3.0.2:resources (default-resources)
@ beam-runners-flink_2.10 ---
2017-05-31T18:51:38.682 [INFO] Using 'UTF-8' encoding to copy filtered resources.
2017-05-31T18:51:38.682 [INFO] Copying 1 resource
2017-05-31T18:51:38.699 [INFO] Copying 3 resources
2017-05-31T18:51:38.771 [INFO] 
2017-05-31T18:51:38.771 [INFO] --- maven-compiler-plugin:3.6.1:compile (default-compile) @
beam-runners-flink_2.10 ---
2017-05-31T18:51:38.783 [INFO] Changes detected - recompiling the module!
2017-05-31T18:51:38.784 [INFO] Compiling 75 source files to <https://builds.apache.org/job/beam_PostCommit_Java_MavenInstall/ws/runners/flink/target/classes>
2017-05-31T18:51:40.209 [WARNING] bootstrap class path not set in conjunction with -source
1.7
2017-05-31T18:51:40.209 [INFO] <https://builds.apache.org/job/beam_PostCommit_Java_MavenInstall/ws/runners/flink/src/main/java/org/apache/beam/runners/flink/FlinkStreamingTransformTranslators.java>:
Some input files use or override a deprecated API.
2017-05-31T18:51:40.209 [INFO] <https://builds.apache.org/job/beam_PostCommit_Java_MavenInstall/ws/runners/flink/src/main/java/org/apache/beam/runners/flink/FlinkStreamingTransformTranslators.java>:
Recompile with -Xlint:deprecation for details.
2017-05-31T18:51:40.209 [INFO] <https://builds.apache.org/job/beam_PostCommit_Java_MavenInstall/ws/runners/flink/src/main/java/org/apache/beam/runners/flink/translation/wrappers/streaming/DoFnOperator.java>:
Some input files use unchecked or unsafe operations.
2017-05-31T18:51:40.209 [INFO] <https://builds.apache.org/job/beam_PostCommit_Java_MavenInstall/ws/runners/flink/src/main/java/org/apache/beam/runners/flink/translation/wrappers/streaming/DoFnOperator.java>:
Recompile with -Xlint:unchecked for details.
2017-05-31T18:51:40.299 [INFO] 
2017-05-31T18:51:40.299 [INFO] --- maven-resources-plugin:3.0.2:testResources (default-testResources)
@ beam-runners-flink_2.10 ---
2017-05-31T18:51:40.300 [INFO] Using 'UTF-8' encoding to copy filtered resources.
2017-05-31T18:51:40.300 [INFO] Copying 1 resource
2017-05-31T18:51:40.302 [INFO] Copying 3 resources
2017-05-31T18:51:40.389 [INFO] 
2017-05-31T18:51:40.389 [INFO] --- maven-compiler-plugin:3.6.1:testCompile (default-testCompile)
@ beam-runners-flink_2.10 ---
2017-05-31T18:51:40.399 [INFO] Changes detected - recompiling the module!
2017-05-31T18:51:40.399 [INFO] Compiling 17 source files to <https://builds.apache.org/job/beam_PostCommit_Java_MavenInstall/ws/runners/flink/target/test-classes>
2017-05-31T18:51:40.991 [INFO] <https://builds.apache.org/job/beam_PostCommit_Java_MavenInstall/ws/runners/flink/src/test/java/org/apache/beam/runners/flink/streaming/DoFnOperatorTest.java>:
Some input files use unchecked or unsafe operations.
2017-05-31T18:51:40.992 [INFO] <https://builds.apache.org/job/beam_PostCommit_Java_MavenInstall/ws/runners/flink/src/test/java/org/apache/beam/runners/flink/streaming/DoFnOperatorTest.java>:
Recompile with -Xlint:unchecked for details.
2017-05-31T18:51:41.469 [INFO] 
2017-05-31T18:51:41.469 [INFO] --- maven-checkstyle-plugin:2.17:check (default) @ beam-runners-flink_2.10
---
2017-05-31T18:51:42.865 [INFO] Starting audit...
Audit done.
2017-05-31T18:51:43.004 [INFO] 
2017-05-31T18:51:43.004 [INFO] >>> findbugs-maven-plugin:3.0.4:check (default) >
:findbugs @ beam-runners-flink_2.10 >>>
2017-05-31T18:51:43.022 [INFO] 
2017-05-31T18:51:43.022 [INFO] --- findbugs-maven-plugin:3.0.4:findbugs (findbugs) @ beam-runners-flink_2.10
---
2017-05-31T18:51:43.027 [INFO] Fork Value is true
     [java] Warnings generated: 2
2017-05-31T18:51:56.528 [INFO] Done FindBugs Analysis....
2017-05-31T18:51:56.934 [INFO] 
2017-05-31T18:51:56.934 [INFO] <<< findbugs-maven-plugin:3.0.4:check (default) <
:findbugs @ beam-runners-flink_2.10 <<<
2017-05-31T18:51:56.934 [INFO] 
2017-05-31T18:51:56.934 [INFO] --- findbugs-maven-plugin:3.0.4:check (default) @ beam-runners-flink_2.10
---
2017-05-31T18:51:56.942 [INFO] BugInstance size is 2
2017-05-31T18:51:56.942 [INFO] Error size is 0
2017-05-31T18:51:56.945 [INFO] Total bugs: 2
2017-05-31T18:51:56.951 [INFO] Possible null pointer dereference of FlinkDoFnFunction.outputMap
in org.apache.beam.runners.flink.translation.functions.FlinkDoFnFunction.mapPartition(Iterable,
Collector) [org.apache.beam.runners.flink.translation.functions.FlinkDoFnFunction, org.apache.beam.runners.flink.translation.functions.FlinkDoFnFunction,
org.apache.beam.runners.flink.translation.functions.FlinkDoFnFunction] Dereferenced at FlinkDoFnFunction.java:[line
101]Null value at FlinkDoFnFunction.java:[line 93]Known null at FlinkDoFnFunction.java:[line
94] NP_NULL_ON_SOME_PATH
2017-05-31T18:51:56.951 [INFO] Possible null pointer dereference of FlinkStatefulDoFnFunction.outputMap
in org.apache.beam.runners.flink.translation.functions.FlinkStatefulDoFnFunction.reduce(Iterable,
Collector) [org.apache.beam.runners.flink.translation.functions.FlinkStatefulDoFnFunction,
org.apache.beam.runners.flink.translation.functions.FlinkStatefulDoFnFunction, org.apache.beam.runners.flink.translation.functions.FlinkStatefulDoFnFunction]
Dereferenced at FlinkStatefulDoFnFunction.java:[line 118]Null value at FlinkStatefulDoFnFunction.java:[line
94]Known null at FlinkStatefulDoFnFunction.java:[line 95] NP_NULL_ON_SOME_PATH
2017-05-31T18:51:56.951 [INFO] 


To see bug detail using the Findbugs GUI, use the following command "mvn findbugs:gui"



[JENKINS] Archiving disabled
2017-05-31T18:51:58.625 [INFO]                                                           
             
2017-05-31T18:51:58.625 [INFO] ------------------------------------------------------------------------
2017-05-31T18:51:58.625 [INFO] Skipping Apache Beam :: Parent
2017-05-31T18:51:58.625 [INFO] This project has been banned from the build due to previous
failures.
2017-05-31T18:51:58.625 [INFO] ------------------------------------------------------------------------
[JENKINS] Archiving disabled
[JENKINS] Archiving disabled
[JENKINS] Archiving disabled
[JENKINS] Archiving disabled
[JENKINS] Archiving disabled
[JENKINS] Archiving disabled
[JENKINS] Archiving disabled
[JENKINS] Archiving disabled
[JENKINS] Archiving disabled
[JENKINS] Archiving disabled
[JENKINS] Archiving disabled
[JENKINS] Archiving disabled
[JENKINS] Archiving disabled
[JENKINS] Archiving disabled
[JENKINS] Archiving disabled
[JENKINS] Archiving disabled
[JENKINS] Archiving disabled
[JENKINS] Archiving disabled
[JENKINS] Archiving disabled
[JENKINS] Archiving disabled
[JENKINS] Archiving disabled
[JENKINS] Archiving disabled
[JENKINS] Archiving disabled
[JENKINS] Archiving disabled
[JENKINS] Archiving disabled
[JENKINS] Archiving disabled
[JENKINS] Archiving disabled
[JENKINS] Archiving disabled
[JENKINS] Archiving disabled
[JENKINS] Archiving disabled
[JENKINS] Archiving disabled
[JENKINS] Archiving disabled
[JENKINS] Archiving disabled
[JENKINS] Archiving disabled
[JENKINS] Archiving disabled
[JENKINS] Archiving disabled
[JENKINS] Archiving disabled
[JENKINS] Archiving disabled
[JENKINS] Archiving disabled
[JENKINS] Archiving disabled
[JENKINS] Archiving disabled
[JENKINS] Archiving disabled
[JENKINS] Archiving disabled
[JENKINS] Archiving disabled
[JENKINS] Archiving disabled
[JENKINS] Archiving disabled
2017-05-31T18:52:22.315 [INFO] ------------------------------------------------------------------------
2017-05-31T18:52:22.315 [INFO] Reactor Summary:
2017-05-31T18:52:22.315 [INFO] 
2017-05-31T18:52:22.315 [INFO] Apache Beam :: Parent .............................. SUCCESS
[01:12 min]
2017-05-31T18:52:22.315 [INFO] Apache Beam :: SDKs :: Java :: Build Tools ......... SUCCESS
[ 22.541 s]
2017-05-31T18:52:22.315 [INFO] Apache Beam :: SDKs ................................ SUCCESS
[ 10.706 s]
2017-05-31T18:52:22.315 [INFO] Apache Beam :: SDKs :: Common ...................... SUCCESS
[  7.797 s]
2017-05-31T18:52:22.315 [INFO] Apache Beam :: SDKs :: Common :: Fn API ............ SUCCESS
[ 42.175 s]
2017-05-31T18:52:22.315 [INFO] Apache Beam :: SDKs :: Common :: Runner API ........ SUCCESS
[ 22.414 s]
2017-05-31T18:52:22.315 [INFO] Apache Beam :: SDKs :: Java ........................ SUCCESS
[  4.479 s]
2017-05-31T18:52:22.315 [INFO] Apache Beam :: SDKs :: Java :: Core ................ SUCCESS
[03:32 min]
2017-05-31T18:52:22.315 [INFO] Apache Beam :: SDKs :: Java :: IO .................. SUCCESS
[  7.862 s]
2017-05-31T18:52:22.315 [INFO] Apache Beam :: SDKs :: Java :: IO :: Common ........ SUCCESS
[ 12.499 s]
2017-05-31T18:52:22.315 [INFO] Apache Beam :: Runners ............................. SUCCESS
[  2.533 s]
2017-05-31T18:52:22.315 [INFO] Apache Beam :: Runners :: Core Construction Java ... SUCCESS
[ 34.270 s]
2017-05-31T18:52:22.315 [INFO] Apache Beam :: Runners :: Core Java ................ SUCCESS
[ 50.396 s]
2017-05-31T18:52:22.315 [INFO] Apache Beam :: Runners :: Direct Java .............. SUCCESS
[03:25 min]
2017-05-31T18:52:22.316 [INFO] Apache Beam :: SDKs :: Java :: IO :: Elasticsearch . SUCCESS
[ 48.089 s]
2017-05-31T18:52:22.316 [INFO] Apache Beam :: SDKs :: Java :: Extensions .......... SUCCESS
[  2.335 s]
2017-05-31T18:52:22.316 [INFO] Apache Beam :: SDKs :: Java :: Extensions :: Google Cloud Platform
Core SUCCESS [ 41.325 s]
2017-05-31T18:52:22.316 [INFO] Apache Beam :: SDKs :: Java :: Extensions :: Protobuf SUCCESS
[ 22.507 s]
2017-05-31T18:52:22.316 [INFO] Apache Beam :: SDKs :: Java :: IO :: Google Cloud Platform
SUCCESS [01:31 min]
2017-05-31T18:52:22.316 [INFO] Apache Beam :: SDKs :: Java :: IO :: Hadoop Common . SUCCESS
[ 25.768 s]
2017-05-31T18:52:22.316 [INFO] Apache Beam :: SDKs :: Java :: IO :: Hadoop File System SUCCESS
[ 50.860 s]
2017-05-31T18:52:22.316 [INFO] Apache Beam :: SDKs :: Java :: IO :: Hadoop ........ SUCCESS
[  6.059 s]
2017-05-31T18:52:22.316 [INFO] Apache Beam :: SDKs :: Java :: IO :: Hadoop :: input-format
SUCCESS [ 34.035 s]
2017-05-31T18:52:22.316 [INFO] Apache Beam :: Runners :: Google Cloud Dataflow .... SUCCESS
[06:34 min]
2017-05-31T18:52:22.316 [INFO] Apache Beam :: SDKs :: Java :: IO :: Hadoop :: jdk1.8-tests
SUCCESS [01:41 min]
2017-05-31T18:52:22.316 [INFO] Apache Beam :: SDKs :: Java :: IO :: HBase ......... SUCCESS
[01:21 min]
2017-05-31T18:52:22.316 [INFO] Apache Beam :: SDKs :: Java :: IO :: JDBC .......... SUCCESS
[ 32.355 s]
2017-05-31T18:52:22.316 [INFO] Apache Beam :: SDKs :: Java :: IO :: JMS ........... SUCCESS
[ 26.631 s]
2017-05-31T18:52:22.316 [INFO] Apache Beam :: SDKs :: Java :: IO :: Kafka ......... SUCCESS
[ 30.631 s]
2017-05-31T18:52:22.316 [INFO] Apache Beam :: SDKs :: Java :: IO :: Kinesis ....... SUCCESS
[ 29.265 s]
2017-05-31T18:52:22.316 [INFO] Apache Beam :: SDKs :: Java :: IO :: MongoDB ....... SUCCESS
[ 44.562 s]
2017-05-31T18:52:22.316 [INFO] Apache Beam :: SDKs :: Java :: IO :: MQTT .......... SUCCESS
[ 28.316 s]
2017-05-31T18:52:22.316 [INFO] Apache Beam :: SDKs :: Java :: IO :: XML ........... SUCCESS
[ 34.245 s]
2017-05-31T18:52:22.316 [INFO] Apache Beam :: SDKs :: Java :: Maven Archetypes .... SUCCESS
[  2.599 s]
2017-05-31T18:52:22.316 [INFO] Apache Beam :: SDKs :: Java :: Maven Archetypes :: Starter
SUCCESS [ 15.574 s]
2017-05-31T18:52:22.316 [INFO] Apache Beam :: Examples ............................ SUCCESS
[  1.724 s]
2017-05-31T18:52:22.316 [INFO] Apache Beam :: Examples :: Java .................... SUCCESS
[09:58 min]
2017-05-31T18:52:22.316 [INFO] Apache Beam :: SDKs :: Java :: Maven Archetypes :: Examples
SUCCESS [ 43.482 s]
2017-05-31T18:52:22.316 [INFO] Apache Beam :: Examples :: Java 8 .................. SUCCESS
[ 27.447 s]
2017-05-31T18:52:22.316 [INFO] Apache Beam :: SDKs :: Java :: Maven Archetypes :: Examples
- Java 8 SUCCESS [ 43.447 s]
2017-05-31T18:52:22.316 [INFO] Apache Beam :: SDKs :: Java :: Extensions :: Jackson SUCCESS
[ 25.445 s]
2017-05-31T18:52:22.316 [INFO] Apache Beam :: SDKs :: Java :: Extensions :: Join library SUCCESS
[ 26.959 s]
2017-05-31T18:52:22.316 [INFO] Apache Beam :: SDKs :: Java :: Extensions :: Sorter  SUCCESS
[ 50.649 s]
2017-05-31T18:52:22.316 [INFO] Apache Beam :: SDKs :: Java :: Harness ............. SUCCESS
[ 42.174 s]
2017-05-31T18:52:22.316 [INFO] Apache Beam :: SDKs :: Java :: Java 8 Tests ........ SUCCESS
[ 14.211 s]
2017-05-31T18:52:22.316 [INFO] Apache Beam :: SDKs :: Python ...................... SUCCESS
[22:35 min]
2017-05-31T18:52:22.316 [INFO] Apache Beam :: Runners :: Flink .................... FAILURE
[ 26.346 s]
2017-05-31T18:52:22.316 [INFO] Apache Beam :: Runners :: Spark .................... SKIPPED
2017-05-31T18:52:22.316 [INFO] Apache Beam :: Runners :: Apex ..................... SKIPPED
2017-05-31T18:52:22.316 [INFO] Apache Beam :: SDKs :: Java :: Aggregated Javadoc .. SKIPPED
2017-05-31T18:52:22.316 [INFO] ------------------------------------------------------------------------
2017-05-31T18:52:22.316 [INFO] BUILD FAILURE
2017-05-31T18:52:22.316 [INFO] ------------------------------------------------------------------------
2017-05-31T18:52:22.316 [INFO] Total time: 01:11 h
2017-05-31T18:52:22.317 [INFO] Finished at: 2017-05-31T18:52:22+00:00
2017-05-31T18:52:22.929 [INFO] Final Memory: 265M/1672M
2017-05-31T18:52:22.930 [INFO] ------------------------------------------------------------------------
Waiting for Jenkins to finish collecting data
2017-05-31T18:53:25.634 [ERROR] Failed to execute goal org.codehaus.mojo:findbugs-maven-plugin:3.0.4:check
(default) on project beam-runners-flink_2.10: failed with 2 bugs and 0 errors -> [Help
1]
org.apache.maven.lifecycle.LifecycleExecutionException: Failed to execute goal org.codehaus.mojo:findbugs-maven-plugin:3.0.4:check
(default) on project beam-runners-flink_2.10: failed with 2 bugs and 0 errors 
	at org.apache.maven.lifecycle.internal.MojoExecutor.execute(MojoExecutor.java:216)
	at org.apache.maven.lifecycle.internal.MojoExecutor.execute(MojoExecutor.java:153)
	at org.apache.maven.lifecycle.internal.MojoExecutor.execute(MojoExecutor.java:145)
	at org.apache.maven.lifecycle.internal.LifecycleModuleBuilder.buildProject(LifecycleModuleBuilder.java:116)
	at org.apache.maven.lifecycle.internal.LifecycleModuleBuilder.buildProject(LifecycleModuleBuilder.java:80)
	at org.apache.maven.lifecycle.internal.builder.singlethreaded.SingleThreadedBuilder.build(SingleThreadedBuilder.java:51)
	at org.apache.maven.lifecycle.internal.LifecycleStarter.execute(LifecycleStarter.java:128)
	at org.apache.maven.DefaultMaven.doExecute(DefaultMaven.java:307)
	at org.apache.maven.DefaultMaven.doExecute(DefaultMaven.java:193)
	at org.apache.maven.DefaultMaven.execute(DefaultMaven.java:106)
	at org.jvnet.hudson.maven3.launcher.Maven33Launcher.main(Maven33Launcher.java:129)
	at sun.reflect.NativeMethodAccessorImpl.invoke0(Native Method)
	at sun.reflect.NativeMethodAccessorImpl.invoke(NativeMethodAccessorImpl.java:62)
	at sun.reflect.DelegatingMethodAccessorImpl.invoke(DelegatingMethodAccessorImpl.java:43)
	at java.lang.reflect.Method.invoke(Method.java:498)
	at org.codehaus.plexus.classworlds.launcher.Launcher.launchStandard(Launcher.java:330)
	at org.codehaus.plexus.classworlds.launcher.Launcher.launch(Launcher.java:238)
	at jenkins.maven3.agent.Maven33Main.launch(Maven33Main.java:176)
	at sun.reflect.NativeMethodAccessorImpl.invoke0(Native Method)
	at sun.reflect.NativeMethodAccessorImpl.invoke(NativeMethodAccessorImpl.java:62)
	at sun.reflect.DelegatingMethodAccessorImpl.invoke(DelegatingMethodAccessorImpl.java:43)
	at java.lang.reflect.Method.invoke(Method.java:498)
	at hudson.maven.Maven3Builder.call(Maven3Builder.java:139)
	at hudson.maven.Maven3Builder.call(Maven3Builder.java:70)
	at hudson.remoting.UserRequest.perform(UserRequest.java:153)
	at hudson.remoting.UserRequest.perform(UserRequest.java:50)
	at hudson.remoting.Request$2.run(Request.java:336)
	at hudson.remoting.InterceptingExecutorService$1.call(InterceptingExecutorService.java:68)
	at java.util.concurrent.FutureTask.run(FutureTask.java:266)
	at java.util.concurrent.ThreadPoolExecutor.runWorker(ThreadPoolExecutor.java:1142)
	at java.util.concurrent.ThreadPoolExecutor$Worker.run(ThreadPoolExecutor.java:617)
	at java.lang.Thread.run(Thread.java:745)
Caused by: org.apache.maven.plugin.MojoExecutionException: failed with 2 bugs and 0 errors

	at sun.reflect.NativeConstructorAccessorImpl.newInstance0(Native Method)
	at sun.reflect.NativeConstructorAccessorImpl.newInstance(NativeConstructorAccessorImpl.java:62)
	at sun.reflect.DelegatingConstructorAccessorImpl.newInstance(DelegatingConstructorAccessorImpl.java:45)
	at java.lang.reflect.Constructor.newInstance(Constructor.java:423)
	at org.codehaus.groovy.reflection.CachedConstructor.invoke(CachedConstructor.java:83)
	at org.codehaus.groovy.reflection.CachedConstructor.doConstructorInvoke(CachedConstructor.java:77)
	at org.codehaus.groovy.runtime.callsite.ConstructorSite$ConstructorSiteNoUnwrap.callConstructor(ConstructorSite.java:84)
	at org.codehaus.groovy.runtime.callsite.CallSiteArray.defaultCallConstructor(CallSiteArray.java:60)
	at org.codehaus.groovy.runtime.callsite.AbstractCallSite.callConstructor(AbstractCallSite.java:235)
	at org.codehaus.groovy.runtime.callsite.AbstractCallSite.callConstructor(AbstractCallSite.java:247)
	at org.codehaus.mojo.findbugs.FindbugsViolationCheckMojo.execute(FindbugsViolationCheckMojo.groovy:529)
	at org.apache.maven.plugin.DefaultBuildPluginManager.executeMojo(DefaultBuildPluginManager.java:134)
	at org.apache.maven.lifecycle.internal.MojoExecutor.execute(MojoExecutor.java:208)
	... 31 more
2017-05-31T18:53:25.636 [ERROR] 
2017-05-31T18:53:25.636 [ERROR] Re-run Maven using the -X switch to enable full debug logging.
2017-05-31T18:53:25.636 [ERROR] 
2017-05-31T18:53:25.636 [ERROR] For more information about the errors and possible solutions,
please read the following articles:
2017-05-31T18:53:25.636 [ERROR] [Help 1] http://cwiki.apache.org/confluence/display/MAVEN/MojoExecutionException
2017-05-31T18:53:25.636 [ERROR] 
2017-05-31T18:53:25.636 [ERROR] After correcting the problems, you can resume the build with
the command
2017-05-31T18:53:25.636 [ERROR]   mvn <goals> -rf :beam-runners-flink_2.10
channel stopped
Not sending mail to unregistered user kirpichov@google.com
Not sending mail to unregistered user aljoscha.krettek@gmail.com

Mime
View raw message