beam-commits mailing list archives

Site index · List index
Message view « Date » · « Thread »
Top « Date » · « Thread »
From Apache Jenkins Server <jenk...@builds.apache.org>
Subject Build failed in Jenkins: beam_PostCommit_Java_MavenInstall #3680
Date Fri, 05 May 2017 23:16:40 GMT
See <https://builds.apache.org/job/beam_PostCommit_Java_MavenInstall/3680/display/redirect?page=changes>

Changes:

[davor] [maven-release-plugin] prepare branch release-2.0.0

[davor] [maven-release-plugin] prepare for next development iteration

------------------------------------------
[...truncated 1.31 MB...]
2017-05-05T23:15:37.770 [INFO] Excluding commons-logging:commons-logging:jar:1.1.1 from the
shaded jar.
2017-05-05T23:15:37.770 [INFO] Excluding commons-codec:commons-codec:jar:1.3 from the shaded
jar.
2017-05-05T23:15:37.770 [INFO] Excluding com.google.protobuf:protobuf-java:jar:3.2.0 from
the shaded jar.
2017-05-05T23:15:37.770 [INFO] Excluding com.fasterxml.jackson.core:jackson-core:jar:2.8.8
from the shaded jar.
2017-05-05T23:15:37.770 [INFO] Excluding com.fasterxml.jackson.core:jackson-annotations:jar:2.8.8
from the shaded jar.
2017-05-05T23:15:37.770 [INFO] Excluding com.fasterxml.jackson.core:jackson-databind:jar:2.8.8
from the shaded jar.
2017-05-05T23:15:37.770 [INFO] Excluding net.bytebuddy:byte-buddy:jar:1.6.8 from the shaded
jar.
2017-05-05T23:15:37.770 [INFO] Excluding org.apache.avro:avro:jar:1.8.1 from the shaded jar.
2017-05-05T23:15:37.770 [INFO] Excluding org.codehaus.jackson:jackson-core-asl:jar:1.9.13
from the shaded jar.
2017-05-05T23:15:37.771 [INFO] Excluding org.codehaus.jackson:jackson-mapper-asl:jar:1.9.13
from the shaded jar.
2017-05-05T23:15:37.771 [INFO] Excluding com.thoughtworks.paranamer:paranamer:jar:2.7 from
the shaded jar.
2017-05-05T23:15:37.771 [INFO] Excluding org.tukaani:xz:jar:1.5 from the shaded jar.
2017-05-05T23:15:37.771 [INFO] Excluding org.xerial.snappy:snappy-java:jar:1.1.4-M3 from the
shaded jar.
2017-05-05T23:15:37.771 [INFO] Excluding org.apache.commons:commons-compress:jar:1.9 from
the shaded jar.
2017-05-05T23:15:37.771 [INFO] Excluding org.apache.commons:commons-lang3:jar:3.5 from the
shaded jar.
2017-05-05T23:15:45.147 [INFO] Replacing original artifact with shaded artifact.
2017-05-05T23:15:45.147 [INFO] Replacing <https://builds.apache.org/job/beam_PostCommit_Java_MavenInstall/ws/sdks/java/maven-archetypes/starter/target/beam-sdks-java-maven-archetypes-starter-2.1.0-SNAPSHOT.jar>
with <https://builds.apache.org/job/beam_PostCommit_Java_MavenInstall/ws/sdks/java/maven-archetypes/starter/target/beam-sdks-java-maven-archetypes-starter-2.1.0-SNAPSHOT-shaded.jar>
2017-05-05T23:15:45.240 [INFO] 
2017-05-05T23:15:45.240 [INFO] --- maven-javadoc-plugin:2.10.4:jar (attach-javadocs) @ beam-sdks-java-maven-archetypes-starter
---
2017-05-05T23:15:45.831 [INFO] Not executing Javadoc as the project is not a Java classpath-capable
package
2017-05-05T23:15:45.929 [INFO] 
2017-05-05T23:15:45.929 [INFO] --- maven-source-plugin:3.0.1:jar-no-fork (attach-sources)
@ beam-sdks-java-maven-archetypes-starter ---
2017-05-05T23:15:46.256 [INFO] Building jar: <https://builds.apache.org/job/beam_PostCommit_Java_MavenInstall/ws/sdks/java/maven-archetypes/starter/target/beam-sdks-java-maven-archetypes-starter-2.1.0-SNAPSHOT-sources.jar>
2017-05-05T23:15:46.424 [INFO] 
2017-05-05T23:15:46.424 [INFO] --- maven-source-plugin:3.0.1:test-jar-no-fork (attach-test-sources)
@ beam-sdks-java-maven-archetypes-starter ---
2017-05-05T23:15:46.431 [INFO] Building jar: <https://builds.apache.org/job/beam_PostCommit_Java_MavenInstall/ws/sdks/java/maven-archetypes/starter/target/beam-sdks-java-maven-archetypes-starter-2.1.0-SNAPSHOT-test-sources.jar>
2017-05-05T23:15:46.516 [INFO] 
2017-05-05T23:15:46.516 [INFO] --- maven-dependency-plugin:3.0.0:analyze-only (default) @
beam-sdks-java-maven-archetypes-starter ---
2017-05-05T23:15:47.213 [INFO] No dependency problems found
2017-05-05T23:15:47.306 [INFO] 
2017-05-05T23:15:47.306 [INFO] --- apache-rat-plugin:0.12:check (default) @ beam-sdks-java-maven-archetypes-starter
---
2017-05-05T23:15:47.695 [INFO] Enabled default license matchers.
2017-05-05T23:15:47.698 [INFO] Will parse SCM ignores for exclusions...
2017-05-05T23:15:47.699 [INFO] Finished adding exclusions from SCM ignore files.
2017-05-05T23:15:47.699 [INFO] 61 implicit excludes (use -debug for more details).
2017-05-05T23:15:47.700 [INFO] Exclude: **/target/**/*
2017-05-05T23:15:47.700 [INFO] Exclude: **/dependency-reduced-pom.xml
2017-05-05T23:15:47.700 [INFO] Exclude: **/hs_err_pid*.log
2017-05-05T23:15:47.700 [INFO] Exclude: .github/**/*
2017-05-05T23:15:47.700 [INFO] Exclude: **/*.iml
2017-05-05T23:15:47.700 [INFO] Exclude: **/.idea/**/*
2017-05-05T23:15:47.700 [INFO] Exclude: **/*.egg-info/**/*
2017-05-05T23:15:47.700 [INFO] Exclude: **/package-list
2017-05-05T23:15:47.700 [INFO] Exclude: **/user.avsc
2017-05-05T23:15:47.700 [INFO] Exclude: **/test/resources/**/*.txt
2017-05-05T23:15:47.700 [INFO] Exclude: **/test/**/.placeholder
2017-05-05T23:15:47.700 [INFO] Exclude: .repository/**/*
2017-05-05T23:15:47.701 [INFO] Exclude: **/nose-*.egg/**/*
2017-05-05T23:15:47.701 [INFO] Exclude: **/.eggs/**/*
2017-05-05T23:15:47.701 [INFO] Exclude: **/.tox/**/*
2017-05-05T23:15:47.701 [INFO] Exclude: **/.checkstyle
2017-05-05T23:15:47.701 [INFO] Exclude: **/.classpath
2017-05-05T23:15:47.701 [INFO] Exclude: **/.factorypath
2017-05-05T23:15:47.701 [INFO] Exclude: **/.project
2017-05-05T23:15:47.701 [INFO] Exclude: **/.settings/**/*
2017-05-05T23:15:47.701 [INFO] Exclude: **/sdks/python/apache_beam/runners/api/*.py
2017-05-05T23:15:47.710 [INFO] 7 resources included (use -debug for more details)
2017-05-05T23:15:47.806 [INFO] Rat check: Summary over all files. Unapproved: 0, unknown:
0, generated: 0, approved: 7 licenses.
2017-05-05T23:15:47.983 [INFO] 
2017-05-05T23:15:47.983 [INFO] --- maven-install-plugin:2.5.2:install (default-install) @
beam-sdks-java-maven-archetypes-starter ---
2017-05-05T23:15:48.029 [INFO] Installing <https://builds.apache.org/job/beam_PostCommit_Java_MavenInstall/ws/sdks/java/maven-archetypes/starter/target/beam-sdks-java-maven-archetypes-starter-2.1.0-SNAPSHOT.jar>
to <https://builds.apache.org/job/beam_PostCommit_Java_MavenInstall/ws/.repository/org/apache/beam/beam-sdks-java-maven-archetypes-starter/2.1.0-SNAPSHOT/beam-sdks-java-maven-archetypes-starter-2.1.0-SNAPSHOT.jar>
2017-05-05T23:15:48.034 [INFO] Installing <https://builds.apache.org/job/beam_PostCommit_Java_MavenInstall/ws/sdks/java/maven-archetypes/starter/pom.xml>
to <https://builds.apache.org/job/beam_PostCommit_Java_MavenInstall/ws/.repository/org/apache/beam/beam-sdks-java-maven-archetypes-starter/2.1.0-SNAPSHOT/beam-sdks-java-maven-archetypes-starter-2.1.0-SNAPSHOT.pom>
2017-05-05T23:15:48.035 [INFO] Installing <https://builds.apache.org/job/beam_PostCommit_Java_MavenInstall/ws/sdks/java/maven-archetypes/starter/target/beam-sdks-java-maven-archetypes-starter-2.1.0-SNAPSHOT-sources.jar>
to <https://builds.apache.org/job/beam_PostCommit_Java_MavenInstall/ws/.repository/org/apache/beam/beam-sdks-java-maven-archetypes-starter/2.1.0-SNAPSHOT/beam-sdks-java-maven-archetypes-starter-2.1.0-SNAPSHOT-sources.jar>
2017-05-05T23:15:48.036 [INFO] Installing <https://builds.apache.org/job/beam_PostCommit_Java_MavenInstall/ws/sdks/java/maven-archetypes/starter/target/beam-sdks-java-maven-archetypes-starter-2.1.0-SNAPSHOT-test-sources.jar>
to <https://builds.apache.org/job/beam_PostCommit_Java_MavenInstall/ws/.repository/org/apache/beam/beam-sdks-java-maven-archetypes-starter/2.1.0-SNAPSHOT/beam-sdks-java-maven-archetypes-starter-2.1.0-SNAPSHOT-test-sources.jar>
2017-05-05T23:15:48.122 [INFO] 
2017-05-05T23:15:48.122 [INFO] --- maven-archetype-plugin:2.4:integration-test (default-integration-test)
@ beam-sdks-java-maven-archetypes-starter ---
2017-05-05T23:15:48.304 [INFO] Processing Archetype IT project: basic
2017-05-05T23:15:48.344 [INFO] ----------------------------------------------------------------------------
2017-05-05T23:15:48.355 [INFO] Using following parameters for creating project from Archetype:
beam-sdks-java-maven-archetypes-starter:2.1.0-SNAPSHOT
2017-05-05T23:15:48.356 [INFO] ----------------------------------------------------------------------------
2017-05-05T23:15:48.356 [INFO] Parameter: groupId, Value: archetype.it
2017-05-05T23:15:48.356 [INFO] Parameter: artifactId, Value: basic
2017-05-05T23:15:48.356 [INFO] Parameter: version, Value: 0.1
2017-05-05T23:15:48.356 [INFO] Parameter: package, Value: it.pkg
2017-05-05T23:15:48.356 [INFO] Parameter: packageInPathFormat, Value: it/pkg
2017-05-05T23:15:48.356 [INFO] Parameter: version, Value: 0.1
2017-05-05T23:15:48.357 [INFO] Parameter: package, Value: it.pkg
2017-05-05T23:15:48.357 [INFO] Parameter: groupId, Value: archetype.it
2017-05-05T23:15:48.357 [INFO] Parameter: targetPlatform, Value: 1.7
2017-05-05T23:15:48.357 [INFO] Parameter: artifactId, Value: basic
2017-05-05T23:15:48.625 [INFO] project created from Archetype in dir: <https://builds.apache.org/job/beam_PostCommit_Java_MavenInstall/ws/sdks/java/maven-archetypes/starter/target/test-classes/projects/basic/project/basic>
2017-05-05T23:15:48.633 [INFO] Comparing generated project with reference content: <https://builds.apache.org/job/beam_PostCommit_Java_MavenInstall/ws/sdks/java/maven-archetypes/starter/target/test-classes/projects/basic/reference>
2017-05-05T23:15:48.651 [WARNING] Contents of file pom.xml are not equal
[JENKINS] Recording test results
[JENKINS] Archiving disabled
2017-05-05T23:15:49.489 [INFO]                                                           
             
2017-05-05T23:15:49.489 [INFO] ------------------------------------------------------------------------
2017-05-05T23:15:49.489 [INFO] Skipping Apache Beam :: Parent
2017-05-05T23:15:49.489 [INFO] This project has been banned from the build due to previous
failures.
2017-05-05T23:15:49.489 [INFO] ------------------------------------------------------------------------
[JENKINS] Archiving disabled
[JENKINS] Archiving disabled
[JENKINS] Archiving disabled
[JENKINS] Archiving disabled
[JENKINS] Archiving disabled
[JENKINS] Archiving disabled
[JENKINS] Archiving disabled
[JENKINS] Archiving disabled
[JENKINS] Archiving disabled
[JENKINS] Archiving disabled
[JENKINS] Archiving disabled
[JENKINS] Archiving disabled
[JENKINS] Archiving disabled
[JENKINS] Archiving disabled
[JENKINS] Archiving disabled
[JENKINS] Archiving disabled
[JENKINS] Archiving disabled
[JENKINS] Archiving disabled
[JENKINS] Archiving disabled
[JENKINS] Archiving disabled
[JENKINS] Archiving disabled
[JENKINS] Archiving disabled
[JENKINS] Archiving disabled
[JENKINS] Archiving disabled
[JENKINS] Archiving disabled
[JENKINS] Archiving disabled
[JENKINS] Archiving disabled
[JENKINS] Archiving disabled
[JENKINS] Archiving disabled
[JENKINS] Archiving disabled
[JENKINS] Archiving disabled
[JENKINS] Archiving disabled
[JENKINS] Archiving disabled
[JENKINS] Archiving disabled
[JENKINS] Archiving disabled
[JENKINS] Archiving disabled
[JENKINS] Archiving disabled
[JENKINS] Archiving disabled
[JENKINS] Archiving disabled
[JENKINS] Archiving disabled
[JENKINS] Archiving disabled
[JENKINS] Archiving disabled
[JENKINS] Archiving disabled
[JENKINS] Archiving disabled
[JENKINS] Archiving disabled
[JENKINS] Archiving disabled
2017-05-05T23:16:06.666 [INFO] ------------------------------------------------------------------------
2017-05-05T23:16:06.666 [INFO] Reactor Summary:
2017-05-05T23:16:06.666 [INFO] 
2017-05-05T23:16:06.666 [INFO] Apache Beam :: Parent .............................. SUCCESS
[ 37.434 s]
2017-05-05T23:16:06.666 [INFO] Apache Beam :: SDKs :: Java :: Build Tools ......... SUCCESS
[  9.530 s]
2017-05-05T23:16:06.666 [INFO] Apache Beam :: SDKs ................................ SUCCESS
[  5.978 s]
2017-05-05T23:16:06.666 [INFO] Apache Beam :: SDKs :: Common ...................... SUCCESS
[  1.761 s]
2017-05-05T23:16:06.666 [INFO] Apache Beam :: SDKs :: Common :: Fn API ............ SUCCESS
[ 18.917 s]
2017-05-05T23:16:06.666 [INFO] Apache Beam :: SDKs :: Common :: Runner API ........ SUCCESS
[ 13.889 s]
2017-05-05T23:16:06.666 [INFO] Apache Beam :: SDKs :: Java ........................ SUCCESS
[  3.984 s]
2017-05-05T23:16:06.666 [INFO] Apache Beam :: SDKs :: Java :: Core ................ SUCCESS
[02:35 min]
2017-05-05T23:16:06.666 [INFO] Apache Beam :: SDKs :: Java :: IO .................. SUCCESS
[  2.421 s]
2017-05-05T23:16:06.666 [INFO] Apache Beam :: SDKs :: Java :: IO :: Common ........ SUCCESS
[  5.279 s]
2017-05-05T23:16:06.666 [INFO] Apache Beam :: Runners ............................. SUCCESS
[  2.236 s]
2017-05-05T23:16:06.666 [INFO] Apache Beam :: Runners :: Core Construction Java ... SUCCESS
[ 25.542 s]
2017-05-05T23:16:06.666 [INFO] Apache Beam :: Runners :: Core Java ................ SUCCESS
[ 52.309 s]
2017-05-05T23:16:06.666 [INFO] Apache Beam :: Runners :: Direct Java .............. SUCCESS
[03:04 min]
2017-05-05T23:16:06.666 [INFO] Apache Beam :: SDKs :: Java :: IO :: Elasticsearch . SUCCESS
[ 45.764 s]
2017-05-05T23:16:06.667 [INFO] Apache Beam :: SDKs :: Java :: Extensions .......... SUCCESS
[  1.871 s]
2017-05-05T23:16:06.667 [INFO] Apache Beam :: SDKs :: Java :: Extensions :: Google Cloud Platform
Core SUCCESS [ 34.299 s]
2017-05-05T23:16:06.667 [INFO] Apache Beam :: SDKs :: Java :: Extensions :: Protobuf SUCCESS
[ 22.833 s]
2017-05-05T23:16:06.667 [INFO] Apache Beam :: SDKs :: Java :: IO :: Google Cloud Platform
SUCCESS [01:49 min]
2017-05-05T23:16:06.667 [INFO] Apache Beam :: SDKs :: Java :: IO :: Hadoop Common . SUCCESS
[ 26.969 s]
2017-05-05T23:16:06.667 [INFO] Apache Beam :: SDKs :: Java :: IO :: Hadoop File System SUCCESS
[ 44.232 s]
2017-05-05T23:16:06.668 [INFO] Apache Beam :: SDKs :: Java :: IO :: Hadoop ........ SUCCESS
[  9.532 s]
2017-05-05T23:16:06.668 [INFO] Apache Beam :: SDKs :: Java :: IO :: Hadoop :: input-format
SUCCESS [ 35.197 s]
2017-05-05T23:16:06.668 [INFO] Apache Beam :: Runners :: Google Cloud Dataflow .... SUCCESS
[07:57 min]
2017-05-05T23:16:06.668 [INFO] Apache Beam :: SDKs :: Java :: IO :: Hadoop :: jdk1.8-tests
SUCCESS [01:51 min]
2017-05-05T23:16:06.668 [INFO] Apache Beam :: SDKs :: Java :: IO :: HBase ......... SUCCESS
[01:38 min]
2017-05-05T23:16:06.668 [INFO] Apache Beam :: SDKs :: Java :: IO :: JDBC .......... SUCCESS
[ 40.107 s]
2017-05-05T23:16:06.668 [INFO] Apache Beam :: SDKs :: Java :: IO :: JMS ........... SUCCESS
[ 26.013 s]
2017-05-05T23:16:06.668 [INFO] Apache Beam :: SDKs :: Java :: IO :: Kafka ......... SUCCESS
[ 41.171 s]
2017-05-05T23:16:06.668 [INFO] Apache Beam :: SDKs :: Java :: IO :: Kinesis ....... SUCCESS
[ 37.014 s]
2017-05-05T23:16:06.668 [INFO] Apache Beam :: SDKs :: Java :: IO :: MongoDB ....... SUCCESS
[ 47.391 s]
2017-05-05T23:16:06.668 [INFO] Apache Beam :: SDKs :: Java :: IO :: MQTT .......... SUCCESS
[ 27.474 s]
2017-05-05T23:16:06.668 [INFO] Apache Beam :: SDKs :: Java :: IO :: XML ........... SUCCESS
[ 45.774 s]
2017-05-05T23:16:06.668 [INFO] Apache Beam :: SDKs :: Java :: Maven Archetypes .... SUCCESS
[  2.866 s]
2017-05-05T23:16:06.668 [INFO] Apache Beam :: SDKs :: Java :: Maven Archetypes :: Starter
FAILURE [ 24.765 s]
2017-05-05T23:16:06.668 [INFO] Apache Beam :: Examples ............................ SKIPPED
2017-05-05T23:16:06.668 [INFO] Apache Beam :: Examples :: Java .................... SKIPPED
2017-05-05T23:16:06.668 [INFO] Apache Beam :: SDKs :: Java :: Maven Archetypes :: Examples
SKIPPED
2017-05-05T23:16:06.668 [INFO] Apache Beam :: Runners :: Flink .................... SKIPPED
2017-05-05T23:16:06.668 [INFO] Apache Beam :: Runners :: Spark .................... SKIPPED
2017-05-05T23:16:06.668 [INFO] Apache Beam :: Examples :: Java 8 .................. SKIPPED
2017-05-05T23:16:06.668 [INFO] Apache Beam :: SDKs :: Java :: Maven Archetypes :: Examples
- Java 8 SKIPPED
2017-05-05T23:16:06.668 [INFO] Apache Beam :: SDKs :: Java :: Extensions :: Jackson SKIPPED
2017-05-05T23:16:06.668 [INFO] Apache Beam :: SDKs :: Java :: Extensions :: Join library SKIPPED
2017-05-05T23:16:06.668 [INFO] Apache Beam :: SDKs :: Java :: Extensions :: Sorter  SKIPPED
2017-05-05T23:16:06.668 [INFO] Apache Beam :: SDKs :: Java :: Harness ............. SKIPPED
2017-05-05T23:16:06.668 [INFO] Apache Beam :: SDKs :: Java :: Java 8 Tests ........ SKIPPED
2017-05-05T23:16:06.668 [INFO] Apache Beam :: SDKs :: Python ...................... SKIPPED
2017-05-05T23:16:06.668 [INFO] Apache Beam :: Runners :: Apex ..................... SKIPPED
2017-05-05T23:16:06.668 [INFO] Apache Beam :: SDKs :: Java :: Aggregated Javadoc .. SKIPPED
2017-05-05T23:16:06.668 [INFO] ------------------------------------------------------------------------
2017-05-05T23:16:06.668 [INFO] BUILD FAILURE
2017-05-05T23:16:06.668 [INFO] ------------------------------------------------------------------------
2017-05-05T23:16:06.668 [INFO] Total time: 31:53 min
2017-05-05T23:16:06.669 [INFO] Finished at: 2017-05-05T23:16:06+00:00
2017-05-05T23:16:07.669 [INFO] Final Memory: 268M/2050M
2017-05-05T23:16:07.669 [INFO] ------------------------------------------------------------------------
Waiting for Jenkins to finish collecting data
2017-05-05T23:16:31.022 [ERROR] Failed to execute goal org.apache.maven.plugins:maven-archetype-plugin:2.4:integration-test
(default-integration-test) on project beam-sdks-java-maven-archetypes-starter:
2017-05-05T23:16:31.022 [ERROR] Archetype IT 'basic' failed: Some content are not equals
2017-05-05T23:16:31.022 [ERROR] -> [Help 1]
org.apache.maven.lifecycle.LifecycleExecutionException: Failed to execute goal org.apache.maven.plugins:maven-archetype-plugin:2.4:integration-test
(default-integration-test) on project beam-sdks-java-maven-archetypes-starter: 
Archetype IT 'basic' failed: Some content are not equals
	at org.apache.maven.lifecycle.internal.MojoExecutor.execute(MojoExecutor.java:216)
	at org.apache.maven.lifecycle.internal.MojoExecutor.execute(MojoExecutor.java:153)
	at org.apache.maven.lifecycle.internal.MojoExecutor.execute(MojoExecutor.java:145)
	at org.apache.maven.lifecycle.internal.LifecycleModuleBuilder.buildProject(LifecycleModuleBuilder.java:116)
	at org.apache.maven.lifecycle.internal.LifecycleModuleBuilder.buildProject(LifecycleModuleBuilder.java:80)
	at org.apache.maven.lifecycle.internal.builder.singlethreaded.SingleThreadedBuilder.build(SingleThreadedBuilder.java:51)
	at org.apache.maven.lifecycle.internal.LifecycleStarter.execute(LifecycleStarter.java:128)
	at org.apache.maven.DefaultMaven.doExecute(DefaultMaven.java:307)
	at org.apache.maven.DefaultMaven.doExecute(DefaultMaven.java:193)
	at org.apache.maven.DefaultMaven.execute(DefaultMaven.java:106)
	at org.jvnet.hudson.maven3.launcher.Maven33Launcher.main(Maven33Launcher.java:129)
	at sun.reflect.NativeMethodAccessorImpl.invoke0(Native Method)
	at sun.reflect.NativeMethodAccessorImpl.invoke(NativeMethodAccessorImpl.java:62)
	at sun.reflect.DelegatingMethodAccessorImpl.invoke(DelegatingMethodAccessorImpl.java:43)
	at java.lang.reflect.Method.invoke(Method.java:498)
	at org.codehaus.plexus.classworlds.launcher.Launcher.launchStandard(Launcher.java:330)
	at org.codehaus.plexus.classworlds.launcher.Launcher.launch(Launcher.java:238)
	at jenkins.maven3.agent.Maven33Main.launch(Maven33Main.java:176)
	at sun.reflect.NativeMethodAccessorImpl.invoke0(Native Method)
	at sun.reflect.NativeMethodAccessorImpl.invoke(NativeMethodAccessorImpl.java:62)
	at sun.reflect.DelegatingMethodAccessorImpl.invoke(DelegatingMethodAccessorImpl.java:43)
	at java.lang.reflect.Method.invoke(Method.java:498)
	at hudson.maven.Maven3Builder.call(Maven3Builder.java:139)
	at hudson.maven.Maven3Builder.call(Maven3Builder.java:70)
	at hudson.remoting.UserRequest.perform(UserRequest.java:153)
	at hudson.remoting.UserRequest.perform(UserRequest.java:50)
	at hudson.remoting.Request$2.run(Request.java:336)
	at hudson.remoting.InterceptingExecutorService$1.call(InterceptingExecutorService.java:68)
	at java.util.concurrent.FutureTask.run(FutureTask.java:266)
	at java.util.concurrent.ThreadPoolExecutor.runWorker(ThreadPoolExecutor.java:1142)
	at java.util.concurrent.ThreadPoolExecutor$Worker.run(ThreadPoolExecutor.java:617)
	at java.lang.Thread.run(Thread.java:745)
Caused by: org.apache.maven.plugin.MojoExecutionException: 
Archetype IT 'basic' failed: Some content are not equals
	at org.apache.maven.archetype.mojos.IntegrationTestMojo.execute(IntegrationTestMojo.java:269)
	at org.apache.maven.plugin.DefaultBuildPluginManager.executeMojo(DefaultBuildPluginManager.java:134)
	at org.apache.maven.lifecycle.internal.MojoExecutor.execute(MojoExecutor.java:208)
	... 31 more
2017-05-05T23:16:31.023 [ERROR] 
2017-05-05T23:16:31.023 [ERROR] Re-run Maven using the -X switch to enable full debug logging.
2017-05-05T23:16:31.023 [ERROR] 
2017-05-05T23:16:31.023 [ERROR] For more information about the errors and possible solutions,
please read the following articles:
2017-05-05T23:16:31.023 [ERROR] [Help 1] http://cwiki.apache.org/confluence/display/MAVEN/MojoExecutionException
2017-05-05T23:16:31.023 [ERROR] 
2017-05-05T23:16:31.023 [ERROR] After correcting the problems, you can resume the build with
the command
2017-05-05T23:16:31.023 [ERROR]   mvn <goals> -rf :beam-sdks-java-maven-archetypes-starter
channel stopped

Mime
View raw message