beam-commits mailing list archives

Site index · List index
Message view « Date » · « Thread »
Top « Date » · « Thread »
From Apache Jenkins Server <jenk...@builds.apache.org>
Subject Build failed in Jenkins: beam_PostCommit_Java_JDK_Versions_Test » JDK 1.8 (latest),beam #5
Date Wed, 03 May 2017 00:26:27 GMT
See <https://builds.apache.org/job/beam_PostCommit_Java_JDK_Versions_Test/jdk=JDK%201.8%20(latest),label=beam/5/display/redirect>

------------------------------------------
[...truncated 1.21 MB...]
2017-05-03\T\00:26:23.061 [INFO] 2017-05-03\T\00:26:23.061 [INFO] Downloading: https://repo.maven.apache.org/maven2/org/apache/maven/maven-profile/2.0.9/maven-profile-2.0.9.pom
2017-05-03\T\00:26:23.087 [INFO] 2017-05-03\T\00:26:23.087 [INFO] Downloaded: https://repo.maven.apache.org/maven2/org/apache/maven/maven-profile/2.0.9/maven-profile-2.0.9.pom
(3 KB at 77.0 KB/sec)
2017-05-03\T\00:26:23.107 [INFO] 2017-05-03\T\00:26:23.107 [INFO] Downloading: https://repo.maven.apache.org/maven2/org/apache/maven/maven-artifact-manager/2.0.9/maven-artifact-manager-2.0.9.pom
2017-05-03\T\00:26:23.149 [INFO] 2017-05-03\T\00:26:23.149 [INFO] Downloaded: https://repo.maven.apache.org/maven2/org/apache/maven/maven-artifact-manager/2.0.9/maven-artifact-manager-2.0.9.pom
(3 KB at 62.8 KB/sec)
2017-05-03\T\00:26:23.153 [INFO] 2017-05-03\T\00:26:23.153 [INFO] Downloading: https://repo.maven.apache.org/maven2/org/apache/maven/maven-repository-metadata/2.0.9/maven-repository-metadata-2.0.9.pom
2017-05-03\T\00:26:23.180 [INFO] 2017-05-03\T\00:26:23.179 [INFO] Downloaded: https://repo.maven.apache.org/maven2/org/apache/maven/maven-repository-metadata/2.0.9/maven-repository-metadata-2.0.9.pom
(2 KB at 68.8 KB/sec)
2017-05-03\T\00:26:23.184 [INFO] 2017-05-03\T\00:26:23.184 [INFO] Downloading: https://repo.maven.apache.org/maven2/org/apache/maven/maven-plugin-registry/2.0.9/maven-plugin-registry-2.0.9.pom
2017-05-03\T\00:26:23.211 [INFO] 2017-05-03\T\00:26:23.211 [INFO] Downloaded: https://repo.maven.apache.org/maven2/org/apache/maven/maven-plugin-registry/2.0.9/maven-plugin-registry-2.0.9.pom
(2 KB at 71.3 KB/sec)
2017-05-03\T\00:26:23.255 [INFO] 2017-05-03\T\00:26:23.255 [INFO] Downloading: https://repo.maven.apache.org/maven2/org/apache/maven/maven-core/2.0.9/maven-core-2.0.9.pom
2017-05-03\T\00:26:23.284 [INFO] 2017-05-03\T\00:26:23.283 [INFO] Downloaded: https://repo.maven.apache.org/maven2/org/apache/maven/maven-core/2.0.9/maven-core-2.0.9.pom
(8 KB at 262.2 KB/sec)
2017-05-03\T\00:26:23.289 [INFO] 2017-05-03\T\00:26:23.289 [INFO] Downloading: https://repo.maven.apache.org/maven2/org/apache/maven/maven-plugin-parameter-documenter/2.0.9/maven-plugin-parameter-documenter-2.0.9.pom
2017-05-03\T\00:26:23.316 [INFO] 2017-05-03\T\00:26:23.316 [INFO] Downloaded: https://repo.maven.apache.org/maven2/org/apache/maven/maven-plugin-parameter-documenter/2.0.9/maven-plugin-parameter-documenter-2.0.9.pom
(2 KB at 71.0 KB/sec)
2017-05-03\T\00:26:23.322 [INFO] 2017-05-03\T\00:26:23.322 [INFO] Downloading: https://repo.maven.apache.org/maven2/org/apache/maven/reporting/maven-reporting-api/2.0.9/maven-reporting-api-2.0.9.pom
2017-05-03\T\00:26:23.350 [INFO] 2017-05-03\T\00:26:23.349 [INFO] Downloaded: https://repo.maven.apache.org/maven2/org/apache/maven/reporting/maven-reporting-api/2.0.9/maven-reporting-api-2.0.9.pom
(2 KB at 65.2 KB/sec)
2017-05-03\T\00:26:23.353 [INFO] 2017-05-03\T\00:26:23.353 [INFO] Downloading: https://repo.maven.apache.org/maven2/org/apache/maven/reporting/maven-reporting/2.0.9/maven-reporting-2.0.9.pom
2017-05-03\T\00:26:23.380 [INFO] 2017-05-03\T\00:26:23.380 [INFO] Downloaded: https://repo.maven.apache.org/maven2/org/apache/maven/reporting/maven-reporting/2.0.9/maven-reporting-2.0.9.pom
(2 KB at 53.4 KB/sec)
2017-05-03\T\00:26:23.385 [INFO] 2017-05-03\T\00:26:23.385 [INFO] Downloading: https://repo.maven.apache.org/maven2/org/apache/maven/maven-error-diagnostics/2.0.9/maven-error-diagnostics-2.0.9.pom
2017-05-03\T\00:26:23.411 [INFO] 2017-05-03\T\00:26:23.411 [INFO] Downloaded: https://repo.maven.apache.org/maven2/org/apache/maven/maven-error-diagnostics/2.0.9/maven-error-diagnostics-2.0.9.pom
(2 KB at 65.5 KB/sec)
2017-05-03\T\00:26:23.420 [INFO] 2017-05-03\T\00:26:23.419 [INFO] Downloading: https://repo.maven.apache.org/maven2/org/apache/maven/maven-plugin-descriptor/2.0.9/maven-plugin-descriptor-2.0.9.pom
2017-05-03\T\00:26:23.448 [INFO] 2017-05-03\T\00:26:23.448 [INFO] Downloaded: https://repo.maven.apache.org/maven2/org/apache/maven/maven-plugin-descriptor/2.0.9/maven-plugin-descriptor-2.0.9.pom
(3 KB at 69.9 KB/sec)
2017-05-03\T\00:26:23.453 [INFO] 2017-05-03\T\00:26:23.452 [INFO] Downloading: https://repo.maven.apache.org/maven2/org/apache/maven/maven-monitor/2.0.9/maven-monitor-2.0.9.pom
2017-05-03\T\00:26:23.480 [INFO] 2017-05-03\T\00:26:23.480 [INFO] Downloaded: https://repo.maven.apache.org/maven2/org/apache/maven/maven-monitor/2.0.9/maven-monitor-2.0.9.pom
(2 KB at 44.8 KB/sec)
2017-05-03\T\00:26:23.484 [INFO] 2017-05-03\T\00:26:23.483 [INFO] Downloading: https://repo.maven.apache.org/maven2/org/apache/maven/maven-toolchain/2.0.9/maven-toolchain-2.0.9.pom
2017-05-03\T\00:26:23.511 [INFO] 2017-05-03\T\00:26:23.511 [INFO] Downloaded: https://repo.maven.apache.org/maven2/org/apache/maven/maven-toolchain/2.0.9/maven-toolchain-2.0.9.pom
(4 KB at 121.2 KB/sec)
2017-05-03\T\00:26:23.520 [INFO] 2017-05-03\T\00:26:23.520 [INFO] Downloading: https://repo.maven.apache.org/maven2/org/apache/maven/shared/maven-common-artifact-filters/1.3/maven-common-artifact-filters-1.3.pom
2017-05-03\T\00:26:23.552 [INFO] 2017-05-03\T\00:26:23.551 [INFO] Downloaded: https://repo.maven.apache.org/maven2/org/apache/maven/shared/maven-common-artifact-filters/1.3/maven-common-artifact-filters-1.3.pom
(4 KB at 116.6 KB/sec)
2017-05-03\T\00:26:23.568 [INFO] 2017-05-03\T\00:26:23.567 [INFO] Downloading: https://repo.maven.apache.org/maven2/org/apache/maven/maven-plugin-api/2.0.9/maven-plugin-api-2.0.9.jar
2017-05-03\T\00:26:23.568 [INFO] 2017-05-03\T\00:26:23.568 [INFO] Downloading: https://repo.maven.apache.org/maven2/org/apache/maven/surefire/surefire-booter/2.12.4/surefire-booter-2.12.4.jar
2017-05-03\T\00:26:23.570 [INFO] 2017-05-03\T\00:26:23.570 [INFO] Downloading: https://repo.maven.apache.org/maven2/org/apache/maven/surefire/surefire-api/2.12.4/surefire-api-2.12.4.jar
2017-05-03\T\00:26:23.571 [INFO] 2017-05-03\T\00:26:23.571 [INFO] Downloading: https://repo.maven.apache.org/maven2/org/apache/maven/surefire/maven-surefire-common/2.12.4/maven-surefire-common-2.12.4.jar
2017-05-03\T\00:26:23.573 [INFO] 2017-05-03\T\00:26:23.573 [INFO] Downloading: https://repo.maven.apache.org/maven2/org/apache/maven/shared/maven-common-artifact-filters/1.3/maven-common-artifact-filters-1.3.jar
2017-05-03\T\00:26:23.599 [INFO] 2017-05-03\T\00:26:23.599 [INFO] Downloaded: https://repo.maven.apache.org/maven2/org/apache/maven/maven-plugin-api/2.0.9/maven-plugin-api-2.0.9.jar
(13 KB at 406.1 KB/sec)
2017-05-03\T\00:26:23.599 [INFO] 2017-05-03\T\00:26:23.599 [INFO] Downloading: https://repo.maven.apache.org/maven2/org/codehaus/plexus/plexus-utils/3.0.8/plexus-utils-3.0.8.jar
2017-05-03\T\00:26:23.606 [INFO] 2017-05-03\T\00:26:23.606 [INFO] Downloaded: https://repo.maven.apache.org/maven2/org/apache/maven/shared/maven-common-artifact-filters/1.3/maven-common-artifact-filters-1.3.jar
(31 KB at 842.5 KB/sec)
2017-05-03\T\00:26:23.606 [INFO] 2017-05-03\T\00:26:23.606 [INFO] Downloading: https://repo.maven.apache.org/maven2/org/apache/maven/maven-artifact/2.0.9/maven-artifact-2.0.9.jar
2017-05-03\T\00:26:23.609 [INFO] 2017-05-03\T\00:26:23.609 [INFO] Downloaded: https://repo.maven.apache.org/maven2/org/apache/maven/surefire/surefire-booter/2.12.4/surefire-booter-2.12.4.jar
(34 KB at 806.4 KB/sec)
2017-05-03\T\00:26:23.609 [INFO] 2017-05-03\T\00:26:23.609 [INFO] Downloading: https://repo.maven.apache.org/maven2/org/apache/maven/maven-project/2.0.9/maven-project-2.0.9.jar
2017-05-03\T\00:26:23.622 [INFO] 2017-05-03\T\00:26:23.622 [INFO] Downloaded: https://repo.maven.apache.org/maven2/org/apache/maven/surefire/surefire-api/2.12.4/surefire-api-2.12.4.jar
(115 KB at 2166.5 KB/sec)
2017-05-03\T\00:26:23.622 [INFO] 2017-05-03\T\00:26:23.622 [INFO] Downloading: https://repo.maven.apache.org/maven2/org/apache/maven/maven-settings/2.0.9/maven-settings-2.0.9.jar
2017-05-03\T\00:26:23.652 [INFO] 2017-05-03\T\00:26:23.651 [INFO] Downloaded: https://repo.maven.apache.org/maven2/org/apache/maven/maven-artifact/2.0.9/maven-artifact-2.0.9.jar
(87 KB at 1085.3 KB/sec)
2017-05-03\T\00:26:23.652 [INFO] 2017-05-03\T\00:26:23.652 [INFO] Downloading: https://repo.maven.apache.org/maven2/org/apache/maven/maven-profile/2.0.9/maven-profile-2.0.9.jar
2017-05-03\T\00:26:23.654 [INFO] 2017-05-03\T\00:26:23.654 [INFO] Downloaded: https://repo.maven.apache.org/maven2/org/apache/maven/surefire/maven-surefire-common/2.12.4/maven-surefire-common-2.12.4.jar
(257 KB at 3053.2 KB/sec)
2017-05-03\T\00:26:23.654 [INFO] 2017-05-03\T\00:26:23.654 [INFO] Downloading: https://repo.maven.apache.org/maven2/org/apache/maven/maven-artifact-manager/2.0.9/maven-artifact-manager-2.0.9.jar
2017-05-03\T\00:26:23.662 [INFO] 2017-05-03\T\00:26:23.661 [INFO] Downloaded: https://repo.maven.apache.org/maven2/org/apache/maven/maven-project/2.0.9/maven-project-2.0.9.jar
(119 KB at 1321.4 KB/sec)
2017-05-03\T\00:26:23.662 [INFO] 2017-05-03\T\00:26:23.661 [INFO] Downloading: https://repo.maven.apache.org/maven2/org/apache/maven/maven-plugin-registry/2.0.9/maven-plugin-registry-2.0.9.jar
2017-05-03\T\00:26:23.663 [INFO] 2017-05-03\T\00:26:23.663 [INFO] Downloaded: https://repo.maven.apache.org/maven2/org/apache/maven/maven-settings/2.0.9/maven-settings-2.0.9.jar
(48 KB at 521.3 KB/sec)
2017-05-03\T\00:26:23.663 [INFO] 2017-05-03\T\00:26:23.663 [INFO] Downloading: https://repo.maven.apache.org/maven2/org/apache/maven/maven-core/2.0.9/maven-core-2.0.9.jar
2017-05-03\T\00:26:23.674 [INFO] 2017-05-03\T\00:26:23.674 [INFO] Downloaded: https://repo.maven.apache.org/maven2/org/codehaus/plexus/plexus-utils/3.0.8/plexus-utils-3.0.8.jar
(227 KB at 2197.9 KB/sec)
2017-05-03\T\00:26:23.674 [INFO] 2017-05-03\T\00:26:23.674 [INFO] Downloading: https://repo.maven.apache.org/maven2/org/apache/maven/maven-plugin-parameter-documenter/2.0.9/maven-plugin-parameter-documenter-2.0.9.jar
2017-05-03\T\00:26:23.683 [INFO] 2017-05-03\T\00:26:23.683 [INFO] Downloaded: https://repo.maven.apache.org/maven2/org/apache/maven/maven-profile/2.0.9/maven-profile-2.0.9.jar
(35 KB at 308.3 KB/sec)
2017-05-03\T\00:26:23.683 [INFO] 2017-05-03\T\00:26:23.683 [INFO] Downloading: https://repo.maven.apache.org/maven2/org/apache/maven/reporting/maven-reporting-api/2.0.9/maven-reporting-api-2.0.9.jar
2017-05-03\T\00:26:23.691 [INFO] 2017-05-03\T\00:26:23.691 [INFO] Downloaded: https://repo.maven.apache.org/maven2/org/apache/maven/maven-artifact-manager/2.0.9/maven-artifact-manager-2.0.9.jar
(57 KB at 470.7 KB/sec)
2017-05-03\T\00:26:23.691 [INFO] 2017-05-03\T\00:26:23.691 [INFO] Downloading: https://repo.maven.apache.org/maven2/org/apache/maven/maven-repository-metadata/2.0.9/maven-repository-metadata-2.0.9.jar
2017-05-03\T\00:26:23.694 [INFO] 2017-05-03\T\00:26:23.694 [INFO] Downloaded: https://repo.maven.apache.org/maven2/org/apache/maven/maven-plugin-registry/2.0.9/maven-plugin-registry-2.0.9.jar
(29 KB at 230.8 KB/sec)
2017-05-03\T\00:26:23.694 [INFO] 2017-05-03\T\00:26:23.694 [INFO] Downloading: https://repo.maven.apache.org/maven2/org/apache/maven/maven-error-diagnostics/2.0.9/maven-error-diagnostics-2.0.9.jar
2017-05-03\T\00:26:23.704 [INFO] 2017-05-03\T\00:26:23.704 [INFO] Downloaded: https://repo.maven.apache.org/maven2/org/apache/maven/maven-plugin-parameter-documenter/2.0.9/maven-plugin-parameter-documenter-2.0.9.jar
(21 KB at 153.3 KB/sec)
2017-05-03\T\00:26:23.704 [INFO] 2017-05-03\T\00:26:23.704 [INFO] Downloading: https://repo.maven.apache.org/maven2/org/apache/maven/maven-plugin-descriptor/2.0.9/maven-plugin-descriptor-2.0.9.jar
2017-05-03\T\00:26:23.710 [INFO] 2017-05-03\T\00:26:23.710 [INFO] Downloaded: https://repo.maven.apache.org/maven2/org/apache/maven/reporting/maven-reporting-api/2.0.9/maven-reporting-api-2.0.9.jar
(10 KB at 71.2 KB/sec)
2017-05-03\T\00:26:23.710 [INFO] 2017-05-03\T\00:26:23.710 [INFO] Downloading: https://repo.maven.apache.org/maven2/org/apache/maven/maven-monitor/2.0.9/maven-monitor-2.0.9.jar
2017-05-03\T\00:26:23.720 [INFO] 2017-05-03\T\00:26:23.720 [INFO] Downloaded: https://repo.maven.apache.org/maven2/org/apache/maven/maven-repository-metadata/2.0.9/maven-repository-metadata-2.0.9.jar
(24 KB at 161.0 KB/sec)
2017-05-03\T\00:26:23.720 [INFO] 2017-05-03\T\00:26:23.720 [INFO] Downloading: https://repo.maven.apache.org/maven2/org/apache/maven/maven-toolchain/2.0.9/maven-toolchain-2.0.9.jar
2017-05-03\T\00:26:23.728 [INFO] 2017-05-03\T\00:26:23.727 [INFO] Downloaded: https://repo.maven.apache.org/maven2/org/apache/maven/maven-error-diagnostics/2.0.9/maven-error-diagnostics-2.0.9.jar
(14 KB at 86.3 KB/sec)
2017-05-03\T\00:26:23.728 [INFO] 2017-05-03\T\00:26:23.727 [INFO] Downloaded: https://repo.maven.apache.org/maven2/org/apache/maven/maven-core/2.0.9/maven-core-2.0.9.jar
(156 KB at 999.3 KB/sec)
2017-05-03\T\00:26:23.728 [INFO] 2017-05-03\T\00:26:23.728 [INFO] Downloading: https://repo.maven.apache.org/maven2/org/apache/maven/plugin-tools/maven-plugin-annotations/3.1/maven-plugin-annotations-3.1.jar
2017-05-03\T\00:26:23.736 [INFO] 2017-05-03\T\00:26:23.736 [INFO] Downloaded: https://repo.maven.apache.org/maven2/org/apache/maven/maven-plugin-descriptor/2.0.9/maven-plugin-descriptor-2.0.9.jar
(37 KB at 219.2 KB/sec)
2017-05-03\T\00:26:23.739 [INFO] 2017-05-03\T\00:26:23.739 [INFO] Downloaded: https://repo.maven.apache.org/maven2/org/apache/maven/maven-monitor/2.0.9/maven-monitor-2.0.9.jar
(11 KB at 59.8 KB/sec)
2017-05-03\T\00:26:23.754 [INFO] 2017-05-03\T\00:26:23.754 [INFO] Downloaded: https://repo.maven.apache.org/maven2/org/apache/maven/maven-toolchain/2.0.9/maven-toolchain-2.0.9.jar
(38 KB at 202.6 KB/sec)
2017-05-03\T\00:26:23.764 [INFO] 2017-05-03\T\00:26:23.764 [INFO] Downloaded: https://repo.maven.apache.org/maven2/org/apache/maven/plugin-tools/maven-plugin-annotations/3.1/maven-plugin-annotations-3.1.jar
(14 KB at 71.0 KB/sec)
2017-05-03\T\00:26:23.824 [INFO] 2017-05-03\T\00:26:23.823 [INFO] No tests to run.
2017-05-03\T\00:26:23.828 [INFO] 2017-05-03\T\00:26:23.828 [INFO] 
2017-05-03\T\00:26:23.829 [INFO] 2017-05-03\T\00:26:23.828 [INFO] --- maven-jar-plugin:2.4:jar
(default-jar) @ basic ---
2017-05-03\T\00:26:23.882 [INFO] 2017-05-03\T\00:26:23.882 [INFO] Downloading: https://repo.maven.apache.org/maven2/org/codehaus/plexus/plexus-interpolation/1.15/plexus-interpolation-1.15.jar
2017-05-03\T\00:26:23.882 [INFO] 2017-05-03\T\00:26:23.882 [INFO] Downloading: https://repo.maven.apache.org/maven2/org/codehaus/plexus/plexus-archiver/2.1/plexus-archiver-2.1.jar
2017-05-03\T\00:26:23.882 [INFO] 2017-05-03\T\00:26:23.882 [INFO] Downloading: https://repo.maven.apache.org/maven2/org/codehaus/plexus/plexus-io/2.0.2/plexus-io-2.0.2.jar
2017-05-03\T\00:26:23.883 [INFO] 2017-05-03\T\00:26:23.883 [INFO] Downloading: https://repo.maven.apache.org/maven2/org/codehaus/plexus/plexus-utils/3.0/plexus-utils-3.0.jar
2017-05-03\T\00:26:23.923 [INFO] 2017-05-03\T\00:26:23.922 [INFO] Downloaded: https://repo.maven.apache.org/maven2/org/codehaus/plexus/plexus-io/2.0.2/plexus-io-2.0.2.jar
(57 KB at 1422.5 KB/sec)
2017-05-03\T\00:26:23.923 [INFO] 2017-05-03\T\00:26:23.922 [INFO] Downloaded: https://repo.maven.apache.org/maven2/org/codehaus/plexus/plexus-interpolation/1.15/plexus-interpolation-1.15.jar
(60 KB at 1440.4 KB/sec)
2017-05-03\T\00:26:23.944 [INFO] 2017-05-03\T\00:26:23.944 [INFO] Downloaded: https://repo.maven.apache.org/maven2/org/codehaus/plexus/plexus-archiver/2.1/plexus-archiver-2.1.jar
(181 KB at 2859.0 KB/sec)
2017-05-03\T\00:26:23.952 [INFO] 2017-05-03\T\00:26:23.952 [INFO] Downloaded: https://repo.maven.apache.org/maven2/org/codehaus/plexus/plexus-utils/3.0/plexus-utils-3.0.jar
(221 KB at 3153.9 KB/sec)
2017-05-03\T\00:26:24.068 [INFO] 2017-05-03\T\00:26:24.067 [INFO] Building jar: <https://builds.apache.org/job/beam_PostCommit_Java_JDK_Versions_Test/jdk=JDK%201.8%20(latest),label=beam/ws/sdks/java/maven-archetypes/starter/target/test-classes/projects/basic/project/basic/target/basic-0.1.jar>
2017-05-03\T\00:26:24.080 [INFO] 2017-05-03\T\00:26:24.080 [INFO] ------------------------------------------------------------------------
2017-05-03\T\00:26:24.080 [INFO] 2017-05-03\T\00:26:24.080 [INFO] BUILD SUCCESS
2017-05-03\T\00:26:24.080 [INFO] 2017-05-03\T\00:26:24.080 [INFO] ------------------------------------------------------------------------
2017-05-03\T\00:26:24.080 [INFO] 2017-05-03\T\00:26:24.080 [INFO] Total time: 5.636 s
2017-05-03\T\00:26:24.080 [INFO] 2017-05-03\T\00:26:24.080 [INFO] Finished at: 2017-05-03T00:26:24+00:00
2017-05-03\T\00:26:24.183 [INFO] 2017-05-03\T\00:26:24.183 [INFO] Final Memory: 25M/317M
2017-05-03\T\00:26:24.183 [INFO] 2017-05-03\T\00:26:24.183 [INFO] ------------------------------------------------------------------------
2017-05-03\T\00:26:24.207 [INFO] Post-archetype-generation invoker exit code: 0
2017-05-03\T\00:26:24.210 [INFO] 
2017-05-03\T\00:26:24.210 [INFO] --- maven-archetype-plugin:2.4:update-local-catalog (default-update-local-catalog)
@ beam-sdks-java-maven-archetypes-starter ---
2017-05-03\T\00:26:24.234 [INFO]                                                         
               
2017-05-03\T\00:26:24.234 [INFO] ------------------------------------------------------------------------
2017-05-03\T\00:26:24.234 [INFO] Building Apache Beam :: SDKs :: Java :: Maven Archetypes
:: Examples 0.7.0-SNAPSHOT
2017-05-03\T\00:26:24.234 [INFO] ------------------------------------------------------------------------
2017-05-03\T\00:26:24.250 [INFO] Downloading: https://repo.maven.apache.org/maven2/org/codehaus/mojo/exec-maven-plugin/1.5.0/exec-maven-plugin-1.5.0.pom
2017-05-03\T\00:26:24.278 [INFO] Downloaded: https://repo.maven.apache.org/maven2/org/codehaus/mojo/exec-maven-plugin/1.5.0/exec-maven-plugin-1.5.0.pom
(13 KB at 415.0 KB/sec)
2017-05-03\T\00:26:24.280 [INFO] Downloading: https://repo.maven.apache.org/maven2/org/codehaus/mojo/mojo-parent/38/mojo-parent-38.pom
2017-05-03\T\00:26:24.314 [INFO] Downloaded: https://repo.maven.apache.org/maven2/org/codehaus/mojo/mojo-parent/38/mojo-parent-38.pom
(33 KB at 950.1 KB/sec)
2017-05-03\T\00:26:24.318 [INFO] Downloading: https://repo.maven.apache.org/maven2/org/codehaus/mojo/exec-maven-plugin/1.5.0/exec-maven-plugin-1.5.0.jar
2017-05-03\T\00:26:24.351 [INFO] Downloaded: https://repo.maven.apache.org/maven2/org/codehaus/mojo/exec-maven-plugin/1.5.0/exec-maven-plugin-1.5.0.jar
(53 KB at 1577.4 KB/sec)
2017-05-03\T\00:26:24.369 [INFO] 
2017-05-03\T\00:26:24.369 [INFO] --- maven-clean-plugin:3.0.0:clean (default-clean) @ beam-sdks-java-maven-archetypes-examples
---
2017-05-03\T\00:26:24.371 [INFO] Deleting <https://builds.apache.org/job/beam_PostCommit_Java_JDK_Versions_Test/jdk=JDK%201.8%20(latest),label=beam/ws/sdks/java/maven-archetypes/examples>
(includes = [**/*.pyc, **/*.egg-info/, **/sdks/python/LICENSE, **/sdks/python/NOTICE], excludes
= [])
2017-05-03\T\00:26:24.371 [INFO] 
2017-05-03\T\00:26:24.371 [INFO] --- maven-enforcer-plugin:1.4.1:enforce (enforce) @ beam-sdks-java-maven-archetypes-examples
---
2017-05-03\T\00:26:25.146 [INFO] 
2017-05-03\T\00:26:25.147 [INFO] --- exec-maven-plugin:1.5.0:exec (generate-archetype-contents)
@ beam-sdks-java-maven-archetypes-examples ---
2017-05-03\T\00:26:25.150 [INFO] Downloading: https://repo.maven.apache.org/maven2/org/apache/maven/maven-toolchain/1.0/maven-toolchain-1.0.pom
2017-05-03\T\00:26:25.179 [INFO] Downloaded: https://repo.maven.apache.org/maven2/org/apache/maven/maven-toolchain/1.0/maven-toolchain-1.0.pom
(4 KB at 119.1 KB/sec)
2017-05-03\T\00:26:25.184 [INFO] Downloading: https://repo.maven.apache.org/maven2/org/apache/commons/commons-exec/1.3/commons-exec-1.3.pom
2017-05-03\T\00:26:25.211 [INFO] Downloaded: https://repo.maven.apache.org/maven2/org/apache/commons/commons-exec/1.3/commons-exec-1.3.pom
(11 KB at 397.6 KB/sec)
2017-05-03\T\00:26:25.220 [INFO] Downloading: https://repo.maven.apache.org/maven2/org/apache/maven/maven-toolchain/1.0/maven-toolchain-1.0.jar
2017-05-03\T\00:26:25.224 [INFO] Downloading: https://repo.maven.apache.org/maven2/org/apache/commons/commons-exec/1.3/commons-exec-1.3.jar
2017-05-03\T\00:26:25.254 [INFO] Downloaded: https://repo.maven.apache.org/maven2/org/apache/maven/maven-toolchain/1.0/maven-toolchain-1.0.jar
(33 KB at 945.3 KB/sec)
2017-05-03\T\00:26:25.257 [INFO] Downloaded: https://repo.maven.apache.org/maven2/org/apache/commons/commons-exec/1.3/commons-exec-1.3.jar
(54 KB at 1436.4 KB/sec)
rsync: change_dir "/home/jenkins/jenkins-slave/workspace/beam_PostCommit_Java_JDK_Versions_Test/jdk\#012.\#012(latest)/label/beam/sdks/java/maven-archetypes/examples/../../../../examples/java/src/main/java/org/apache/beam/examples"
failed: No such file or directory (2)
rsync error: some files/attrs were not transferred (see previous errors) (code 23) at main.c(1183)
[sender=3.1.0]
2017-05-03\T\00:26:25.602 [ERROR] Command execution failed.
org.apache.commons.exec.ExecuteException: Process exited with an error: 23 (Exit value: 23)
	at org.apache.commons.exec.DefaultExecutor.executeInternal(DefaultExecutor.java:404)
	at org.apache.commons.exec.DefaultExecutor.execute(DefaultExecutor.java:166)
	at org.codehaus.mojo.exec.ExecMojo.executeCommandLine(ExecMojo.java:764)
	at org.codehaus.mojo.exec.ExecMojo.executeCommandLine(ExecMojo.java:711)
	at org.codehaus.mojo.exec.ExecMojo.execute(ExecMojo.java:289)
	at org.apache.maven.plugin.DefaultBuildPluginManager.executeMojo(DefaultBuildPluginManager.java:134)
	at org.apache.maven.lifecycle.internal.MojoExecutor.execute(MojoExecutor.java:208)
	at org.apache.maven.lifecycle.internal.MojoExecutor.execute(MojoExecutor.java:153)
	at org.apache.maven.lifecycle.internal.MojoExecutor.execute(MojoExecutor.java:145)
	at org.apache.maven.lifecycle.internal.LifecycleModuleBuilder.buildProject(LifecycleModuleBuilder.java:116)
	at org.apache.maven.lifecycle.internal.LifecycleModuleBuilder.buildProject(LifecycleModuleBuilder.java:80)
	at org.apache.maven.lifecycle.internal.builder.singlethreaded.SingleThreadedBuilder.build(SingleThreadedBuilder.java:51)
	at org.apache.maven.lifecycle.internal.LifecycleStarter.execute(LifecycleStarter.java:128)
	at org.apache.maven.DefaultMaven.doExecute(DefaultMaven.java:307)
	at org.apache.maven.DefaultMaven.doExecute(DefaultMaven.java:193)
	at org.apache.maven.DefaultMaven.execute(DefaultMaven.java:106)
	at org.apache.maven.cli.MavenCli.execute(MavenCli.java:862)
	at org.apache.maven.cli.MavenCli.doMain(MavenCli.java:286)
	at org.apache.maven.cli.MavenCli.main(MavenCli.java:197)
	at sun.reflect.NativeMethodAccessorImpl.invoke0(Native Method)
	at sun.reflect.NativeMethodAccessorImpl.invoke(NativeMethodAccessorImpl.java:62)
	at sun.reflect.DelegatingMethodAccessorImpl.invoke(DelegatingMethodAccessorImpl.java:43)
	at java.lang.reflect.Method.invoke(Method.java:498)
	at org.codehaus.plexus.classworlds.launcher.Launcher.launchEnhanced(Launcher.java:289)
	at org.codehaus.plexus.classworlds.launcher.Launcher.launch(Launcher.java:229)
	at org.codehaus.plexus.classworlds.launcher.Launcher.mainWithExitCode(Launcher.java:415)
	at org.codehaus.plexus.classworlds.launcher.Launcher.main(Launcher.java:356)
2017-05-03\T\00:26:25.603 [INFO] ------------------------------------------------------------------------
2017-05-03\T\00:26:25.603 [INFO] Reactor Summary:
2017-05-03\T\00:26:25.603 [INFO] 
2017-05-03\T\00:26:25.603 [INFO] Apache Beam :: Parent .............................. SUCCESS
[ 32.575 s]
2017-05-03\T\00:26:25.603 [INFO] Apache Beam :: SDKs :: Java :: Build Tools ......... SUCCESS
[  9.355 s]
2017-05-03\T\00:26:25.603 [INFO] Apache Beam :: SDKs ................................ SUCCESS
[  0.880 s]
2017-05-03\T\00:26:25.603 [INFO] Apache Beam :: SDKs :: Common ...................... SUCCESS
[  1.896 s]
2017-05-03\T\00:26:25.603 [INFO] Apache Beam :: SDKs :: Common :: Fn API ............ SUCCESS
[ 12.974 s]
2017-05-03\T\00:26:25.603 [INFO] Apache Beam :: SDKs :: Common :: Runner API ........ SUCCESS
[  2.817 s]
2017-05-03\T\00:26:25.603 [INFO] Apache Beam :: SDKs :: Java ........................ SUCCESS
[  2.019 s]
2017-05-03\T\00:26:25.603 [INFO] Apache Beam :: SDKs :: Java :: Core ................ SUCCESS
[01:39 min]
2017-05-03\T\00:26:25.603 [INFO] Apache Beam :: SDKs :: Java :: IO .................. SUCCESS
[  0.946 s]
2017-05-03\T\00:26:25.603 [INFO] Apache Beam :: SDKs :: Java :: IO :: Common ........ SUCCESS
[  4.217 s]
2017-05-03\T\00:26:25.603 [INFO] Apache Beam :: Runners ............................. SUCCESS
[  0.625 s]
2017-05-03\T\00:26:25.603 [INFO] Apache Beam :: Runners :: Core Construction Java ... SUCCESS
[ 12.079 s]
2017-05-03\T\00:26:25.604 [INFO] Apache Beam :: Runners :: Core Java ................ SUCCESS
[ 38.713 s]
2017-05-03\T\00:26:25.604 [INFO] Apache Beam :: Runners :: Direct Java .............. SUCCESS
[02:57 min]
2017-05-03\T\00:26:25.604 [INFO] Apache Beam :: SDKs :: Java :: IO :: Elasticsearch . SUCCESS
[ 33.873 s]
2017-05-03\T\00:26:25.604 [INFO] Apache Beam :: SDKs :: Java :: Extensions .......... SUCCESS
[  0.798 s]
2017-05-03\T\00:26:25.604 [INFO] Apache Beam :: SDKs :: Java :: Extensions :: Google Cloud
Platform Core SUCCESS [ 20.653 s]
2017-05-03\T\00:26:25.604 [INFO] Apache Beam :: SDKs :: Java :: Extensions :: Protobuf SUCCESS
[ 14.120 s]
2017-05-03\T\00:26:25.604 [INFO] Apache Beam :: SDKs :: Java :: IO :: Google Cloud Platform
SUCCESS [01:25 min]
2017-05-03\T\00:26:25.604 [INFO] Apache Beam :: SDKs :: Java :: IO :: Hadoop Common . SUCCESS
[ 11.919 s]
2017-05-03\T\00:26:25.604 [INFO] Apache Beam :: SDKs :: Java :: IO :: Hadoop File System SUCCESS
[ 35.357 s]
2017-05-03\T\00:26:25.604 [INFO] Apache Beam :: SDKs :: Java :: IO :: Hadoop ........ SUCCESS
[  2.004 s]
2017-05-03\T\00:26:25.604 [INFO] Apache Beam :: SDKs :: Java :: IO :: Hadoop :: input-format
SUCCESS [ 10.892 s]
2017-05-03\T\00:26:25.604 [INFO] Apache Beam :: Runners :: Google Cloud Dataflow .... SUCCESS
[ 34.651 s]
2017-05-03\T\00:26:25.604 [INFO] Apache Beam :: SDKs :: Java :: IO :: Hadoop :: jdk1.8-tests
SUCCESS [01:43 min]
2017-05-03\T\00:26:25.604 [INFO] Apache Beam :: SDKs :: Java :: IO :: HBase ......... SUCCESS
[01:01 min]
2017-05-03\T\00:26:25.604 [INFO] Apache Beam :: SDKs :: Java :: IO :: JDBC .......... SUCCESS
[ 16.969 s]
2017-05-03\T\00:26:25.604 [INFO] Apache Beam :: SDKs :: Java :: IO :: JMS ........... SUCCESS
[ 12.762 s]
2017-05-03\T\00:26:25.604 [INFO] Apache Beam :: SDKs :: Java :: IO :: Kafka ......... SUCCESS
[ 28.332 s]
2017-05-03\T\00:26:25.604 [INFO] Apache Beam :: SDKs :: Java :: IO :: Kinesis ....... SUCCESS
[ 16.709 s]
2017-05-03\T\00:26:25.604 [INFO] Apache Beam :: SDKs :: Java :: IO :: MongoDB ....... SUCCESS
[ 27.636 s]
2017-05-03\T\00:26:25.604 [INFO] Apache Beam :: SDKs :: Java :: IO :: MQTT .......... SUCCESS
[ 11.722 s]
2017-05-03\T\00:26:25.604 [INFO] Apache Beam :: SDKs :: Java :: IO :: XML ........... SUCCESS
[ 16.764 s]
2017-05-03\T\00:26:25.604 [INFO] Apache Beam :: SDKs :: Java :: Maven Archetypes .... SUCCESS
[  0.448 s]
2017-05-03\T\00:26:25.604 [INFO] Apache Beam :: SDKs :: Java :: Maven Archetypes :: Starter
SUCCESS [ 15.061 s]
2017-05-03\T\00:26:25.604 [INFO] Apache Beam :: SDKs :: Java :: Maven Archetypes :: Examples
FAILURE [  1.369 s]
2017-05-03\T\00:26:25.604 [INFO] Apache Beam :: SDKs :: Java :: Maven Archetypes :: Examples
- Java 8 SKIPPED
2017-05-03\T\00:26:25.604 [INFO] Apache Beam :: SDKs :: Java :: Extensions :: Jackson SKIPPED
2017-05-03\T\00:26:25.604 [INFO] Apache Beam :: SDKs :: Java :: Extensions :: Join library
SKIPPED
2017-05-03\T\00:26:25.604 [INFO] Apache Beam :: SDKs :: Java :: Extensions :: Sorter  SKIPPED
2017-05-03\T\00:26:25.604 [INFO] Apache Beam :: SDKs :: Java :: Harness ............. SKIPPED
2017-05-03\T\00:26:25.604 [INFO] Apache Beam :: SDKs :: Java :: Java 8 Tests ........ SKIPPED
2017-05-03\T\00:26:25.604 [INFO] Apache Beam :: Runners :: Flink .................... SKIPPED
2017-05-03\T\00:26:25.604 [INFO] Apache Beam :: Runners :: Spark .................... SKIPPED
2017-05-03\T\00:26:25.604 [INFO] Apache Beam :: Runners :: Apex ..................... SKIPPED
2017-05-03\T\00:26:25.604 [INFO] Apache Beam :: Examples ............................ SKIPPED
2017-05-03\T\00:26:25.604 [INFO] Apache Beam :: Examples :: Java .................... SKIPPED
2017-05-03\T\00:26:25.604 [INFO] Apache Beam :: Examples :: Java 8 .................. SKIPPED
2017-05-03\T\00:26:25.604 [INFO] Apache Beam :: SDKs :: Java :: Aggregated Javadoc .. SKIPPED
2017-05-03\T\00:26:25.604 [INFO] ------------------------------------------------------------------------
2017-05-03\T\00:26:25.604 [INFO] BUILD FAILURE
2017-05-03\T\00:26:25.604 [INFO] ------------------------------------------------------------------------
2017-05-03\T\00:26:25.604 [INFO] Total time: 16:03 min
2017-05-03\T\00:26:25.605 [INFO] Finished at: 2017-05-03T00:26:25+00:00
2017-05-03\T\00:26:27.067 [INFO] Final Memory: 418M/1923M
2017-05-03\T\00:26:27.067 [INFO] ------------------------------------------------------------------------
2017-05-03\T\00:26:27.069 [ERROR] Failed to execute goal org.codehaus.mojo:exec-maven-plugin:1.5.0:exec
(generate-archetype-contents) on project beam-sdks-java-maven-archetypes-examples: Command
execution failed. Process exited with an error: 23 (Exit value: 23) -> [Help 1]
org.apache.maven.lifecycle.LifecycleExecutionException: Failed to execute goal org.codehaus.mojo:exec-maven-plugin:1.5.0:exec
(generate-archetype-contents) on project beam-sdks-java-maven-archetypes-examples: Command
execution failed.
	at org.apache.maven.lifecycle.internal.MojoExecutor.execute(MojoExecutor.java:216)
	at org.apache.maven.lifecycle.internal.MojoExecutor.execute(MojoExecutor.java:153)
	at org.apache.maven.lifecycle.internal.MojoExecutor.execute(MojoExecutor.java:145)
	at org.apache.maven.lifecycle.internal.LifecycleModuleBuilder.buildProject(LifecycleModuleBuilder.java:116)
	at org.apache.maven.lifecycle.internal.LifecycleModuleBuilder.buildProject(LifecycleModuleBuilder.java:80)
	at org.apache.maven.lifecycle.internal.builder.singlethreaded.SingleThreadedBuilder.build(SingleThreadedBuilder.java:51)
	at org.apache.maven.lifecycle.internal.LifecycleStarter.execute(LifecycleStarter.java:128)
	at org.apache.maven.DefaultMaven.doExecute(DefaultMaven.java:307)
	at org.apache.maven.DefaultMaven.doExecute(DefaultMaven.java:193)
	at org.apache.maven.DefaultMaven.execute(DefaultMaven.java:106)
	at org.apache.maven.cli.MavenCli.execute(MavenCli.java:862)
	at org.apache.maven.cli.MavenCli.doMain(MavenCli.java:286)
	at org.apache.maven.cli.MavenCli.main(MavenCli.java:197)
	at sun.reflect.NativeMethodAccessorImpl.invoke0(Native Method)
	at sun.reflect.NativeMethodAccessorImpl.invoke(NativeMethodAccessorImpl.java:62)
	at sun.reflect.DelegatingMethodAccessorImpl.invoke(DelegatingMethodAccessorImpl.java:43)
	at java.lang.reflect.Method.invoke(Method.java:498)
	at org.codehaus.plexus.classworlds.launcher.Launcher.launchEnhanced(Launcher.java:289)
	at org.codehaus.plexus.classworlds.launcher.Launcher.launch(Launcher.java:229)
	at org.codehaus.plexus.classworlds.launcher.Launcher.mainWithExitCode(Launcher.java:415)
	at org.codehaus.plexus.classworlds.launcher.Launcher.main(Launcher.java:356)
Caused by: org.apache.maven.plugin.MojoExecutionException: Command execution failed.
	at org.codehaus.mojo.exec.ExecMojo.execute(ExecMojo.java:302)
	at org.apache.maven.plugin.DefaultBuildPluginManager.executeMojo(DefaultBuildPluginManager.java:134)
	at org.apache.maven.lifecycle.internal.MojoExecutor.execute(MojoExecutor.java:208)
	... 20 more
Caused by: org.apache.commons.exec.ExecuteException: Process exited with an error: 23 (Exit
value: 23)
	at org.apache.commons.exec.DefaultExecutor.executeInternal(DefaultExecutor.java:404)
	at org.apache.commons.exec.DefaultExecutor.execute(DefaultExecutor.java:166)
	at org.codehaus.mojo.exec.ExecMojo.executeCommandLine(ExecMojo.java:764)
	at org.codehaus.mojo.exec.ExecMojo.executeCommandLine(ExecMojo.java:711)
	at org.codehaus.mojo.exec.ExecMojo.execute(ExecMojo.java:289)
	... 22 more
2017-05-03\T\00:26:27.070 [ERROR] 
2017-05-03\T\00:26:27.070 [ERROR] Re-run Maven using the -X switch to enable full debug logging.
2017-05-03\T\00:26:27.070 [ERROR] 
2017-05-03\T\00:26:27.070 [ERROR] For more information about the errors and possible solutions,
please read the following articles:
2017-05-03\T\00:26:27.070 [ERROR] [Help 1] http://cwiki.apache.org/confluence/display/MAVEN/MojoExecutionException
2017-05-03\T\00:26:27.070 [ERROR] 
2017-05-03\T\00:26:27.070 [ERROR] After correcting the problems, you can resume the build
with the command
2017-05-03\T\00:26:27.070 [ERROR]   mvn <goals> -rf :beam-sdks-java-maven-archetypes-examples
Build step 'Invoke top-level Maven targets' marked build as failure

Mime
View raw message