beam-commits mailing list archives

Site index · List index
Message view « Date » · « Thread »
Top « Date » · « Thread »
From Apache Jenkins Server <jenk...@builds.apache.org>
Subject Build failed in Jenkins: beam_PostCommit_Java_MavenInstall #3799
Date Sat, 13 May 2017 00:12:58 GMT
See <https://builds.apache.org/job/beam_PostCommit_Java_MavenInstall/3799/display/redirect?page=changes>

Changes:

[dhalperi] [BEAM-2279] Fix archetype breakages

------------------------------------------
[...truncated 2.35 MB...]
Error occurred in starting fork, check output in log
Process Exit Code: 1
	at org.apache.maven.plugin.surefire.booterclient.ForkStarter.awaitResultsDone(ForkStarter.java:494)
	at org.apache.maven.plugin.surefire.booterclient.ForkStarter.runSuitesForkPerTestSet(ForkStarter.java:441)
	at org.apache.maven.plugin.surefire.booterclient.ForkStarter.run(ForkStarter.java:292)
	at org.apache.maven.plugin.surefire.booterclient.ForkStarter.run(ForkStarter.java:243)
	at org.apache.maven.plugin.surefire.AbstractSurefireMojo.executeProvider(AbstractSurefireMojo.java:1077)
	at org.apache.maven.plugin.surefire.AbstractSurefireMojo.executeAfterPreconditionsChecked(AbstractSurefireMojo.java:907)
	at org.apache.maven.plugin.surefire.AbstractSurefireMojo.execute(AbstractSurefireMojo.java:785)
	at org.apache.maven.plugin.DefaultBuildPluginManager.executeMojo(DefaultBuildPluginManager.java:134)
	at org.apache.maven.lifecycle.internal.MojoExecutor.execute(MojoExecutor.java:208)
	at org.apache.maven.lifecycle.internal.MojoExecutor.execute(MojoExecutor.java:153)
	at org.apache.maven.lifecycle.internal.MojoExecutor.execute(MojoExecutor.java:145)
	at org.apache.maven.lifecycle.internal.LifecycleModuleBuilder.buildProject(LifecycleModuleBuilder.java:116)
	at org.apache.maven.lifecycle.internal.LifecycleModuleBuilder.buildProject(LifecycleModuleBuilder.java:80)
	at org.apache.maven.lifecycle.internal.builder.singlethreaded.SingleThreadedBuilder.build(SingleThreadedBuilder.java:51)
	at org.apache.maven.lifecycle.internal.LifecycleStarter.execute(LifecycleStarter.java:128)
	at org.apache.maven.DefaultMaven.doExecute(DefaultMaven.java:307)
	at org.apache.maven.DefaultMaven.doExecute(DefaultMaven.java:193)
	at org.apache.maven.DefaultMaven.execute(DefaultMaven.java:106)
	at org.jvnet.hudson.maven3.launcher.Maven33Launcher.main(Maven33Launcher.java:129)
	at sun.reflect.NativeMethodAccessorImpl.invoke0(Native Method)
	at sun.reflect.NativeMethodAccessorImpl.invoke(NativeMethodAccessorImpl.java:62)
	at sun.reflect.DelegatingMethodAccessorImpl.invoke(DelegatingMethodAccessorImpl.java:43)
	at java.lang.reflect.Method.invoke(Method.java:498)
	at org.codehaus.plexus.classworlds.launcher.Launcher.launchStandard(Launcher.java:330)
	at org.codehaus.plexus.classworlds.launcher.Launcher.launch(Launcher.java:238)
	at jenkins.maven3.agent.Maven33Main.launch(Maven33Main.java:176)
	at sun.reflect.NativeMethodAccessorImpl.invoke0(Native Method)
	at sun.reflect.NativeMethodAccessorImpl.invoke(NativeMethodAccessorImpl.java:62)
	at sun.reflect.DelegatingMethodAccessorImpl.invoke(DelegatingMethodAccessorImpl.java:43)
	at java.lang.reflect.Method.invoke(Method.java:498)
	at hudson.maven.Maven3Builder.call(Maven3Builder.java:139)
	at hudson.maven.Maven3Builder.call(Maven3Builder.java:70)
	at hudson.remoting.UserRequest.perform(UserRequest.java:153)
	at hudson.remoting.UserRequest.perform(UserRequest.java:50)
	at hudson.remoting.Request$2.run(Request.java:336)
	at hudson.remoting.InterceptingExecutorService$1.call(InterceptingExecutorService.java:68)
	at java.util.concurrent.FutureTask.run(FutureTask.java:266)
	at java.util.concurrent.ThreadPoolExecutor.runWorker(ThreadPoolExecutor.java:1142)
	at java.util.concurrent.ThreadPoolExecutor$Worker.run(ThreadPoolExecutor.java:617)
	at java.lang.Thread.run(Thread.java:745)
Caused by: org.apache.maven.surefire.booter.SurefireBooterForkException: The forked VM terminated
without properly saying goodbye. VM crash or System.exit called?
Command was /bin/sh -c cd <https://builds.apache.org/job/beam_PostCommit_Java_MavenInstall/ws/runners/spark>
&& /usr/local/asfpackages/java/jdk1.8.0_121/jre/bin/java org.apache.maven.surefire.booter.ForkedBooter
<https://builds.apache.org/job/beam_PostCommit_Java_MavenInstall/ws/runners/spark/target/surefire>
2017-05-12T23-04-33_800-jvmRun1 surefire9007512650165010654tmp surefire_478618043086786122453tmp
Error occurred in starting fork, check output in log
Process Exit Code: 1
	at org.apache.maven.plugin.surefire.booterclient.ForkStarter.fork(ForkStarter.java:679)
	at org.apache.maven.plugin.surefire.booterclient.ForkStarter.fork(ForkStarter.java:533)
	at org.apache.maven.plugin.surefire.booterclient.ForkStarter.access$600(ForkStarter.java:117)
	at org.apache.maven.plugin.surefire.booterclient.ForkStarter$2.call(ForkStarter.java:429)
	at org.apache.maven.plugin.surefire.booterclient.ForkStarter$2.call(ForkStarter.java:406)
	... 4 more

[WARNING] Cannot calculate digest of mojo class, because mojo wasn't loaded from a jar, but
from: <https://builds.apache.org/job/beam_PostCommit_Java_MavenInstall/ws/.repository/org/apache/maven/plugins/maven-surefire-plugin/2.20/maven-surefire-plugin-2.20.jar>
[JENKINS] Recording test results
2017-05-13T00:10:32.254 [INFO] 
2017-05-13T00:10:32.255 [INFO] --- maven-surefire-plugin:2.20:test (streaming-tests) @ beam-runners-spark
---
2017-05-13T00:10:32.260 [INFO] Surefire report directory: <https://builds.apache.org/job/beam_PostCommit_Java_MavenInstall/ws/runners/spark/target/surefire-reports>
2017-05-13T00:10:32.260 [INFO] Using configured provider org.apache.maven.surefire.junitcore.JUnitCoreProvider
2017-05-13T00:10:32.261 [INFO] parallel='none', perCoreThreadCount=true, threadCount=0, useUnlimitedThreads=false,
threadCountSuites=0, threadCountClasses=0, threadCountMethods=0, parallelOptimized=true
2017-05-13T00:10:32.262 [INFO] 
2017-05-13T00:10:32.262 [INFO] -------------------------------------------------------
2017-05-13T00:10:32.263 [INFO]  T E S T S
2017-05-13T00:10:32.263 [INFO] -------------------------------------------------------
2017-05-13T00:10:32.284 [INFO] 
2017-05-13T00:10:32.284 [INFO] Results:
2017-05-13T00:10:32.285 [INFO] 
2017-05-13T00:10:32.285 [INFO] Tests run: 0, Failures: 0, Errors: 0, Skipped: 0
2017-05-13T00:10:32.285 [INFO] 
[WARNING] Cannot calculate digest of mojo class, because mojo wasn't loaded from a jar, but
from: <https://builds.apache.org/job/beam_PostCommit_Java_MavenInstall/ws/.repository/org/apache/maven/plugins/maven-surefire-plugin/2.20/maven-surefire-plugin-2.20.jar>
[JENKINS] Recording test results
[JENKINS] Archiving disabled
2017-05-13T00:10:33.686 [INFO]                                                           
             
2017-05-13T00:10:33.686 [INFO] ------------------------------------------------------------------------
2017-05-13T00:10:33.686 [INFO] Skipping Apache Beam :: Parent
2017-05-13T00:10:33.686 [INFO] This project has been banned from the build due to previous
failures.
2017-05-13T00:10:33.686 [INFO] ------------------------------------------------------------------------
[JENKINS] Archiving disabled
[JENKINS] Archiving disabled
[JENKINS] Archiving disabled
[JENKINS] Archiving disabled
[JENKINS] Archiving disabled
[JENKINS] Archiving disabled
[JENKINS] Archiving disabled
[JENKINS] Archiving disabled
[JENKINS] Archiving disabled
[JENKINS] Archiving disabled
[JENKINS] Archiving disabled
[JENKINS] Archiving disabled
[JENKINS] Archiving disabled
[JENKINS] Archiving disabled
[JENKINS] Archiving disabled
[JENKINS] Archiving disabled
[JENKINS] Archiving disabled
[JENKINS] Archiving disabled
[JENKINS] Archiving disabled
[JENKINS] Archiving disabled
[JENKINS] Archiving disabled
[JENKINS] Archiving disabled
[JENKINS] Archiving disabled
[JENKINS] Archiving disabled
[JENKINS] Archiving disabled
[JENKINS] Archiving disabled
[JENKINS] Archiving disabled
[JENKINS] Archiving disabled
[JENKINS] Archiving disabled
[JENKINS] Archiving disabled
[JENKINS] Archiving disabled
[JENKINS] Archiving disabled
[JENKINS] Archiving disabled
[JENKINS] Archiving disabled
[JENKINS] Archiving disabled
[JENKINS] Archiving disabled
[JENKINS] Archiving disabled
[JENKINS] Archiving disabled
[JENKINS] Archiving disabled
[JENKINS] Archiving disabled
[JENKINS] Archiving disabled
[JENKINS] Archiving disabled
[JENKINS] Archiving disabled
[JENKINS] Archiving disabled
[JENKINS] Archiving disabled
[JENKINS] Archiving disabled
2017-05-13T00:11:10.109 [INFO] ------------------------------------------------------------------------
2017-05-13T00:11:10.109 [INFO] Reactor Summary:
2017-05-13T00:11:10.109 [INFO] 
2017-05-13T00:11:10.109 [INFO] Apache Beam :: Parent .............................. SUCCESS
[01:40 min]
2017-05-13T00:11:10.110 [INFO] Apache Beam :: SDKs :: Java :: Build Tools ......... SUCCESS
[ 15.385 s]
2017-05-13T00:11:10.110 [INFO] Apache Beam :: SDKs ................................ SUCCESS
[  6.499 s]
2017-05-13T00:11:10.110 [INFO] Apache Beam :: SDKs :: Common ...................... SUCCESS
[  3.453 s]
2017-05-13T00:11:10.110 [INFO] Apache Beam :: SDKs :: Common :: Fn API ............ SUCCESS
[ 34.305 s]
2017-05-13T00:11:10.110 [INFO] Apache Beam :: SDKs :: Common :: Runner API ........ SUCCESS
[ 19.676 s]
2017-05-13T00:11:10.110 [INFO] Apache Beam :: SDKs :: Java ........................ SUCCESS
[  2.747 s]
2017-05-13T00:11:10.110 [INFO] Apache Beam :: SDKs :: Java :: Core ................ SUCCESS
[03:41 min]
2017-05-13T00:11:10.110 [INFO] Apache Beam :: SDKs :: Java :: IO .................. SUCCESS
[  2.673 s]
2017-05-13T00:11:10.110 [INFO] Apache Beam :: SDKs :: Java :: IO :: Common ........ SUCCESS
[  8.213 s]
2017-05-13T00:11:10.110 [INFO] Apache Beam :: Runners ............................. SUCCESS
[  2.916 s]
2017-05-13T00:11:10.110 [INFO] Apache Beam :: Runners :: Core Construction Java ... SUCCESS
[ 27.731 s]
2017-05-13T00:11:10.110 [INFO] Apache Beam :: Runners :: Core Java ................ SUCCESS
[01:07 min]
2017-05-13T00:11:10.110 [INFO] Apache Beam :: Runners :: Direct Java .............. SUCCESS
[03:12 min]
2017-05-13T00:11:10.110 [INFO] Apache Beam :: SDKs :: Java :: IO :: Elasticsearch . SUCCESS
[ 46.456 s]
2017-05-13T00:11:10.110 [INFO] Apache Beam :: SDKs :: Java :: Extensions .......... SUCCESS
[  3.045 s]
2017-05-13T00:11:10.110 [INFO] Apache Beam :: SDKs :: Java :: Extensions :: Google Cloud Platform
Core SUCCESS [ 41.243 s]
2017-05-13T00:11:10.110 [INFO] Apache Beam :: SDKs :: Java :: Extensions :: Protobuf SUCCESS
[ 20.027 s]
2017-05-13T00:11:10.110 [INFO] Apache Beam :: SDKs :: Java :: IO :: Google Cloud Platform
SUCCESS [01:11 min]
2017-05-13T00:11:10.110 [INFO] Apache Beam :: SDKs :: Java :: IO :: Hadoop Common . SUCCESS
[ 23.913 s]
2017-05-13T00:11:10.110 [INFO] Apache Beam :: SDKs :: Java :: IO :: Hadoop File System SUCCESS
[ 39.020 s]
2017-05-13T00:11:10.110 [INFO] Apache Beam :: SDKs :: Java :: IO :: Hadoop ........ SUCCESS
[  7.712 s]
2017-05-13T00:11:10.110 [INFO] Apache Beam :: SDKs :: Java :: IO :: Hadoop :: input-format
SUCCESS [ 24.862 s]
2017-05-13T00:11:10.110 [INFO] Apache Beam :: Runners :: Google Cloud Dataflow .... SUCCESS
[05:37 min]
2017-05-13T00:11:10.110 [INFO] Apache Beam :: SDKs :: Java :: IO :: Hadoop :: jdk1.8-tests
SUCCESS [01:33 min]
2017-05-13T00:11:10.110 [INFO] Apache Beam :: SDKs :: Java :: IO :: HBase ......... SUCCESS
[01:10 min]
2017-05-13T00:11:10.110 [INFO] Apache Beam :: SDKs :: Java :: IO :: JDBC .......... SUCCESS
[ 44.652 s]
2017-05-13T00:11:10.110 [INFO] Apache Beam :: SDKs :: Java :: IO :: JMS ........... SUCCESS
[ 29.635 s]
2017-05-13T00:11:10.110 [INFO] Apache Beam :: SDKs :: Java :: IO :: Kafka ......... SUCCESS
[ 28.946 s]
2017-05-13T00:11:10.110 [INFO] Apache Beam :: SDKs :: Java :: IO :: Kinesis ....... SUCCESS
[ 34.117 s]
2017-05-13T00:11:10.110 [INFO] Apache Beam :: SDKs :: Java :: IO :: MongoDB ....... SUCCESS
[ 38.143 s]
2017-05-13T00:11:10.110 [INFO] Apache Beam :: SDKs :: Java :: IO :: MQTT .......... SUCCESS
[ 26.975 s]
2017-05-13T00:11:10.110 [INFO] Apache Beam :: SDKs :: Java :: IO :: XML ........... SUCCESS
[ 30.807 s]
2017-05-13T00:11:10.110 [INFO] Apache Beam :: SDKs :: Java :: Maven Archetypes .... SUCCESS
[  6.232 s]
2017-05-13T00:11:10.110 [INFO] Apache Beam :: SDKs :: Java :: Maven Archetypes :: Starter
SUCCESS [ 20.731 s]
2017-05-13T00:11:10.110 [INFO] Apache Beam :: Examples ............................ SUCCESS
[  3.360 s]
2017-05-13T00:11:10.110 [INFO] Apache Beam :: Examples :: Java .................... SUCCESS
[07:35 min]
2017-05-13T00:11:10.110 [INFO] Apache Beam :: SDKs :: Java :: Maven Archetypes :: Examples
SUCCESS [ 40.161 s]
2017-05-13T00:11:10.110 [INFO] Apache Beam :: Examples :: Java 8 .................. SUCCESS
[ 20.623 s]
2017-05-13T00:11:10.110 [INFO] Apache Beam :: SDKs :: Java :: Maven Archetypes :: Examples
- Java 8 SUCCESS [ 43.180 s]
2017-05-13T00:11:10.110 [INFO] Apache Beam :: SDKs :: Java :: Extensions :: Jackson SUCCESS
[ 20.252 s]
2017-05-13T00:11:10.110 [INFO] Apache Beam :: SDKs :: Java :: Extensions :: Join library SUCCESS
[ 25.652 s]
2017-05-13T00:11:10.110 [INFO] Apache Beam :: SDKs :: Java :: Extensions :: Sorter  SUCCESS
[ 44.633 s]
2017-05-13T00:11:10.110 [INFO] Apache Beam :: SDKs :: Java :: Harness ............. SUCCESS
[ 38.745 s]
2017-05-13T00:11:10.110 [INFO] Apache Beam :: SDKs :: Java :: Java 8 Tests ........ SUCCESS
[ 10.962 s]
2017-05-13T00:11:10.110 [INFO] Apache Beam :: SDKs :: Python ...................... SUCCESS
[21:47 min]
2017-05-13T00:11:10.110 [INFO] Apache Beam :: Runners :: Flink .................... SUCCESS
[ 49.897 s]
2017-05-13T00:11:10.110 [INFO] Apache Beam :: Runners :: Spark .................... FAILURE
[02:19 min]
2017-05-13T00:11:10.110 [INFO] Apache Beam :: Runners :: Apex ..................... SKIPPED
2017-05-13T00:11:10.110 [INFO] Apache Beam :: SDKs :: Java :: Aggregated Javadoc .. SKIPPED
2017-05-13T00:11:10.110 [INFO] ------------------------------------------------------------------------
2017-05-13T00:11:10.110 [INFO] BUILD FAILURE
2017-05-13T00:11:10.110 [INFO] ------------------------------------------------------------------------
2017-05-13T00:11:10.110 [INFO] Total time: 01:08 h
2017-05-13T00:11:10.111 [INFO] Finished at: 2017-05-13T00:11:10+00:00
2017-05-13T00:11:10.989 [INFO] Final Memory: 276M/1832M
2017-05-13T00:11:10.989 [INFO] ------------------------------------------------------------------------
Waiting for Jenkins to finish collecting data
2017-05-13T00:11:58.254 [ERROR] Failed to execute goal org.apache.maven.plugins:maven-surefire-plugin:2.20:test
(streaming-tests) on project beam-runners-spark: Execution streaming-tests of goal org.apache.maven.plugins:maven-surefire-plugin:2.20:test
failed: java.lang.ClassNotFoundException: org.apache.maven.plugin.surefire.StartupReportConfiguration
-> [Help 1]
org.apache.maven.lifecycle.LifecycleExecutionException: Failed to execute goal org.apache.maven.plugins:maven-surefire-plugin:2.20:test
(streaming-tests) on project beam-runners-spark: Execution streaming-tests of goal org.apache.maven.plugins:maven-surefire-plugin:2.20:test
failed: java.lang.ClassNotFoundException: org.apache.maven.plugin.surefire.StartupReportConfiguration
	at org.apache.maven.lifecycle.internal.MojoExecutor.execute(MojoExecutor.java:224)
	at org.apache.maven.lifecycle.internal.MojoExecutor.execute(MojoExecutor.java:153)
	at org.apache.maven.lifecycle.internal.MojoExecutor.execute(MojoExecutor.java:145)
	at org.apache.maven.lifecycle.internal.LifecycleModuleBuilder.buildProject(LifecycleModuleBuilder.java:116)
	at org.apache.maven.lifecycle.internal.LifecycleModuleBuilder.buildProject(LifecycleModuleBuilder.java:80)
	at org.apache.maven.lifecycle.internal.builder.singlethreaded.SingleThreadedBuilder.build(SingleThreadedBuilder.java:51)
	at org.apache.maven.lifecycle.internal.LifecycleStarter.execute(LifecycleStarter.java:128)
	at org.apache.maven.DefaultMaven.doExecute(DefaultMaven.java:307)
	at org.apache.maven.DefaultMaven.doExecute(DefaultMaven.java:193)
	at org.apache.maven.DefaultMaven.execute(DefaultMaven.java:106)
	at org.jvnet.hudson.maven3.launcher.Maven33Launcher.main(Maven33Launcher.java:129)
	at sun.reflect.NativeMethodAccessorImpl.invoke0(Native Method)
	at sun.reflect.NativeMethodAccessorImpl.invoke(NativeMethodAccessorImpl.java:62)
	at sun.reflect.DelegatingMethodAccessorImpl.invoke(DelegatingMethodAccessorImpl.java:43)
	at java.lang.reflect.Method.invoke(Method.java:498)
	at org.codehaus.plexus.classworlds.launcher.Launcher.launchStandard(Launcher.java:330)
	at org.codehaus.plexus.classworlds.launcher.Launcher.launch(Launcher.java:238)
	at jenkins.maven3.agent.Maven33Main.launch(Maven33Main.java:176)
	at sun.reflect.NativeMethodAccessorImpl.invoke0(Native Method)
	at sun.reflect.NativeMethodAccessorImpl.invoke(NativeMethodAccessorImpl.java:62)
	at sun.reflect.DelegatingMethodAccessorImpl.invoke(DelegatingMethodAccessorImpl.java:43)
	at java.lang.reflect.Method.invoke(Method.java:498)
	at hudson.maven.Maven3Builder.call(Maven3Builder.java:139)
	at hudson.maven.Maven3Builder.call(Maven3Builder.java:70)
	at hudson.remoting.UserRequest.perform(UserRequest.java:153)
	at hudson.remoting.UserRequest.perform(UserRequest.java:50)
	at hudson.remoting.Request$2.run(Request.java:336)
	at hudson.remoting.InterceptingExecutorService$1.call(InterceptingExecutorService.java:68)
	at java.util.concurrent.FutureTask.run(FutureTask.java:266)
	at java.util.concurrent.ThreadPoolExecutor.runWorker(ThreadPoolExecutor.java:1142)
	at java.util.concurrent.ThreadPoolExecutor$Worker.run(ThreadPoolExecutor.java:617)
	at java.lang.Thread.run(Thread.java:745)
Caused by: org.apache.maven.plugin.PluginExecutionException: Execution streaming-tests of
goal org.apache.maven.plugins:maven-surefire-plugin:2.20:test failed: java.lang.ClassNotFoundException:
org.apache.maven.plugin.surefire.StartupReportConfiguration
	at org.apache.maven.plugin.DefaultBuildPluginManager.executeMojo(DefaultBuildPluginManager.java:145)
	at org.apache.maven.lifecycle.internal.MojoExecutor.execute(MojoExecutor.java:208)
	... 31 more
Caused by: org.apache.maven.surefire.util.SurefireReflectionException: java.lang.ClassNotFoundException:
org.apache.maven.plugin.surefire.StartupReportConfiguration
	at org.apache.maven.plugin.surefire.CommonReflector.<init>(CommonReflector.java:56)
	at org.apache.maven.plugin.surefire.booterclient.ForkStarter.getSuitesIterator(ForkStarter.java:703)
	at org.apache.maven.plugin.surefire.booterclient.ForkStarter.runSuitesForkPerTestSet(ForkStarter.java:403)
	at org.apache.maven.plugin.surefire.booterclient.ForkStarter.run(ForkStarter.java:292)
	at org.apache.maven.plugin.surefire.booterclient.ForkStarter.run(ForkStarter.java:243)
	at org.apache.maven.plugin.surefire.AbstractSurefireMojo.executeProvider(AbstractSurefireMojo.java:1077)
	at org.apache.maven.plugin.surefire.AbstractSurefireMojo.executeAfterPreconditionsChecked(AbstractSurefireMojo.java:907)
	at org.apache.maven.plugin.surefire.AbstractSurefireMojo.execute(AbstractSurefireMojo.java:785)
	at org.apache.maven.plugin.DefaultBuildPluginManager.executeMojo(DefaultBuildPluginManager.java:134)
	... 32 more
Caused by: java.lang.ClassNotFoundException: org.apache.maven.plugin.surefire.StartupReportConfiguration
	at java.net.URLClassLoader.findClass(URLClassLoader.java:381)
	at java.lang.ClassLoader.loadClass(ClassLoader.java:424)
	at java.lang.ClassLoader.loadClass(ClassLoader.java:357)
	at org.apache.maven.surefire.booter.IsolatedClassLoader.loadClass(IsolatedClassLoader.java:98)
	at org.apache.maven.plugin.surefire.CommonReflector.<init>(CommonReflector.java:51)
	... 40 more
2017-05-13T00:11:58.255 [ERROR] 
2017-05-13T00:11:58.255 [ERROR] Re-run Maven using the -X switch to enable full debug logging.
2017-05-13T00:11:58.255 [ERROR] 
2017-05-13T00:11:58.255 [ERROR] For more information about the errors and possible solutions,
please read the following articles:
2017-05-13T00:11:58.255 [ERROR] [Help 1] http://cwiki.apache.org/confluence/display/MAVEN/PluginExecutionException
2017-05-13T00:11:58.255 [ERROR] 
2017-05-13T00:11:58.256 [ERROR] After correcting the problems, you can resume the build with
the command
2017-05-13T00:11:58.256 [ERROR]   mvn <goals> -rf :beam-runners-spark
channel stopped

Mime
View raw message