beam-commits mailing list archives

Site index · List index
Message view « Date » · « Thread »
Top « Date » · « Thread »
From Apache Jenkins Server <jenk...@builds.apache.org>
Subject Build failed in Jenkins: beam_PostCommit_Java_MavenInstall #3972
Date Wed, 31 May 2017 18:33:53 GMT
See <https://builds.apache.org/job/beam_PostCommit_Java_MavenInstall/3972/display/redirect?page=changes>

Changes:

[dhalperi] [TRIVIAL] InstantCoder: stop boxing Longs unnecessarily

------------------------------------------
[...truncated 3.07 MB...]
2017-05-31T18:32:19.796 [INFO] Downloaded: https://repo.maven.apache.org/maven2/org/apache/sling/org.apache.sling.commons.json/2.0.6/org.apache.sling.commons.json-2.0.6.jar
(47 KB at 28.5 KB/sec)
2017-05-31T18:32:19.796 [INFO] Downloading: https://repo.maven.apache.org/maven2/org/apache/flink/flink-runtime_2.10/1.2.1/flink-runtime_2.10-1.2.1-tests.jar
2017-05-31T18:32:19.942 [INFO] Downloaded: https://repo.maven.apache.org/maven2/org/apache/flink/flink-core/1.2.1/flink-core-1.2.1-tests.jar
(716 KB at 401.0 KB/sec)
2017-05-31T18:32:19.942 [INFO] Downloading: https://repo.maven.apache.org/maven2/org/apache/flink/flink-streaming-java_2.10/1.2.1/flink-streaming-java_2.10-1.2.1-tests.jar
2017-05-31T18:32:20.194 [INFO] Downloaded: https://repo.maven.apache.org/maven2/org/apache/flink/flink-streaming-java_2.10/1.2.1/flink-streaming-java_2.10-1.2.1-tests.jar
(953 KB at 467.8 KB/sec)
2017-05-31T18:32:20.194 [INFO] Downloading: https://repo.maven.apache.org/maven2/org/apache/flink/flink-test-utils_2.10/1.2.1/flink-test-utils_2.10-1.2.1.jar
2017-05-31T18:32:20.207 [INFO] Downloaded: https://repo.maven.apache.org/maven2/org/scala-lang/scala-library/2.10.4/scala-library-2.10.4.jar
(6960 KB at 3394.8 KB/sec)
2017-05-31T18:32:20.207 [INFO] Downloading: https://repo.maven.apache.org/maven2/org/apache/flink/flink-test-utils-junit/1.2.1/flink-test-utils-junit-1.2.1.jar
2017-05-31T18:32:20.236 [INFO] Downloaded: https://repo.maven.apache.org/maven2/org/apache/flink/flink-test-utils-junit/1.2.1/flink-test-utils-junit-1.2.1.jar
(24 KB at 11.1 KB/sec)
2017-05-31T18:32:20.236 [INFO] Downloading: https://repo.maven.apache.org/maven2/org/apache/curator/curator-test/2.8.0/curator-test-2.8.0.jar
2017-05-31T18:32:20.270 [INFO] Downloaded: https://repo.maven.apache.org/maven2/org/apache/curator/curator-test/2.8.0/curator-test-2.8.0.jar
(39 KB at 18.4 KB/sec)
2017-05-31T18:32:20.313 [INFO] Downloaded: https://repo.maven.apache.org/maven2/org/apache/flink/flink-runtime_2.10/1.2.1/flink-runtime_2.10-1.2.1-tests.jar
(2432 KB at 1127.9 KB/sec)
2017-05-31T18:32:20.400 [INFO] Downloaded: https://repo.maven.apache.org/maven2/org/apache/flink/flink-streaming-java_2.10/1.2.1/flink-streaming-java_2.10-1.2.1.jar
(3035 KB at 1353.3 KB/sec)
2017-05-31T18:32:20.546 [INFO] Downloaded: https://repo.maven.apache.org/maven2/org/apache/flink/flink-test-utils_2.10/1.2.1/flink-test-utils_2.10-1.2.1.jar
(2366 KB at 990.2 KB/sec)
2017-05-31T18:32:20.757 [INFO] Downloaded: https://repo.maven.apache.org/maven2/org/apache/flink/flink-shaded-hadoop2/1.2.1/flink-shaded-hadoop2-1.2.1.jar
(17860 KB at 6866.4 KB/sec)
2017-05-31T18:32:20.778 [INFO] 
2017-05-31T18:32:20.778 [INFO] --- maven-clean-plugin:3.0.0:clean (default-clean) @ beam-runners-flink_2.10
---
2017-05-31T18:32:20.780 [INFO] Deleting <https://builds.apache.org/job/beam_PostCommit_Java_MavenInstall/ws/runners/flink>
(includes = [**/*.pyc, **/*.egg-info/, **/sdks/python/LICENSE, **/sdks/python/NOTICE, **/sdks/python/README.md],
excludes = [])
2017-05-31T18:32:20.953 [INFO] 
2017-05-31T18:32:20.953 [INFO] --- maven-enforcer-plugin:1.4.1:enforce (enforce) @ beam-runners-flink_2.10
---
2017-05-31T18:32:23.970 [INFO] 
2017-05-31T18:32:23.970 [INFO] --- maven-enforcer-plugin:1.4.1:enforce (enforce-banned-dependencies)
@ beam-runners-flink_2.10 ---
2017-05-31T18:32:24.060 [INFO] 
2017-05-31T18:32:24.061 [INFO] --- maven-remote-resources-plugin:1.5:process (process-resource-bundles)
@ beam-runners-flink_2.10 ---
2017-05-31T18:32:24.952 [INFO] 
2017-05-31T18:32:24.952 [INFO] --- maven-resources-plugin:3.0.2:resources (default-resources)
@ beam-runners-flink_2.10 ---
2017-05-31T18:32:24.953 [INFO] Using 'UTF-8' encoding to copy filtered resources.
2017-05-31T18:32:24.954 [INFO] Copying 1 resource
2017-05-31T18:32:24.954 [INFO] Copying 3 resources
2017-05-31T18:32:25.042 [INFO] 
2017-05-31T18:32:25.042 [INFO] --- maven-compiler-plugin:3.6.1:compile (default-compile) @
beam-runners-flink_2.10 ---
2017-05-31T18:32:25.098 [INFO] Changes detected - recompiling the module!
2017-05-31T18:32:25.098 [INFO] Compiling 75 source files to <https://builds.apache.org/job/beam_PostCommit_Java_MavenInstall/ws/runners/flink/target/classes>
2017-05-31T18:32:26.906 [WARNING] bootstrap class path not set in conjunction with -source
1.7
2017-05-31T18:32:26.906 [INFO] <https://builds.apache.org/job/beam_PostCommit_Java_MavenInstall/ws/runners/flink/src/main/java/org/apache/beam/runners/flink/FlinkStreamingTransformTranslators.java>:
Some input files use or override a deprecated API.
2017-05-31T18:32:26.906 [INFO] <https://builds.apache.org/job/beam_PostCommit_Java_MavenInstall/ws/runners/flink/src/main/java/org/apache/beam/runners/flink/FlinkStreamingTransformTranslators.java>:
Recompile with -Xlint:deprecation for details.
2017-05-31T18:32:26.906 [INFO] <https://builds.apache.org/job/beam_PostCommit_Java_MavenInstall/ws/runners/flink/src/main/java/org/apache/beam/runners/flink/translation/wrappers/streaming/state/FlinkKeyGroupStateInternals.java>:
Some input files use unchecked or unsafe operations.
2017-05-31T18:32:26.906 [INFO] <https://builds.apache.org/job/beam_PostCommit_Java_MavenInstall/ws/runners/flink/src/main/java/org/apache/beam/runners/flink/translation/wrappers/streaming/state/FlinkKeyGroupStateInternals.java>:
Recompile with -Xlint:unchecked for details.
2017-05-31T18:32:26.999 [INFO] 
2017-05-31T18:32:26.999 [INFO] --- maven-resources-plugin:3.0.2:testResources (default-testResources)
@ beam-runners-flink_2.10 ---
2017-05-31T18:32:27.001 [INFO] Using 'UTF-8' encoding to copy filtered resources.
2017-05-31T18:32:27.003 [INFO] Copying 1 resource
2017-05-31T18:32:27.021 [INFO] Copying 3 resources
2017-05-31T18:32:27.114 [INFO] 
2017-05-31T18:32:27.115 [INFO] --- maven-compiler-plugin:3.6.1:testCompile (default-testCompile)
@ beam-runners-flink_2.10 ---
2017-05-31T18:32:27.142 [INFO] Changes detected - recompiling the module!
2017-05-31T18:32:27.143 [INFO] Compiling 17 source files to <https://builds.apache.org/job/beam_PostCommit_Java_MavenInstall/ws/runners/flink/target/test-classes>
2017-05-31T18:32:27.736 [INFO] <https://builds.apache.org/job/beam_PostCommit_Java_MavenInstall/ws/runners/flink/src/test/java/org/apache/beam/runners/flink/streaming/FlinkKeyGroupStateInternalsTest.java>:
Some input files use unchecked or unsafe operations.
2017-05-31T18:32:27.736 [INFO] <https://builds.apache.org/job/beam_PostCommit_Java_MavenInstall/ws/runners/flink/src/test/java/org/apache/beam/runners/flink/streaming/FlinkKeyGroupStateInternalsTest.java>:
Recompile with -Xlint:unchecked for details.
2017-05-31T18:32:27.787 [INFO] 
2017-05-31T18:32:27.788 [INFO] --- maven-checkstyle-plugin:2.17:check (default) @ beam-runners-flink_2.10
---
2017-05-31T18:32:29.078 [INFO] Starting audit...
Audit done.
2017-05-31T18:32:29.164 [INFO] 
2017-05-31T18:32:29.164 [INFO] >>> findbugs-maven-plugin:3.0.4:check (default) >
:findbugs @ beam-runners-flink_2.10 >>>
2017-05-31T18:32:29.185 [INFO] 
2017-05-31T18:32:29.186 [INFO] --- findbugs-maven-plugin:3.0.4:findbugs (findbugs) @ beam-runners-flink_2.10
---
2017-05-31T18:32:29.191 [INFO] Fork Value is true
     [java] Warnings generated: 2
2017-05-31T18:32:48.668 [INFO] Done FindBugs Analysis....
2017-05-31T18:32:48.912 [INFO] 
2017-05-31T18:32:48.912 [INFO] <<< findbugs-maven-plugin:3.0.4:check (default) <
:findbugs @ beam-runners-flink_2.10 <<<
2017-05-31T18:32:48.912 [INFO] 
2017-05-31T18:32:48.912 [INFO] --- findbugs-maven-plugin:3.0.4:check (default) @ beam-runners-flink_2.10
---
2017-05-31T18:32:48.928 [INFO] BugInstance size is 2
2017-05-31T18:32:48.928 [INFO] Error size is 0
2017-05-31T18:32:48.933 [INFO] Total bugs: 2
2017-05-31T18:32:48.943 [INFO] Possible null pointer dereference of FlinkDoFnFunction.outputMap
in org.apache.beam.runners.flink.translation.functions.FlinkDoFnFunction.mapPartition(Iterable,
Collector) [org.apache.beam.runners.flink.translation.functions.FlinkDoFnFunction, org.apache.beam.runners.flink.translation.functions.FlinkDoFnFunction,
org.apache.beam.runners.flink.translation.functions.FlinkDoFnFunction] Dereferenced at FlinkDoFnFunction.java:[line
101]Null value at FlinkDoFnFunction.java:[line 93]Known null at FlinkDoFnFunction.java:[line
94] NP_NULL_ON_SOME_PATH
2017-05-31T18:32:48.943 [INFO] Possible null pointer dereference of FlinkStatefulDoFnFunction.outputMap
in org.apache.beam.runners.flink.translation.functions.FlinkStatefulDoFnFunction.reduce(Iterable,
Collector) [org.apache.beam.runners.flink.translation.functions.FlinkStatefulDoFnFunction,
org.apache.beam.runners.flink.translation.functions.FlinkStatefulDoFnFunction, org.apache.beam.runners.flink.translation.functions.FlinkStatefulDoFnFunction]
Dereferenced at FlinkStatefulDoFnFunction.java:[line 118]Null value at FlinkStatefulDoFnFunction.java:[line
94]Known null at FlinkStatefulDoFnFunction.java:[line 95] NP_NULL_ON_SOME_PATH
2017-05-31T18:32:48.943 [INFO] 


To see bug detail using the Findbugs GUI, use the following command "mvn findbugs:gui"



[JENKINS] Archiving disabled
2017-05-31T18:32:51.501 [INFO]                                                           
             
2017-05-31T18:32:51.501 [INFO] ------------------------------------------------------------------------
2017-05-31T18:32:51.501 [INFO] Skipping Apache Beam :: Parent
2017-05-31T18:32:51.501 [INFO] This project has been banned from the build due to previous
failures.
2017-05-31T18:32:51.501 [INFO] ------------------------------------------------------------------------
[JENKINS] Archiving disabled
[JENKINS] Archiving disabled
[JENKINS] Archiving disabled
[JENKINS] Archiving disabled
[JENKINS] Archiving disabled
[JENKINS] Archiving disabled
[JENKINS] Archiving disabled
[JENKINS] Archiving disabled
[JENKINS] Archiving disabled
[JENKINS] Archiving disabled
[JENKINS] Archiving disabled
[JENKINS] Archiving disabled
[JENKINS] Archiving disabled
[JENKINS] Archiving disabled
[JENKINS] Archiving disabled
[JENKINS] Archiving disabled
[JENKINS] Archiving disabled
[JENKINS] Archiving disabled
[JENKINS] Archiving disabled
[JENKINS] Archiving disabled
[JENKINS] Archiving disabled
[JENKINS] Archiving disabled
[JENKINS] Archiving disabled
[JENKINS] Archiving disabled
[JENKINS] Archiving disabled
[JENKINS] Archiving disabled
[JENKINS] Archiving disabled
[JENKINS] Archiving disabled
[JENKINS] Archiving disabled
[JENKINS] Archiving disabled
[JENKINS] Archiving disabled
[JENKINS] Archiving disabled
[JENKINS] Archiving disabled
[JENKINS] Archiving disabled
[JENKINS] Archiving disabled
[JENKINS] Archiving disabled
[JENKINS] Archiving disabled
[JENKINS] Archiving disabled
[JENKINS] Archiving disabled
[JENKINS] Archiving disabled
[JENKINS] Archiving disabled
[JENKINS] Archiving disabled
[JENKINS] Archiving disabled
[JENKINS] Archiving disabled
[JENKINS] Archiving disabled
[JENKINS] Archiving disabled
2017-05-31T18:33:13.274 [INFO] ------------------------------------------------------------------------
2017-05-31T18:33:13.274 [INFO] Reactor Summary:
2017-05-31T18:33:13.274 [INFO] 
2017-05-31T18:33:13.274 [INFO] Apache Beam :: Parent .............................. SUCCESS
[ 34.650 s]
2017-05-31T18:33:13.275 [INFO] Apache Beam :: SDKs :: Java :: Build Tools ......... SUCCESS
[ 13.668 s]
2017-05-31T18:33:13.275 [INFO] Apache Beam :: SDKs ................................ SUCCESS
[ 11.992 s]
2017-05-31T18:33:13.275 [INFO] Apache Beam :: SDKs :: Common ...................... SUCCESS
[  3.444 s]
2017-05-31T18:33:13.275 [INFO] Apache Beam :: SDKs :: Common :: Fn API ............ SUCCESS
[ 20.635 s]
2017-05-31T18:33:13.275 [INFO] Apache Beam :: SDKs :: Common :: Runner API ........ SUCCESS
[ 14.825 s]
2017-05-31T18:33:13.275 [INFO] Apache Beam :: SDKs :: Java ........................ SUCCESS
[ 13.448 s]
2017-05-31T18:33:13.275 [INFO] Apache Beam :: SDKs :: Java :: Core ................ SUCCESS
[02:37 min]
2017-05-31T18:33:13.275 [INFO] Apache Beam :: SDKs :: Java :: IO .................. SUCCESS
[  6.385 s]
2017-05-31T18:33:13.275 [INFO] Apache Beam :: SDKs :: Java :: IO :: Common ........ SUCCESS
[  5.296 s]
2017-05-31T18:33:13.275 [INFO] Apache Beam :: Runners ............................. SUCCESS
[  2.997 s]
2017-05-31T18:33:13.275 [INFO] Apache Beam :: Runners :: Core Construction Java ... SUCCESS
[ 37.269 s]
2017-05-31T18:33:13.275 [INFO] Apache Beam :: Runners :: Core Java ................ SUCCESS
[ 45.530 s]
2017-05-31T18:33:13.275 [INFO] Apache Beam :: Runners :: Direct Java .............. SUCCESS
[03:57 min]
2017-05-31T18:33:13.275 [INFO] Apache Beam :: SDKs :: Java :: IO :: Elasticsearch . SUCCESS
[ 56.176 s]
2017-05-31T18:33:13.275 [INFO] Apache Beam :: SDKs :: Java :: Extensions .......... SUCCESS
[ 10.542 s]
2017-05-31T18:33:13.275 [INFO] Apache Beam :: SDKs :: Java :: Extensions :: Google Cloud Platform
Core SUCCESS [01:00 min]
2017-05-31T18:33:13.275 [INFO] Apache Beam :: SDKs :: Java :: Extensions :: Protobuf SUCCESS
[ 31.385 s]
2017-05-31T18:33:13.275 [INFO] Apache Beam :: SDKs :: Java :: IO :: Google Cloud Platform
SUCCESS [01:45 min]
2017-05-31T18:33:13.275 [INFO] Apache Beam :: SDKs :: Java :: IO :: Hadoop Common . SUCCESS
[ 40.306 s]
2017-05-31T18:33:13.275 [INFO] Apache Beam :: SDKs :: Java :: IO :: Hadoop File System SUCCESS
[ 43.556 s]
2017-05-31T18:33:13.275 [INFO] Apache Beam :: SDKs :: Java :: IO :: Hadoop ........ SUCCESS
[ 11.370 s]
2017-05-31T18:33:13.276 [INFO] Apache Beam :: SDKs :: Java :: IO :: Hadoop :: input-format
SUCCESS [ 24.708 s]
2017-05-31T18:33:13.276 [INFO] Apache Beam :: Runners :: Google Cloud Dataflow .... SUCCESS
[05:50 min]
2017-05-31T18:33:13.276 [INFO] Apache Beam :: SDKs :: Java :: IO :: Hadoop :: jdk1.8-tests
SUCCESS [01:35 min]
2017-05-31T18:33:13.276 [INFO] Apache Beam :: SDKs :: Java :: IO :: HBase ......... SUCCESS
[01:18 min]
2017-05-31T18:33:13.276 [INFO] Apache Beam :: SDKs :: Java :: IO :: JDBC .......... SUCCESS
[ 37.279 s]
2017-05-31T18:33:13.276 [INFO] Apache Beam :: SDKs :: Java :: IO :: JMS ........... SUCCESS
[ 30.674 s]
2017-05-31T18:33:13.276 [INFO] Apache Beam :: SDKs :: Java :: IO :: Kafka ......... SUCCESS
[ 41.604 s]
2017-05-31T18:33:13.276 [INFO] Apache Beam :: SDKs :: Java :: IO :: Kinesis ....... SUCCESS
[ 35.380 s]
2017-05-31T18:33:13.276 [INFO] Apache Beam :: SDKs :: Java :: IO :: MongoDB ....... SUCCESS
[ 46.579 s]
2017-05-31T18:33:13.276 [INFO] Apache Beam :: SDKs :: Java :: IO :: MQTT .......... SUCCESS
[ 37.815 s]
2017-05-31T18:33:13.276 [INFO] Apache Beam :: SDKs :: Java :: IO :: XML ........... SUCCESS
[ 45.277 s]
2017-05-31T18:33:13.276 [INFO] Apache Beam :: SDKs :: Java :: Maven Archetypes .... SUCCESS
[  2.372 s]
2017-05-31T18:33:13.276 [INFO] Apache Beam :: SDKs :: Java :: Maven Archetypes :: Starter
SUCCESS [ 16.735 s]
2017-05-31T18:33:13.276 [INFO] Apache Beam :: Examples ............................ SUCCESS
[  2.835 s]
2017-05-31T18:33:13.276 [INFO] Apache Beam :: Examples :: Java .................... SUCCESS
[09:11 min]
2017-05-31T18:33:13.276 [INFO] Apache Beam :: SDKs :: Java :: Maven Archetypes :: Examples
SUCCESS [ 48.302 s]
2017-05-31T18:33:13.276 [INFO] Apache Beam :: Examples :: Java 8 .................. SUCCESS
[ 31.297 s]
2017-05-31T18:33:13.276 [INFO] Apache Beam :: SDKs :: Java :: Maven Archetypes :: Examples
- Java 8 SUCCESS [ 44.728 s]
2017-05-31T18:33:13.276 [INFO] Apache Beam :: SDKs :: Java :: Extensions :: Jackson SUCCESS
[ 30.404 s]
2017-05-31T18:33:13.276 [INFO] Apache Beam :: SDKs :: Java :: Extensions :: Join library SUCCESS
[ 29.592 s]
2017-05-31T18:33:13.276 [INFO] Apache Beam :: SDKs :: Java :: Extensions :: Sorter  SUCCESS
[01:11 min]
2017-05-31T18:33:13.276 [INFO] Apache Beam :: SDKs :: Java :: Harness ............. SUCCESS
[ 38.647 s]
2017-05-31T18:33:13.276 [INFO] Apache Beam :: SDKs :: Java :: Java 8 Tests ........ SUCCESS
[ 13.423 s]
2017-05-31T18:33:13.276 [INFO] Apache Beam :: SDKs :: Python ...................... SUCCESS
[29:12 min]
2017-05-31T18:33:13.276 [INFO] Apache Beam :: Runners :: Flink .................... FAILURE
[ 33.745 s]
2017-05-31T18:33:13.276 [INFO] Apache Beam :: Runners :: Spark .................... SKIPPED
2017-05-31T18:33:13.276 [INFO] Apache Beam :: Runners :: Apex ..................... SKIPPED
2017-05-31T18:33:13.276 [INFO] Apache Beam :: SDKs :: Java :: Aggregated Javadoc .. SKIPPED
2017-05-31T18:33:13.276 [INFO] ------------------------------------------------------------------------
2017-05-31T18:33:13.276 [INFO] BUILD FAILURE
2017-05-31T18:33:13.276 [INFO] ------------------------------------------------------------------------
2017-05-31T18:33:13.276 [INFO] Total time: 01:18 h
2017-05-31T18:33:13.276 [INFO] Finished at: 2017-05-31T18:33:13+00:00
2017-05-31T18:33:14.245 [INFO] Final Memory: 254M/2129M
2017-05-31T18:33:14.245 [INFO] ------------------------------------------------------------------------
Waiting for Jenkins to finish collecting data
2017-05-31T18:33:47.148 [ERROR] Failed to execute goal org.codehaus.mojo:findbugs-maven-plugin:3.0.4:check
(default) on project beam-runners-flink_2.10: failed with 2 bugs and 0 errors -> [Help
1]
org.apache.maven.lifecycle.LifecycleExecutionException: Failed to execute goal org.codehaus.mojo:findbugs-maven-plugin:3.0.4:check
(default) on project beam-runners-flink_2.10: failed with 2 bugs and 0 errors 
	at org.apache.maven.lifecycle.internal.MojoExecutor.execute(MojoExecutor.java:216)
	at org.apache.maven.lifecycle.internal.MojoExecutor.execute(MojoExecutor.java:153)
	at org.apache.maven.lifecycle.internal.MojoExecutor.execute(MojoExecutor.java:145)
	at org.apache.maven.lifecycle.internal.LifecycleModuleBuilder.buildProject(LifecycleModuleBuilder.java:116)
	at org.apache.maven.lifecycle.internal.LifecycleModuleBuilder.buildProject(LifecycleModuleBuilder.java:80)
	at org.apache.maven.lifecycle.internal.builder.singlethreaded.SingleThreadedBuilder.build(SingleThreadedBuilder.java:51)
	at org.apache.maven.lifecycle.internal.LifecycleStarter.execute(LifecycleStarter.java:128)
	at org.apache.maven.DefaultMaven.doExecute(DefaultMaven.java:307)
	at org.apache.maven.DefaultMaven.doExecute(DefaultMaven.java:193)
	at org.apache.maven.DefaultMaven.execute(DefaultMaven.java:106)
	at org.jvnet.hudson.maven3.launcher.Maven33Launcher.main(Maven33Launcher.java:129)
	at sun.reflect.NativeMethodAccessorImpl.invoke0(Native Method)
	at sun.reflect.NativeMethodAccessorImpl.invoke(NativeMethodAccessorImpl.java:62)
	at sun.reflect.DelegatingMethodAccessorImpl.invoke(DelegatingMethodAccessorImpl.java:43)
	at java.lang.reflect.Method.invoke(Method.java:498)
	at org.codehaus.plexus.classworlds.launcher.Launcher.launchStandard(Launcher.java:330)
	at org.codehaus.plexus.classworlds.launcher.Launcher.launch(Launcher.java:238)
	at jenkins.maven3.agent.Maven33Main.launch(Maven33Main.java:176)
	at sun.reflect.NativeMethodAccessorImpl.invoke0(Native Method)
	at sun.reflect.NativeMethodAccessorImpl.invoke(NativeMethodAccessorImpl.java:62)
	at sun.reflect.DelegatingMethodAccessorImpl.invoke(DelegatingMethodAccessorImpl.java:43)
	at java.lang.reflect.Method.invoke(Method.java:498)
	at hudson.maven.Maven3Builder.call(Maven3Builder.java:139)
	at hudson.maven.Maven3Builder.call(Maven3Builder.java:70)
	at hudson.remoting.UserRequest.perform(UserRequest.java:153)
	at hudson.remoting.UserRequest.perform(UserRequest.java:50)
	at hudson.remoting.Request$2.run(Request.java:336)
	at hudson.remoting.InterceptingExecutorService$1.call(InterceptingExecutorService.java:68)
	at java.util.concurrent.FutureTask.run(FutureTask.java:266)
	at java.util.concurrent.ThreadPoolExecutor.runWorker(ThreadPoolExecutor.java:1142)
	at java.util.concurrent.ThreadPoolExecutor$Worker.run(ThreadPoolExecutor.java:617)
	at java.lang.Thread.run(Thread.java:745)
Caused by: org.apache.maven.plugin.MojoExecutionException: failed with 2 bugs and 0 errors

	at sun.reflect.NativeConstructorAccessorImpl.newInstance0(Native Method)
	at sun.reflect.NativeConstructorAccessorImpl.newInstance(NativeConstructorAccessorImpl.java:62)
	at sun.reflect.DelegatingConstructorAccessorImpl.newInstance(DelegatingConstructorAccessorImpl.java:45)
	at java.lang.reflect.Constructor.newInstance(Constructor.java:423)
	at org.codehaus.groovy.reflection.CachedConstructor.invoke(CachedConstructor.java:83)
	at org.codehaus.groovy.reflection.CachedConstructor.doConstructorInvoke(CachedConstructor.java:77)
	at org.codehaus.groovy.runtime.callsite.ConstructorSite$ConstructorSiteNoUnwrap.callConstructor(ConstructorSite.java:84)
	at org.codehaus.groovy.runtime.callsite.CallSiteArray.defaultCallConstructor(CallSiteArray.java:60)
	at org.codehaus.groovy.runtime.callsite.AbstractCallSite.callConstructor(AbstractCallSite.java:235)
	at org.codehaus.groovy.runtime.callsite.AbstractCallSite.callConstructor(AbstractCallSite.java:247)
	at org.codehaus.mojo.findbugs.FindbugsViolationCheckMojo.execute(FindbugsViolationCheckMojo.groovy:529)
	at org.apache.maven.plugin.DefaultBuildPluginManager.executeMojo(DefaultBuildPluginManager.java:134)
	at org.apache.maven.lifecycle.internal.MojoExecutor.execute(MojoExecutor.java:208)
	... 31 more
2017-05-31T18:33:47.149 [ERROR] 
2017-05-31T18:33:47.149 [ERROR] Re-run Maven using the -X switch to enable full debug logging.
2017-05-31T18:33:47.149 [ERROR] 
2017-05-31T18:33:47.149 [ERROR] For more information about the errors and possible solutions,
please read the following articles:
2017-05-31T18:33:47.149 [ERROR] [Help 1] http://cwiki.apache.org/confluence/display/MAVEN/MojoExecutionException
2017-05-31T18:33:47.150 [ERROR] 
2017-05-31T18:33:47.150 [ERROR] After correcting the problems, you can resume the build with
the command
2017-05-31T18:33:47.150 [ERROR]   mvn <goals> -rf :beam-runners-flink_2.10
channel stopped
Not sending mail to unregistered user kirpichov@google.com
Not sending mail to unregistered user aljoscha.krettek@gmail.com

Mime
View raw message