beam-commits mailing list archives

Site index · List index
Message view « Date » · « Thread »
Top « Date » · « Thread »
From Apache Jenkins Server <jenk...@builds.apache.org>
Subject Build failed in Jenkins: beam_PostCommit_Java_JDK_Versions_Test » JDK 1.8 (latest),beam #1
Date Tue, 02 May 2017 23:33:59 GMT
See <https://builds.apache.org/job/beam_PostCommit_Java_JDK_Versions_Test/jdk=JDK%201.8%20(latest),label=beam/1/display/redirect>

------------------------------------------
[...truncated 1.20 MB...]
2017-05-02\T\23:33:55.238 [INFO] 2017-05-02\T\23:33:55.237 [INFO] Downloading: https://repo.maven.apache.org/maven2/org/apache/maven/maven-profile/2.0.9/maven-profile-2.0.9.pom
2017-05-02\T\23:33:55.271 [INFO] 2017-05-02\T\23:33:55.271 [INFO] Downloaded: https://repo.maven.apache.org/maven2/org/apache/maven/maven-profile/2.0.9/maven-profile-2.0.9.pom
(3 KB at 58.9 KB/sec)
2017-05-02\T\23:33:55.275 [INFO] 2017-05-02\T\23:33:55.275 [INFO] Downloading: https://repo.maven.apache.org/maven2/org/apache/maven/maven-artifact-manager/2.0.9/maven-artifact-manager-2.0.9.pom
2017-05-02\T\23:33:55.303 [INFO] 2017-05-02\T\23:33:55.303 [INFO] Downloaded: https://repo.maven.apache.org/maven2/org/apache/maven/maven-artifact-manager/2.0.9/maven-artifact-manager-2.0.9.pom
(3 KB at 94.2 KB/sec)
2017-05-02\T\23:33:55.307 [INFO] 2017-05-02\T\23:33:55.307 [INFO] Downloading: https://repo.maven.apache.org/maven2/org/apache/maven/maven-repository-metadata/2.0.9/maven-repository-metadata-2.0.9.pom
2017-05-02\T\23:33:55.334 [INFO] 2017-05-02\T\23:33:55.334 [INFO] Downloaded: https://repo.maven.apache.org/maven2/org/apache/maven/maven-repository-metadata/2.0.9/maven-repository-metadata-2.0.9.pom
(2 KB at 68.8 KB/sec)
2017-05-02\T\23:33:55.337 [INFO] 2017-05-02\T\23:33:55.337 [INFO] Downloading: https://repo.maven.apache.org/maven2/org/apache/maven/maven-plugin-registry/2.0.9/maven-plugin-registry-2.0.9.pom
2017-05-02\T\23:33:55.364 [INFO] 2017-05-02\T\23:33:55.363 [INFO] Downloaded: https://repo.maven.apache.org/maven2/org/apache/maven/maven-plugin-registry/2.0.9/maven-plugin-registry-2.0.9.pom
(2 KB at 74.0 KB/sec)
2017-05-02\T\23:33:55.368 [INFO] 2017-05-02\T\23:33:55.368 [INFO] Downloading: https://repo.maven.apache.org/maven2/org/apache/maven/maven-core/2.0.9/maven-core-2.0.9.pom
2017-05-02\T\23:33:55.399 [INFO] 2017-05-02\T\23:33:55.398 [INFO] Downloaded: https://repo.maven.apache.org/maven2/org/apache/maven/maven-core/2.0.9/maven-core-2.0.9.pom
(8 KB at 253.4 KB/sec)
2017-05-02\T\23:33:55.404 [INFO] 2017-05-02\T\23:33:55.402 [INFO] Downloading: https://repo.maven.apache.org/maven2/org/apache/maven/maven-plugin-parameter-documenter/2.0.9/maven-plugin-parameter-documenter-2.0.9.pom
2017-05-02\T\23:33:55.430 [INFO] 2017-05-02\T\23:33:55.429 [INFO] Downloaded: https://repo.maven.apache.org/maven2/org/apache/maven/maven-plugin-parameter-documenter/2.0.9/maven-plugin-parameter-documenter-2.0.9.pom
(2 KB at 71.0 KB/sec)
2017-05-02\T\23:33:55.435 [INFO] 2017-05-02\T\23:33:55.435 [INFO] Downloading: https://repo.maven.apache.org/maven2/org/apache/maven/reporting/maven-reporting-api/2.0.9/maven-reporting-api-2.0.9.pom
2017-05-02\T\23:33:55.462 [INFO] 2017-05-02\T\23:33:55.462 [INFO] Downloaded: https://repo.maven.apache.org/maven2/org/apache/maven/reporting/maven-reporting-api/2.0.9/maven-reporting-api-2.0.9.pom
(2 KB at 65.2 KB/sec)
2017-05-02\T\23:33:55.465 [INFO] 2017-05-02\T\23:33:55.465 [INFO] Downloading: https://repo.maven.apache.org/maven2/org/apache/maven/reporting/maven-reporting/2.0.9/maven-reporting-2.0.9.pom
2017-05-02\T\23:33:55.492 [INFO] 2017-05-02\T\23:33:55.492 [INFO] Downloaded: https://repo.maven.apache.org/maven2/org/apache/maven/reporting/maven-reporting/2.0.9/maven-reporting-2.0.9.pom
(2 KB at 53.4 KB/sec)
2017-05-02\T\23:33:55.497 [INFO] 2017-05-02\T\23:33:55.497 [INFO] Downloading: https://repo.maven.apache.org/maven2/org/apache/maven/maven-error-diagnostics/2.0.9/maven-error-diagnostics-2.0.9.pom
2017-05-02\T\23:33:55.525 [INFO] 2017-05-02\T\23:33:55.525 [INFO] Downloaded: https://repo.maven.apache.org/maven2/org/apache/maven/maven-error-diagnostics/2.0.9/maven-error-diagnostics-2.0.9.pom
(2 KB at 60.8 KB/sec)
2017-05-02\T\23:33:55.530 [INFO] 2017-05-02\T\23:33:55.530 [INFO] Downloading: https://repo.maven.apache.org/maven2/org/apache/maven/maven-plugin-descriptor/2.0.9/maven-plugin-descriptor-2.0.9.pom
2017-05-02\T\23:33:55.558 [INFO] 2017-05-02\T\23:33:55.558 [INFO] Downloaded: https://repo.maven.apache.org/maven2/org/apache/maven/maven-plugin-descriptor/2.0.9/maven-plugin-descriptor-2.0.9.pom
(3 KB at 72.4 KB/sec)
2017-05-02\T\23:33:55.563 [INFO] 2017-05-02\T\23:33:55.563 [INFO] Downloading: https://repo.maven.apache.org/maven2/org/apache/maven/maven-monitor/2.0.9/maven-monitor-2.0.9.pom
2017-05-02\T\23:33:55.594 [INFO] 2017-05-02\T\23:33:55.591 [INFO] Downloaded: https://repo.maven.apache.org/maven2/org/apache/maven/maven-monitor/2.0.9/maven-monitor-2.0.9.pom
(2 KB at 44.8 KB/sec)
2017-05-02\T\23:33:55.596 [INFO] 2017-05-02\T\23:33:55.596 [INFO] Downloading: https://repo.maven.apache.org/maven2/org/apache/maven/maven-toolchain/2.0.9/maven-toolchain-2.0.9.pom
2017-05-02\T\23:33:55.627 [INFO] 2017-05-02\T\23:33:55.627 [INFO] Downloaded: https://repo.maven.apache.org/maven2/org/apache/maven/maven-toolchain/2.0.9/maven-toolchain-2.0.9.pom
(4 KB at 109.5 KB/sec)
2017-05-02\T\23:33:55.637 [INFO] 2017-05-02\T\23:33:55.637 [INFO] Downloading: https://repo.maven.apache.org/maven2/org/apache/maven/shared/maven-common-artifact-filters/1.3/maven-common-artifact-filters-1.3.pom
2017-05-02\T\23:33:55.667 [INFO] 2017-05-02\T\23:33:55.667 [INFO] Downloaded: https://repo.maven.apache.org/maven2/org/apache/maven/shared/maven-common-artifact-filters/1.3/maven-common-artifact-filters-1.3.pom
(4 KB at 120.5 KB/sec)
2017-05-02\T\23:33:55.678 [INFO] 2017-05-02\T\23:33:55.678 [INFO] Downloading: https://repo.maven.apache.org/maven2/org/apache/maven/maven-plugin-api/2.0.9/maven-plugin-api-2.0.9.jar
2017-05-02\T\23:33:55.679 [INFO] 2017-05-02\T\23:33:55.679 [INFO] Downloading: https://repo.maven.apache.org/maven2/org/apache/maven/surefire/surefire-booter/2.12.4/surefire-booter-2.12.4.jar
2017-05-02\T\23:33:55.679 [INFO] 2017-05-02\T\23:33:55.679 [INFO] Downloading: https://repo.maven.apache.org/maven2/org/apache/maven/surefire/surefire-api/2.12.4/surefire-api-2.12.4.jar
2017-05-02\T\23:33:55.680 [INFO] 2017-05-02\T\23:33:55.680 [INFO] Downloading: https://repo.maven.apache.org/maven2/org/apache/maven/surefire/maven-surefire-common/2.12.4/maven-surefire-common-2.12.4.jar
2017-05-02\T\23:33:55.681 [INFO] 2017-05-02\T\23:33:55.681 [INFO] Downloading: https://repo.maven.apache.org/maven2/org/apache/maven/shared/maven-common-artifact-filters/1.3/maven-common-artifact-filters-1.3.jar
2017-05-02\T\23:33:55.715 [INFO] 2017-05-02\T\23:33:55.715 [INFO] Downloaded: https://repo.maven.apache.org/maven2/org/apache/maven/maven-plugin-api/2.0.9/maven-plugin-api-2.0.9.jar
(13 KB at 340.3 KB/sec)
2017-05-02\T\23:33:55.715 [INFO] 2017-05-02\T\23:33:55.715 [INFO] Downloading: https://repo.maven.apache.org/maven2/org/codehaus/plexus/plexus-utils/3.0.8/plexus-utils-3.0.8.jar
2017-05-02\T\23:33:55.719 [INFO] 2017-05-02\T\23:33:55.719 [INFO] Downloaded: https://repo.maven.apache.org/maven2/org/apache/maven/surefire/surefire-booter/2.12.4/surefire-booter-2.12.4.jar
(34 KB at 826.1 KB/sec)
2017-05-02\T\23:33:55.719 [INFO] 2017-05-02\T\23:33:55.719 [INFO] Downloading: https://repo.maven.apache.org/maven2/org/apache/maven/maven-artifact/2.0.9/maven-artifact-2.0.9.jar
2017-05-02\T\23:33:55.721 [INFO] 2017-05-02\T\23:33:55.721 [INFO] Downloaded: https://repo.maven.apache.org/maven2/org/apache/maven/shared/maven-common-artifact-filters/1.3/maven-common-artifact-filters-1.3.jar
(31 KB at 758.3 KB/sec)
2017-05-02\T\23:33:55.721 [INFO] 2017-05-02\T\23:33:55.721 [INFO] Downloading: https://repo.maven.apache.org/maven2/org/apache/maven/maven-project/2.0.9/maven-project-2.0.9.jar
2017-05-02\T\23:33:55.738 [INFO] 2017-05-02\T\23:33:55.734 [INFO] Downloaded: https://repo.maven.apache.org/maven2/org/apache/maven/surefire/surefire-api/2.12.4/surefire-api-2.12.4.jar
(115 KB at 2050.5 KB/sec)
2017-05-02\T\23:33:55.738 [INFO] 2017-05-02\T\23:33:55.734 [INFO] Downloading: https://repo.maven.apache.org/maven2/org/apache/maven/maven-settings/2.0.9/maven-settings-2.0.9.jar
2017-05-02\T\23:33:55.763 [INFO] 2017-05-02\T\23:33:55.763 [INFO] Downloaded: https://repo.maven.apache.org/maven2/org/apache/maven/maven-project/2.0.9/maven-project-2.0.9.jar
(119 KB at 1450.3 KB/sec)
2017-05-02\T\23:33:55.763 [INFO] 2017-05-02\T\23:33:55.763 [INFO] Downloading: https://repo.maven.apache.org/maven2/org/apache/maven/maven-profile/2.0.9/maven-profile-2.0.9.jar
2017-05-02\T\23:33:55.769 [INFO] 2017-05-02\T\23:33:55.769 [INFO] Downloaded: https://repo.maven.apache.org/maven2/org/apache/maven/maven-settings/2.0.9/maven-settings-2.0.9.jar
(48 KB at 545.0 KB/sec)
2017-05-02\T\23:33:55.770 [INFO] 2017-05-02\T\23:33:55.769 [INFO] Downloading: https://repo.maven.apache.org/maven2/org/apache/maven/maven-artifact-manager/2.0.9/maven-artifact-manager-2.0.9.jar
2017-05-02\T\23:33:55.775 [INFO] 2017-05-02\T\23:33:55.775 [INFO] Downloaded: https://repo.maven.apache.org/maven2/org/apache/maven/maven-artifact/2.0.9/maven-artifact-2.0.9.jar
(87 KB at 933.6 KB/sec)
2017-05-02\T\23:33:55.775 [INFO] 2017-05-02\T\23:33:55.775 [INFO] Downloading: https://repo.maven.apache.org/maven2/org/apache/maven/maven-plugin-registry/2.0.9/maven-plugin-registry-2.0.9.jar
2017-05-02\T\23:33:55.783 [INFO] 2017-05-02\T\23:33:55.783 [INFO] Downloaded: https://repo.maven.apache.org/maven2/org/codehaus/plexus/plexus-utils/3.0.8/plexus-utils-3.0.8.jar
(227 KB at 2219.5 KB/sec)
2017-05-02\T\23:33:55.783 [INFO] 2017-05-02\T\23:33:55.783 [INFO] Downloading: https://repo.maven.apache.org/maven2/org/apache/maven/maven-core/2.0.9/maven-core-2.0.9.jar
2017-05-02\T\23:33:55.796 [INFO] 2017-05-02\T\23:33:55.796 [INFO] Downloaded: https://repo.maven.apache.org/maven2/org/apache/maven/surefire/maven-surefire-common/2.12.4/maven-surefire-common-2.12.4.jar
(257 KB at 2192.1 KB/sec)
2017-05-02\T\23:33:55.796 [INFO] 2017-05-02\T\23:33:55.796 [INFO] Downloading: https://repo.maven.apache.org/maven2/org/apache/maven/maven-plugin-parameter-documenter/2.0.9/maven-plugin-parameter-documenter-2.0.9.jar
2017-05-02\T\23:33:55.802 [INFO] 2017-05-02\T\23:33:55.802 [INFO] Downloaded: https://repo.maven.apache.org/maven2/org/apache/maven/maven-profile/2.0.9/maven-profile-2.0.9.jar
(35 KB at 287.8 KB/sec)
2017-05-02\T\23:33:55.802 [INFO] 2017-05-02\T\23:33:55.802 [INFO] Downloading: https://repo.maven.apache.org/maven2/org/apache/maven/reporting/maven-reporting-api/2.0.9/maven-reporting-api-2.0.9.jar
2017-05-02\T\23:33:55.808 [INFO] 2017-05-02\T\23:33:55.808 [INFO] Downloaded: https://repo.maven.apache.org/maven2/org/apache/maven/maven-artifact-manager/2.0.9/maven-artifact-manager-2.0.9.jar
(57 KB at 444.7 KB/sec)
2017-05-02\T\23:33:55.809 [INFO] 2017-05-02\T\23:33:55.809 [INFO] Downloading: https://repo.maven.apache.org/maven2/org/apache/maven/maven-repository-metadata/2.0.9/maven-repository-metadata-2.0.9.jar
2017-05-02\T\23:33:55.817 [INFO] 2017-05-02\T\23:33:55.817 [INFO] Downloaded: https://repo.maven.apache.org/maven2/org/apache/maven/maven-plugin-registry/2.0.9/maven-plugin-registry-2.0.9.jar
(29 KB at 208.8 KB/sec)
2017-05-02\T\23:33:55.817 [INFO] 2017-05-02\T\23:33:55.817 [INFO] Downloading: https://repo.maven.apache.org/maven2/org/apache/maven/maven-error-diagnostics/2.0.9/maven-error-diagnostics-2.0.9.jar
2017-05-02\T\23:33:55.832 [INFO] 2017-05-02\T\23:33:55.832 [INFO] Downloaded: https://repo.maven.apache.org/maven2/org/apache/maven/maven-plugin-parameter-documenter/2.0.9/maven-plugin-parameter-documenter-2.0.9.jar
(21 KB at 135.0 KB/sec)
2017-05-02\T\23:33:55.832 [INFO] 2017-05-02\T\23:33:55.832 [INFO] Downloading: https://repo.maven.apache.org/maven2/org/apache/maven/maven-plugin-descriptor/2.0.9/maven-plugin-descriptor-2.0.9.jar
2017-05-02\T\23:33:55.832 [INFO] 2017-05-02\T\23:33:55.832 [INFO] Downloaded: https://repo.maven.apache.org/maven2/org/apache/maven/reporting/maven-reporting-api/2.0.9/maven-reporting-api-2.0.9.jar
(10 KB at 65.6 KB/sec)
2017-05-02\T\23:33:55.832 [INFO] 2017-05-02\T\23:33:55.832 [INFO] Downloading: https://repo.maven.apache.org/maven2/org/apache/maven/maven-monitor/2.0.9/maven-monitor-2.0.9.jar
2017-05-02\T\23:33:55.838 [INFO] 2017-05-02\T\23:33:55.838 [INFO] Downloaded: https://repo.maven.apache.org/maven2/org/apache/maven/maven-repository-metadata/2.0.9/maven-repository-metadata-2.0.9.jar
(24 KB at 152.8 KB/sec)
2017-05-02\T\23:33:55.838 [INFO] 2017-05-02\T\23:33:55.838 [INFO] Downloading: https://repo.maven.apache.org/maven2/org/apache/maven/maven-toolchain/2.0.9/maven-toolchain-2.0.9.jar
2017-05-02\T\23:33:55.840 [INFO] 2017-05-02\T\23:33:55.840 [INFO] Downloaded: https://repo.maven.apache.org/maven2/org/apache/maven/maven-core/2.0.9/maven-core-2.0.9.jar
(156 KB at 986.6 KB/sec)
2017-05-02\T\23:33:55.840 [INFO] 2017-05-02\T\23:33:55.840 [INFO] Downloading: https://repo.maven.apache.org/maven2/org/apache/maven/plugin-tools/maven-plugin-annotations/3.1/maven-plugin-annotations-3.1.jar
2017-05-02\T\23:33:55.847 [INFO] 2017-05-02\T\23:33:55.847 [INFO] Downloaded: https://repo.maven.apache.org/maven2/org/apache/maven/maven-error-diagnostics/2.0.9/maven-error-diagnostics-2.0.9.jar
(14 KB at 81.6 KB/sec)
2017-05-02\T\23:33:55.860 [INFO] 2017-05-02\T\23:33:55.860 [INFO] Downloaded: https://repo.maven.apache.org/maven2/org/apache/maven/maven-monitor/2.0.9/maven-monitor-2.0.9.jar
(11 KB at 56.1 KB/sec)
2017-05-02\T\23:33:55.873 [INFO] 2017-05-02\T\23:33:55.873 [INFO] Downloaded: https://repo.maven.apache.org/maven2/org/apache/maven/plugin-tools/maven-plugin-annotations/3.1/maven-plugin-annotations-3.1.jar
(14 KB at 71.7 KB/sec)
2017-05-02\T\23:33:55.877 [INFO] 2017-05-02\T\23:33:55.877 [INFO] Downloaded: https://repo.maven.apache.org/maven2/org/apache/maven/maven-toolchain/2.0.9/maven-toolchain-2.0.9.jar
(38 KB at 189.2 KB/sec)
2017-05-02\T\23:33:55.878 [INFO] 2017-05-02\T\23:33:55.878 [INFO] Downloaded: https://repo.maven.apache.org/maven2/org/apache/maven/maven-plugin-descriptor/2.0.9/maven-plugin-descriptor-2.0.9.jar
(37 KB at 183.6 KB/sec)
2017-05-02\T\23:33:55.934 [INFO] 2017-05-02\T\23:33:55.934 [INFO] No tests to run.
2017-05-02\T\23:33:55.940 [INFO] 2017-05-02\T\23:33:55.940 [INFO] 
2017-05-02\T\23:33:55.940 [INFO] 2017-05-02\T\23:33:55.940 [INFO] --- maven-jar-plugin:2.4:jar
(default-jar) @ basic ---
2017-05-02\T\23:33:55.966 [INFO] 2017-05-02\T\23:33:55.966 [INFO] Downloading: https://repo.maven.apache.org/maven2/org/codehaus/plexus/plexus-interpolation/1.15/plexus-interpolation-1.15.jar
2017-05-02\T\23:33:55.970 [INFO] 2017-05-02\T\23:33:55.970 [INFO] Downloading: https://repo.maven.apache.org/maven2/org/codehaus/plexus/plexus-archiver/2.1/plexus-archiver-2.1.jar
2017-05-02\T\23:33:55.970 [INFO] 2017-05-02\T\23:33:55.970 [INFO] Downloading: https://repo.maven.apache.org/maven2/org/codehaus/plexus/plexus-io/2.0.2/plexus-io-2.0.2.jar
2017-05-02\T\23:33:55.971 [INFO] 2017-05-02\T\23:33:55.971 [INFO] Downloading: https://repo.maven.apache.org/maven2/org/codehaus/plexus/plexus-utils/3.0/plexus-utils-3.0.jar
2017-05-02\T\23:33:56.009 [INFO] 2017-05-02\T\23:33:56.009 [INFO] Downloaded: https://repo.maven.apache.org/maven2/org/codehaus/plexus/plexus-io/2.0.2/plexus-io-2.0.2.jar
(57 KB at 1459.0 KB/sec)
2017-05-02\T\23:33:56.011 [INFO] 2017-05-02\T\23:33:56.011 [INFO] Downloaded: https://repo.maven.apache.org/maven2/org/codehaus/plexus/plexus-interpolation/1.15/plexus-interpolation-1.15.jar
(60 KB at 1312.4 KB/sec)
2017-05-02\T\23:33:56.037 [INFO] 2017-05-02\T\23:33:56.037 [INFO] Downloaded: https://repo.maven.apache.org/maven2/org/codehaus/plexus/plexus-archiver/2.1/plexus-archiver-2.1.jar
(181 KB at 2536.8 KB/sec)
2017-05-02\T\23:33:56.040 [INFO] 2017-05-02\T\23:33:56.040 [INFO] Downloaded: https://repo.maven.apache.org/maven2/org/codehaus/plexus/plexus-utils/3.0/plexus-utils-3.0.jar
(221 KB at 3153.9 KB/sec)
2017-05-02\T\23:33:56.162 [INFO] 2017-05-02\T\23:33:56.162 [INFO] Building jar: <https://builds.apache.org/job/beam_PostCommit_Java_JDK_Versions_Test/jdk=JDK%201.8%20(latest),label=beam/ws/sdks/java/maven-archetypes/starter/target/test-classes/projects/basic/project/basic/target/basic-0.1.jar>
2017-05-02\T\23:33:56.175 [INFO] 2017-05-02\T\23:33:56.175 [INFO] ------------------------------------------------------------------------
2017-05-02\T\23:33:56.175 [INFO] 2017-05-02\T\23:33:56.175 [INFO] BUILD SUCCESS
2017-05-02\T\23:33:56.176 [INFO] 2017-05-02\T\23:33:56.175 [INFO] ------------------------------------------------------------------------
2017-05-02\T\23:33:56.176 [INFO] 2017-05-02\T\23:33:56.176 [INFO] Total time: 4.215 s
2017-05-02\T\23:33:56.176 [INFO] 2017-05-02\T\23:33:56.176 [INFO] Finished at: 2017-05-02T23:33:56+00:00
2017-05-02\T\23:33:56.331 [INFO] 2017-05-02\T\23:33:56.331 [INFO] Final Memory: 24M/290M
2017-05-02\T\23:33:56.331 [INFO] 2017-05-02\T\23:33:56.331 [INFO] ------------------------------------------------------------------------
2017-05-02\T\23:33:56.349 [INFO] Post-archetype-generation invoker exit code: 0
2017-05-02\T\23:33:56.351 [INFO] 
2017-05-02\T\23:33:56.351 [INFO] --- maven-archetype-plugin:2.4:update-local-catalog (default-update-local-catalog)
@ beam-sdks-java-maven-archetypes-starter ---
2017-05-02\T\23:33:56.373 [INFO]                                                         
               
2017-05-02\T\23:33:56.373 [INFO] ------------------------------------------------------------------------
2017-05-02\T\23:33:56.373 [INFO] Building Apache Beam :: SDKs :: Java :: Maven Archetypes
:: Examples 0.7.0-SNAPSHOT
2017-05-02\T\23:33:56.373 [INFO] ------------------------------------------------------------------------
2017-05-02\T\23:33:56.374 [INFO] Downloading: https://repo.maven.apache.org/maven2/org/codehaus/mojo/exec-maven-plugin/1.5.0/exec-maven-plugin-1.5.0.pom
2017-05-02\T\23:33:56.404 [INFO] Downloaded: https://repo.maven.apache.org/maven2/org/codehaus/mojo/exec-maven-plugin/1.5.0/exec-maven-plugin-1.5.0.pom
(13 KB at 401.2 KB/sec)
2017-05-02\T\23:33:56.406 [INFO] Downloading: https://repo.maven.apache.org/maven2/org/codehaus/mojo/mojo-parent/38/mojo-parent-38.pom
2017-05-02\T\23:33:56.437 [INFO] Downloaded: https://repo.maven.apache.org/maven2/org/codehaus/mojo/mojo-parent/38/mojo-parent-38.pom
(33 KB at 1042.0 KB/sec)
2017-05-02\T\23:33:56.441 [INFO] Downloading: https://repo.maven.apache.org/maven2/org/codehaus/mojo/exec-maven-plugin/1.5.0/exec-maven-plugin-1.5.0.jar
2017-05-02\T\23:33:56.473 [INFO] Downloaded: https://repo.maven.apache.org/maven2/org/codehaus/mojo/exec-maven-plugin/1.5.0/exec-maven-plugin-1.5.0.jar
(53 KB at 1626.7 KB/sec)
2017-05-02\T\23:33:56.494 [INFO] 
2017-05-02\T\23:33:56.494 [INFO] --- maven-clean-plugin:3.0.0:clean (default-clean) @ beam-sdks-java-maven-archetypes-examples
---
2017-05-02\T\23:33:56.495 [INFO] Deleting <https://builds.apache.org/job/beam_PostCommit_Java_JDK_Versions_Test/jdk=JDK%201.8%20(latest),label=beam/ws/sdks/java/maven-archetypes/examples>
(includes = [**/*.pyc, **/*.egg-info/], excludes = [])
2017-05-02\T\23:33:56.496 [INFO] 
2017-05-02\T\23:33:56.496 [INFO] --- maven-enforcer-plugin:1.4.1:enforce (enforce) @ beam-sdks-java-maven-archetypes-examples
---
2017-05-02\T\23:33:57.595 [INFO] 
2017-05-02\T\23:33:57.595 [INFO] --- exec-maven-plugin:1.5.0:exec (generate-archetype-contents)
@ beam-sdks-java-maven-archetypes-examples ---
2017-05-02\T\23:33:57.599 [INFO] Downloading: https://repo.maven.apache.org/maven2/org/apache/maven/maven-toolchain/1.0/maven-toolchain-1.0.pom
2017-05-02\T\23:33:57.626 [INFO] Downloaded: https://repo.maven.apache.org/maven2/org/apache/maven/maven-toolchain/1.0/maven-toolchain-1.0.pom
(4 KB at 123.5 KB/sec)
2017-05-02\T\23:33:57.630 [INFO] Downloading: https://repo.maven.apache.org/maven2/org/apache/commons/commons-exec/1.3/commons-exec-1.3.pom
2017-05-02\T\23:33:57.658 [INFO] Downloaded: https://repo.maven.apache.org/maven2/org/apache/commons/commons-exec/1.3/commons-exec-1.3.pom
(11 KB at 383.4 KB/sec)
2017-05-02\T\23:33:57.666 [INFO] Downloading: https://repo.maven.apache.org/maven2/org/apache/maven/maven-toolchain/1.0/maven-toolchain-1.0.jar
2017-05-02\T\23:33:57.667 [INFO] Downloading: https://repo.maven.apache.org/maven2/org/apache/commons/commons-exec/1.3/commons-exec-1.3.jar
2017-05-02\T\23:33:57.699 [INFO] Downloaded: https://repo.maven.apache.org/maven2/org/apache/maven/maven-toolchain/1.0/maven-toolchain-1.0.jar
(33 KB at 973.9 KB/sec)
2017-05-02\T\23:33:57.700 [INFO] Downloaded: https://repo.maven.apache.org/maven2/org/apache/commons/commons-exec/1.3/commons-exec-1.3.jar
(54 KB at 1563.2 KB/sec)
rsync: change_dir "/home/jenkins/jenkins-slave/workspace/beam_PostCommit_Java_JDK_Versions_Test/jdk\#012.\#012(latest)/label/beam/sdks/java/maven-archetypes/examples/../../../../examples/java/src/main/java/org/apache/beam/examples"
failed: No such file or directory (2)
rsync error: some files/attrs were not transferred (see previous errors) (code 23) at main.c(1183)
[sender=3.1.0]
2017-05-02\T\23:33:57.959 [ERROR] Command execution failed.
org.apache.commons.exec.ExecuteException: Process exited with an error: 23 (Exit value: 23)
	at org.apache.commons.exec.DefaultExecutor.executeInternal(DefaultExecutor.java:404)
	at org.apache.commons.exec.DefaultExecutor.execute(DefaultExecutor.java:166)
	at org.codehaus.mojo.exec.ExecMojo.executeCommandLine(ExecMojo.java:764)
	at org.codehaus.mojo.exec.ExecMojo.executeCommandLine(ExecMojo.java:711)
	at org.codehaus.mojo.exec.ExecMojo.execute(ExecMojo.java:289)
	at org.apache.maven.plugin.DefaultBuildPluginManager.executeMojo(DefaultBuildPluginManager.java:134)
	at org.apache.maven.lifecycle.internal.MojoExecutor.execute(MojoExecutor.java:208)
	at org.apache.maven.lifecycle.internal.MojoExecutor.execute(MojoExecutor.java:153)
	at org.apache.maven.lifecycle.internal.MojoExecutor.execute(MojoExecutor.java:145)
	at org.apache.maven.lifecycle.internal.LifecycleModuleBuilder.buildProject(LifecycleModuleBuilder.java:116)
	at org.apache.maven.lifecycle.internal.LifecycleModuleBuilder.buildProject(LifecycleModuleBuilder.java:80)
	at org.apache.maven.lifecycle.internal.builder.singlethreaded.SingleThreadedBuilder.build(SingleThreadedBuilder.java:51)
	at org.apache.maven.lifecycle.internal.LifecycleStarter.execute(LifecycleStarter.java:128)
	at org.apache.maven.DefaultMaven.doExecute(DefaultMaven.java:307)
	at org.apache.maven.DefaultMaven.doExecute(DefaultMaven.java:193)
	at org.apache.maven.DefaultMaven.execute(DefaultMaven.java:106)
	at org.apache.maven.cli.MavenCli.execute(MavenCli.java:862)
	at org.apache.maven.cli.MavenCli.doMain(MavenCli.java:286)
	at org.apache.maven.cli.MavenCli.main(MavenCli.java:197)
	at sun.reflect.NativeMethodAccessorImpl.invoke0(Native Method)
	at sun.reflect.NativeMethodAccessorImpl.invoke(NativeMethodAccessorImpl.java:62)
	at sun.reflect.DelegatingMethodAccessorImpl.invoke(DelegatingMethodAccessorImpl.java:43)
	at java.lang.reflect.Method.invoke(Method.java:498)
	at org.codehaus.plexus.classworlds.launcher.Launcher.launchEnhanced(Launcher.java:289)
	at org.codehaus.plexus.classworlds.launcher.Launcher.launch(Launcher.java:229)
	at org.codehaus.plexus.classworlds.launcher.Launcher.mainWithExitCode(Launcher.java:415)
	at org.codehaus.plexus.classworlds.launcher.Launcher.main(Launcher.java:356)
2017-05-02\T\23:33:57.960 [INFO] ------------------------------------------------------------------------
2017-05-02\T\23:33:57.960 [INFO] Reactor Summary:
2017-05-02\T\23:33:57.960 [INFO] 
2017-05-02\T\23:33:57.960 [INFO] Apache Beam :: Parent .............................. SUCCESS
[ 22.661 s]
2017-05-02\T\23:33:57.960 [INFO] Apache Beam :: SDKs :: Java :: Build Tools ......... SUCCESS
[  9.060 s]
2017-05-02\T\23:33:57.960 [INFO] Apache Beam :: SDKs ................................ SUCCESS
[  0.659 s]
2017-05-02\T\23:33:57.961 [INFO] Apache Beam :: SDKs :: Common ...................... SUCCESS
[  0.521 s]
2017-05-02\T\23:33:57.961 [INFO] Apache Beam :: SDKs :: Common :: Fn API ............ SUCCESS
[ 10.465 s]
2017-05-02\T\23:33:57.961 [INFO] Apache Beam :: SDKs :: Common :: Runner API ........ SUCCESS
[  2.585 s]
2017-05-02\T\23:33:57.961 [INFO] Apache Beam :: SDKs :: Java ........................ SUCCESS
[  0.552 s]
2017-05-02\T\23:33:57.961 [INFO] Apache Beam :: SDKs :: Java :: Core ................ SUCCESS
[01:25 min]
2017-05-02\T\23:33:57.961 [INFO] Apache Beam :: SDKs :: Java :: IO .................. SUCCESS
[  0.546 s]
2017-05-02\T\23:33:57.961 [INFO] Apache Beam :: SDKs :: Java :: IO :: Common ........ SUCCESS
[  2.656 s]
2017-05-02\T\23:33:57.961 [INFO] Apache Beam :: Runners ............................. SUCCESS
[  0.562 s]
2017-05-02\T\23:33:57.961 [INFO] Apache Beam :: Runners :: Core Construction Java ... SUCCESS
[  9.577 s]
2017-05-02\T\23:33:57.961 [INFO] Apache Beam :: Runners :: Core Java ................ SUCCESS
[ 34.497 s]
2017-05-02\T\23:33:57.961 [INFO] Apache Beam :: Runners :: Direct Java .............. SUCCESS
[02:53 min]
2017-05-02\T\23:33:57.961 [INFO] Apache Beam :: SDKs :: Java :: IO :: Elasticsearch . SUCCESS
[ 27.245 s]
2017-05-02\T\23:33:57.961 [INFO] Apache Beam :: SDKs :: Java :: Extensions .......... SUCCESS
[  0.555 s]
2017-05-02\T\23:33:57.961 [INFO] Apache Beam :: SDKs :: Java :: Extensions :: Google Cloud
Platform Core SUCCESS [ 16.744 s]
2017-05-02\T\23:33:57.961 [INFO] Apache Beam :: SDKs :: Java :: Extensions :: Protobuf SUCCESS
[ 16.125 s]
2017-05-02\T\23:33:57.961 [INFO] Apache Beam :: SDKs :: Java :: IO :: Google Cloud Platform
SUCCESS [01:30 min]
2017-05-02\T\23:33:57.961 [INFO] Apache Beam :: SDKs :: Java :: IO :: Hadoop Common . SUCCESS
[ 15.935 s]
2017-05-02\T\23:33:57.961 [INFO] Apache Beam :: SDKs :: Java :: IO :: Hadoop File System SUCCESS
[ 25.358 s]
2017-05-02\T\23:33:57.961 [INFO] Apache Beam :: SDKs :: Java :: IO :: Hadoop ........ SUCCESS
[  3.170 s]
2017-05-02\T\23:33:57.961 [INFO] Apache Beam :: SDKs :: Java :: IO :: Hadoop :: input-format
SUCCESS [ 10.393 s]
2017-05-02\T\23:33:57.961 [INFO] Apache Beam :: Runners :: Google Cloud Dataflow .... SUCCESS
[ 32.706 s]
2017-05-02\T\23:33:57.961 [INFO] Apache Beam :: SDKs :: Java :: IO :: Hadoop :: jdk1.8-tests
SUCCESS [01:31 min]
2017-05-02\T\23:33:57.961 [INFO] Apache Beam :: SDKs :: Java :: IO :: HBase ......... SUCCESS
[01:07 min]
2017-05-02\T\23:33:57.961 [INFO] Apache Beam :: SDKs :: Java :: IO :: JDBC .......... SUCCESS
[ 17.439 s]
2017-05-02\T\23:33:57.961 [INFO] Apache Beam :: SDKs :: Java :: IO :: JMS ........... SUCCESS
[ 10.142 s]
2017-05-02\T\23:33:57.961 [INFO] Apache Beam :: SDKs :: Java :: IO :: Kafka ......... SUCCESS
[ 20.753 s]
2017-05-02\T\23:33:57.961 [INFO] Apache Beam :: SDKs :: Java :: IO :: Kinesis ....... SUCCESS
[ 14.116 s]
2017-05-02\T\23:33:57.961 [INFO] Apache Beam :: SDKs :: Java :: IO :: MongoDB ....... SUCCESS
[ 21.004 s]
2017-05-02\T\23:33:57.961 [INFO] Apache Beam :: SDKs :: Java :: IO :: MQTT .......... SUCCESS
[ 10.525 s]
2017-05-02\T\23:33:57.961 [INFO] Apache Beam :: SDKs :: Java :: IO :: XML ........... SUCCESS
[ 16.603 s]
2017-05-02\T\23:33:57.961 [INFO] Apache Beam :: SDKs :: Java :: Maven Archetypes .... SUCCESS
[  0.516 s]
2017-05-02\T\23:33:57.961 [INFO] Apache Beam :: SDKs :: Java :: Maven Archetypes :: Starter
SUCCESS [ 12.047 s]
2017-05-02\T\23:33:57.961 [INFO] Apache Beam :: SDKs :: Java :: Maven Archetypes :: Examples
FAILURE [  1.587 s]
2017-05-02\T\23:33:57.961 [INFO] Apache Beam :: SDKs :: Java :: Maven Archetypes :: Examples
- Java 8 SKIPPED
2017-05-02\T\23:33:57.961 [INFO] Apache Beam :: SDKs :: Java :: Extensions :: Jackson SKIPPED
2017-05-02\T\23:33:57.961 [INFO] Apache Beam :: SDKs :: Java :: Extensions :: Join library
SKIPPED
2017-05-02\T\23:33:57.961 [INFO] Apache Beam :: SDKs :: Java :: Extensions :: Sorter  SKIPPED
2017-05-02\T\23:33:57.961 [INFO] Apache Beam :: SDKs :: Java :: Harness ............. SKIPPED
2017-05-02\T\23:33:57.961 [INFO] Apache Beam :: SDKs :: Java :: Java 8 Tests ........ SKIPPED
2017-05-02\T\23:33:57.961 [INFO] Apache Beam :: Runners :: Flink .................... SKIPPED
2017-05-02\T\23:33:57.961 [INFO] Apache Beam :: Runners :: Spark .................... SKIPPED
2017-05-02\T\23:33:57.961 [INFO] Apache Beam :: Runners :: Apex ..................... SKIPPED
2017-05-02\T\23:33:57.961 [INFO] Apache Beam :: Examples ............................ SKIPPED
2017-05-02\T\23:33:57.961 [INFO] Apache Beam :: Examples :: Java .................... SKIPPED
2017-05-02\T\23:33:57.961 [INFO] Apache Beam :: Examples :: Java 8 .................. SKIPPED
2017-05-02\T\23:33:57.962 [INFO] Apache Beam :: SDKs :: Java :: Aggregated Javadoc .. SKIPPED
2017-05-02\T\23:33:57.962 [INFO] ------------------------------------------------------------------------
2017-05-02\T\23:33:57.962 [INFO] BUILD FAILURE
2017-05-02\T\23:33:57.962 [INFO] ------------------------------------------------------------------------
2017-05-02\T\23:33:57.962 [INFO] Total time: 14:41 min
2017-05-02\T\23:33:57.962 [INFO] Finished at: 2017-05-02T23:33:57+00:00
2017-05-02\T\23:33:59.426 [INFO] Final Memory: 269M/2224M
2017-05-02\T\23:33:59.426 [INFO] ------------------------------------------------------------------------
2017-05-02\T\23:33:59.428 [ERROR] Failed to execute goal org.codehaus.mojo:exec-maven-plugin:1.5.0:exec
(generate-archetype-contents) on project beam-sdks-java-maven-archetypes-examples: Command
execution failed. Process exited with an error: 23 (Exit value: 23) -> [Help 1]
org.apache.maven.lifecycle.LifecycleExecutionException: Failed to execute goal org.codehaus.mojo:exec-maven-plugin:1.5.0:exec
(generate-archetype-contents) on project beam-sdks-java-maven-archetypes-examples: Command
execution failed.
	at org.apache.maven.lifecycle.internal.MojoExecutor.execute(MojoExecutor.java:216)
	at org.apache.maven.lifecycle.internal.MojoExecutor.execute(MojoExecutor.java:153)
	at org.apache.maven.lifecycle.internal.MojoExecutor.execute(MojoExecutor.java:145)
	at org.apache.maven.lifecycle.internal.LifecycleModuleBuilder.buildProject(LifecycleModuleBuilder.java:116)
	at org.apache.maven.lifecycle.internal.LifecycleModuleBuilder.buildProject(LifecycleModuleBuilder.java:80)
	at org.apache.maven.lifecycle.internal.builder.singlethreaded.SingleThreadedBuilder.build(SingleThreadedBuilder.java:51)
	at org.apache.maven.lifecycle.internal.LifecycleStarter.execute(LifecycleStarter.java:128)
	at org.apache.maven.DefaultMaven.doExecute(DefaultMaven.java:307)
	at org.apache.maven.DefaultMaven.doExecute(DefaultMaven.java:193)
	at org.apache.maven.DefaultMaven.execute(DefaultMaven.java:106)
	at org.apache.maven.cli.MavenCli.execute(MavenCli.java:862)
	at org.apache.maven.cli.MavenCli.doMain(MavenCli.java:286)
	at org.apache.maven.cli.MavenCli.main(MavenCli.java:197)
	at sun.reflect.NativeMethodAccessorImpl.invoke0(Native Method)
	at sun.reflect.NativeMethodAccessorImpl.invoke(NativeMethodAccessorImpl.java:62)
	at sun.reflect.DelegatingMethodAccessorImpl.invoke(DelegatingMethodAccessorImpl.java:43)
	at java.lang.reflect.Method.invoke(Method.java:498)
	at org.codehaus.plexus.classworlds.launcher.Launcher.launchEnhanced(Launcher.java:289)
	at org.codehaus.plexus.classworlds.launcher.Launcher.launch(Launcher.java:229)
	at org.codehaus.plexus.classworlds.launcher.Launcher.mainWithExitCode(Launcher.java:415)
	at org.codehaus.plexus.classworlds.launcher.Launcher.main(Launcher.java:356)
Caused by: org.apache.maven.plugin.MojoExecutionException: Command execution failed.
	at org.codehaus.mojo.exec.ExecMojo.execute(ExecMojo.java:302)
	at org.apache.maven.plugin.DefaultBuildPluginManager.executeMojo(DefaultBuildPluginManager.java:134)
	at org.apache.maven.lifecycle.internal.MojoExecutor.execute(MojoExecutor.java:208)
	... 20 more
Caused by: org.apache.commons.exec.ExecuteException: Process exited with an error: 23 (Exit
value: 23)
	at org.apache.commons.exec.DefaultExecutor.executeInternal(DefaultExecutor.java:404)
	at org.apache.commons.exec.DefaultExecutor.execute(DefaultExecutor.java:166)
	at org.codehaus.mojo.exec.ExecMojo.executeCommandLine(ExecMojo.java:764)
	at org.codehaus.mojo.exec.ExecMojo.executeCommandLine(ExecMojo.java:711)
	at org.codehaus.mojo.exec.ExecMojo.execute(ExecMojo.java:289)
	... 22 more
2017-05-02\T\23:33:59.428 [ERROR] 
2017-05-02\T\23:33:59.428 [ERROR] Re-run Maven using the -X switch to enable full debug logging.
2017-05-02\T\23:33:59.428 [ERROR] 
2017-05-02\T\23:33:59.428 [ERROR] For more information about the errors and possible solutions,
please read the following articles:
2017-05-02\T\23:33:59.428 [ERROR] [Help 1] http://cwiki.apache.org/confluence/display/MAVEN/MojoExecutionException
2017-05-02\T\23:33:59.428 [ERROR] 
2017-05-02\T\23:33:59.428 [ERROR] After correcting the problems, you can resume the build
with the command
2017-05-02\T\23:33:59.428 [ERROR]   mvn <goals> -rf :beam-sdks-java-maven-archetypes-examples
Build step 'Invoke top-level Maven targets' marked build as failure

Mime
View raw message