beam-commits mailing list archives

Site index · List index
Message view « Date » · « Thread »
Top « Date » · « Thread »
From Apache Jenkins Server <jenk...@builds.apache.org>
Subject Build failed in Jenkins: beam_PerformanceTests_Dataflow #364
Date Tue, 02 May 2017 18:25:22 GMT
See <https://builds.apache.org/job/beam_PerformanceTests_Dataflow/364/display/redirect?page=changes>

Changes:

[wtanaka] Add comments to Trigger.java

[iemejia] [BEAM-1764] Remove aggregators from Flink Runner

[davor] Update github PR template after travis removal.

[altay] Add retry logic for job creation

[tgroh] Add an @Internal Annotation

[robertwb] Revert clean else-return lint changes.

[lcwik] [BEAM-2135] Move gcp-core to google-cloud-platform-core

------------------------------------------
Started by timer
[EnvInject] - Loading node environment variables.
Building remotely on beam4 (beam) in workspace <https://builds.apache.org/job/beam_PerformanceTests_Dataflow/ws/>
 > git rev-parse --is-inside-work-tree # timeout=10
Fetching changes from the remote Git repository
 > git config remote.origin.url https://github.com/apache/beam.git # timeout=10
Fetching upstream changes from https://github.com/apache/beam.git
 > git --version # timeout=10
 > git fetch --tags --progress https://github.com/apache/beam.git +refs/heads/*:refs/remotes/origin/*
+refs/pull/*:refs/remotes/origin/pr/*
ERROR: Error fetching remote repo 'origin'
hudson.plugins.git.GitException: Failed to fetch from https://github.com/apache/beam.git
	at hudson.plugins.git.GitSCM.fetchFrom(GitSCM.java:809)
	at hudson.plugins.git.GitSCM.retrieveChanges(GitSCM.java:1076)
	at hudson.plugins.git.GitSCM.checkout(GitSCM.java:1107)
	at hudson.scm.SCM.checkout(SCM.java:496)
	at hudson.model.AbstractProject.checkout(AbstractProject.java:1281)
	at hudson.model.AbstractBuild$AbstractBuildExecution.defaultCheckout(AbstractBuild.java:604)
	at jenkins.scm.SCMCheckoutStrategy.checkout(SCMCheckoutStrategy.java:86)
	at hudson.model.AbstractBuild$AbstractBuildExecution.run(AbstractBuild.java:529)
	at hudson.model.Run.execute(Run.java:1728)
	at hudson.model.FreeStyleBuild.run(FreeStyleBuild.java:43)
	at hudson.model.ResourceController.execute(ResourceController.java:98)
	at hudson.model.Executor.run(Executor.java:405)
Caused by: hudson.plugins.git.GitException: Command "git fetch --tags --progress https://github.com/apache/beam.git
+refs/heads/*:refs/remotes/origin/* +refs/pull/*:refs/remotes/origin/pr/*" returned status
code 128:
stdout: 
stderr: error: RPC failed; result=18, HTTP code = 200
fatal: The remote end hung up unexpectedly

	at org.jenkinsci.plugins.gitclient.CliGitAPIImpl.launchCommandIn(CliGitAPIImpl.java:1866)
	at org.jenkinsci.plugins.gitclient.CliGitAPIImpl.launchCommandWithCredentials(CliGitAPIImpl.java:1585)
	at org.jenkinsci.plugins.gitclient.CliGitAPIImpl.access$300(CliGitAPIImpl.java:71)
	at org.jenkinsci.plugins.gitclient.CliGitAPIImpl$1.execute(CliGitAPIImpl.java:348)
	at org.jenkinsci.plugins.gitclient.RemoteGitImpl$CommandInvocationHandler$1.call(RemoteGitImpl.java:153)
	at org.jenkinsci.plugins.gitclient.RemoteGitImpl$CommandInvocationHandler$1.call(RemoteGitImpl.java:146)
	at hudson.remoting.UserRequest.perform(UserRequest.java:153)
	at hudson.remoting.UserRequest.perform(UserRequest.java:50)
	at hudson.remoting.Request$2.run(Request.java:336)
	at hudson.remoting.InterceptingExecutorService$1.call(InterceptingExecutorService.java:68)
	at java.util.concurrent.FutureTask.run(FutureTask.java:262)
	at java.util.concurrent.ThreadPoolExecutor.runWorker(ThreadPoolExecutor.java:1145)
	at java.util.concurrent.ThreadPoolExecutor$Worker.run(ThreadPoolExecutor.java:615)
	at java.lang.Thread.run(Thread.java:745)
	at ......remote call to beam4(Native Method)
	at hudson.remoting.Channel.attachCallSiteStackTrace(Channel.java:1545)
	at hudson.remoting.UserResponse.retrieve(UserRequest.java:253)
	at hudson.remoting.Channel.call(Channel.java:830)
	at org.jenkinsci.plugins.gitclient.RemoteGitImpl$CommandInvocationHandler.execute(RemoteGitImpl.java:146)
	at sun.reflect.GeneratedMethodAccessor788.invoke(Unknown Source)
	at sun.reflect.DelegatingMethodAccessorImpl.invoke(DelegatingMethodAccessorImpl.java:43)
	at java.lang.reflect.Method.invoke(Method.java:498)
	at org.jenkinsci.plugins.gitclient.RemoteGitImpl$CommandInvocationHandler.invoke(RemoteGitImpl.java:132)
	at com.sun.proxy.$Proxy103.execute(Unknown Source)
	at hudson.plugins.git.GitSCM.fetchFrom(GitSCM.java:807)
	... 11 more
ERROR: null
Retrying after 10 seconds
 > git rev-parse --is-inside-work-tree # timeout=10
Fetching changes from the remote Git repository
 > git config remote.origin.url https://github.com/apache/beam.git # timeout=10
Fetching upstream changes from https://github.com/apache/beam.git
 > git --version # timeout=10
 > git fetch --tags --progress https://github.com/apache/beam.git +refs/heads/*:refs/remotes/origin/*
+refs/pull/*:refs/remotes/origin/pr/*
 > git rev-parse origin/master^{commit} # timeout=10
Checking out Revision eec903fb538eb9c3d41d737dba94a41f7c1c469e (origin/master)
 > git config core.sparsecheckout # timeout=10
 > git checkout -f eec903fb538eb9c3d41d737dba94a41f7c1c469e
 > git rev-list ae72456b7125a28f2db4b8dad2990b2bb063ca9b # timeout=10
Cleaning workspace
 > git rev-parse --verify HEAD # timeout=10
Resetting working tree
 > git reset --hard # timeout=10
 > git clean -fdx # timeout=10
[EnvInject] - Executing scripts and injecting environment variables after the SCM step.
[EnvInject] - Injecting as environment variables the properties content 
SPARK_LOCAL_IP=127.0.0.1

[EnvInject] - Variables injected successfully.
[beam_PerformanceTests_Dataflow] $ /bin/bash -xe /tmp/hudson8706026561929483622.sh
+ rm -rf PerfKitBenchmarker
[beam_PerformanceTests_Dataflow] $ /bin/bash -xe /tmp/hudson425751425269746362.sh
+ git clone https://github.com/GoogleCloudPlatform/PerfKitBenchmarker.git
Cloning into 'PerfKitBenchmarker'...
[beam_PerformanceTests_Dataflow] $ /bin/bash -xe /tmp/hudson4441358561143021270.sh
+ pip install --user -r PerfKitBenchmarker/requirements.txt
Requirement already satisfied (use --upgrade to upgrade): python-gflags==3.1.1 in /home/jenkins/.local/lib/python2.7/site-packages
(from -r PerfKitBenchmarker/requirements.txt (line 14))
Requirement already satisfied (use --upgrade to upgrade): jinja2>=2.7 in /usr/local/lib/python2.7/dist-packages
(from -r PerfKitBenchmarker/requirements.txt (line 15))
Requirement already satisfied (use --upgrade to upgrade): setuptools in /usr/lib/python2.7/dist-packages
(from -r PerfKitBenchmarker/requirements.txt (line 16))
Requirement already satisfied (use --upgrade to upgrade): colorlog[windows]==2.6.0 in /home/jenkins/.local/lib/python2.7/site-packages
(from -r PerfKitBenchmarker/requirements.txt (line 17))
  Installing extra requirements: 'windows'
Requirement already satisfied (use --upgrade to upgrade): blinker>=1.3 in /home/jenkins/.local/lib/python2.7/site-packages
(from -r PerfKitBenchmarker/requirements.txt (line 18))
Requirement already satisfied (use --upgrade to upgrade): futures>=3.0.3 in /home/jenkins/.local/lib/python2.7/site-packages
(from -r PerfKitBenchmarker/requirements.txt (line 19))
Requirement already satisfied (use --upgrade to upgrade): PyYAML==3.11 in /home/jenkins/.local/lib/python2.7/site-packages
(from -r PerfKitBenchmarker/requirements.txt (line 20))
Requirement already satisfied (use --upgrade to upgrade): pint>=0.7 in /home/jenkins/.local/lib/python2.7/site-packages
(from -r PerfKitBenchmarker/requirements.txt (line 21))
Requirement already satisfied (use --upgrade to upgrade): numpy in /home/jenkins/.local/lib/python2.7/site-packages
(from -r PerfKitBenchmarker/requirements.txt (line 22))
Requirement already satisfied (use --upgrade to upgrade): functools32 in /home/jenkins/.local/lib/python2.7/site-packages
(from -r PerfKitBenchmarker/requirements.txt (line 23))
Requirement already satisfied (use --upgrade to upgrade): contextlib2>=0.5.1 in /home/jenkins/.local/lib/python2.7/site-packages
(from -r PerfKitBenchmarker/requirements.txt (line 24))
Cleaning up...
[beam_PerformanceTests_Dataflow] $ /bin/bash -xe /tmp/hudson1024427901516202230.sh
+ python PerfKitBenchmarker/pkb.py --project=apache-beam-testing --dpb_log_level=INFO --maven_binary=/home/jenkins/tools/maven/latest/bin/mvn
--bigquery_table=beam_performance.pkb_results --official=true --benchmarks=dpb_wordcount_benchmark
--dpb_dataflow_staging_location=gs://temp-storage-for-perf-tests/staging --dpb_wordcount_input=dataflow-samples/shakespeare/kinglear.txt
--config_override=dpb_wordcount_benchmark.dpb_service.service_type=dataflow
WARNING:root:File resource loader root perfkitbenchmarker/data/ycsb is not a directory.
2017-05-02 18:25:21,716 554ad8e1 MainThread INFO     Verbose logging to: /tmp/perfkitbenchmarker/runs/554ad8e1/pkb.log
2017-05-02 18:25:21,718 554ad8e1 MainThread INFO     PerfKitBenchmarker version: v1.11.0-47-gb38dddb
2017-05-02 18:25:21,719 554ad8e1 MainThread INFO     Flag values:
--maven_binary=/home/jenkins/tools/maven/latest/bin/mvn
--project=apache-beam-testing
--bigquery_table=beam_performance.pkb_results
--dpb_wordcount_input=dataflow-samples/shakespeare/kinglear.txt
--dpb_log_level=INFO
--official
--benchmarks=dpb_wordcount_benchmark
--config_override=dpb_wordcount_benchmark.dpb_service.service_type=dataflow
--dpb_dataflow_staging_location=gs://temp-storage-for-perf-tests/staging
2017-05-02 18:25:22,240 554ad8e1 MainThread WARNING  The key "flags" was not in the default
config, but was in user overrides. This may indicate a typo.
2017-05-02 18:25:22,450 554ad8e1 MainThread dpb_wordcount_benchmark(1/1) INFO     Provisioning
resources for benchmark dpb_wordcount_benchmark
2017-05-02 18:25:22,454 554ad8e1 MainThread dpb_wordcount_benchmark(1/1) INFO     Preparing
benchmark dpb_wordcount_benchmark
2017-05-02 18:25:22,454 554ad8e1 MainThread dpb_wordcount_benchmark(1/1) INFO     Running
benchmark dpb_wordcount_benchmark
2017-05-02 18:25:22,462 554ad8e1 MainThread dpb_wordcount_benchmark(1/1) ERROR    Error during
benchmark dpb_wordcount_benchmark
Traceback (most recent call last):
  File "<https://builds.apache.org/job/beam_PerformanceTests_Dataflow/ws/PerfKitBenchmarker/perfkitbenchmarker/pkb.py",>
line 543, in RunBenchmark
    DoRunPhase(spec, collector, detailed_timer)
  File "<https://builds.apache.org/job/beam_PerformanceTests_Dataflow/ws/PerfKitBenchmarker/perfkitbenchmarker/pkb.py",>
line 459, in DoRunPhase
    samples = spec.BenchmarkRun(spec)
  File "<https://builds.apache.org/job/beam_PerformanceTests_Dataflow/ws/PerfKitBenchmarker/perfkitbenchmarker/linux_benchmarks/dpb_wordcount_benchmark.py",>
line 162, in Run
    job_type=job_type)
  File "<https://builds.apache.org/job/beam_PerformanceTests_Dataflow/ws/PerfKitBenchmarker/perfkitbenchmarker/providers/gcp/gcp_dpb_dataflow.py",>
line 115, in SubmitJob
    stdout, _, _ = vm_util.IssueCommand(cmd)
  File "<https://builds.apache.org/job/beam_PerformanceTests_Dataflow/ws/PerfKitBenchmarker/perfkitbenchmarker/vm_util.py",>
line 287, in IssueCommand
    full_cmd = ' '.join(cmd)
TypeError: sequence item 2: expected string, NoneType found
2017-05-02 18:25:22,465 554ad8e1 MainThread dpb_wordcount_benchmark(1/1) ERROR    Benchmark
1/1 dpb_wordcount_benchmark (UID: dpb_wordcount_benchmark0) failed. Execution will continue.
2017-05-02 18:25:22,509 554ad8e1 MainThread INFO     Benchmark run statuses:
---------------------------------------------------------
Name                     UID                       Status
---------------------------------------------------------
dpb_wordcount_benchmark  dpb_wordcount_benchmark0  FAILED
---------------------------------------------------------
Success rate: 0.00% (0/1)
2017-05-02 18:25:22,510 554ad8e1 MainThread INFO     Complete logs can be found at: /tmp/perfkitbenchmarker/runs/554ad8e1/pkb.log
2017-05-02 18:25:22,510 554ad8e1 MainThread INFO     Completion statuses can be found at:
/tmp/perfkitbenchmarker/runs/554ad8e1/completion_statuses.json
Build step 'Execute shell' marked build as failure

Mime
View raw message