beam-commits mailing list archives

Site index · List index
Message view « Date » · « Thread »
Top « Date » · « Thread »
From Apache Jenkins Server <jenk...@builds.apache.org>
Subject Build failed in Jenkins: beam_PostCommit_Java_ValidatesRunner_Dataflow #3373
Date Fri, 16 Jun 2017 07:29:30 GMT
See <https://builds.apache.org/job/beam_PostCommit_Java_ValidatesRunner_Dataflow/3373/display/redirect>

------------------------------------------
[...truncated 7.38 MB...]
	at com.google.cloud.dataflow.worker.util.common.worker.ReadOperation.runReadLoop(ReadOperation.java:188)
	at com.google.cloud.dataflow.worker.util.common.worker.ReadOperation.start(ReadOperation.java:149)
	at com.google.cloud.dataflow.worker.util.common.worker.MapTaskExecutor.execute(MapTaskExecutor.java:72)
	at com.google.cloud.dataflow.worker.runners.worker.DataflowWorker.executeWork(DataflowWorker.java:341)
	at com.google.cloud.dataflow.worker.runners.worker.DataflowWorker.doWork(DataflowWorker.java:297)
	at com.google.cloud.dataflow.worker.runners.worker.DataflowWorker.getAndPerformWork(DataflowWorker.java:244)
	at com.google.cloud.dataflow.worker.runners.worker.DataflowBatchWorkerHarness$WorkerThread.doWork(DataflowBatchWorkerHarness.java:125)
	at com.google.cloud.dataflow.worker.runners.worker.DataflowBatchWorkerHarness$WorkerThread.call(DataflowBatchWorkerHarness.java:105)
	at com.google.cloud.dataflow.worker.runners.worker.DataflowBatchWorkerHarness$WorkerThread.call(DataflowBatchWorkerHarness.java:92)
	at java.util.concurrent.FutureTask.run(FutureTask.java:266)
	at java.util.concurrent.ThreadPoolExecutor.runWorker(ThreadPoolExecutor.java:1142)
	at java.util.concurrent.ThreadPoolExecutor$Worker.run(ThreadPoolExecutor.java:617)
	at java.lang.Thread.run(Thread.java:745)
(96edac8154a35c1f): java.lang.AssertionError: Accumulators should all have the same Side Input
Value
Expected: "2"
     but: was "21"
	at org.hamcrest.MatcherAssert.assertThat(MatcherAssert.java:20)
	at org.junit.Assert.assertThat(Assert.java:956)
	at org.apache.beam.sdk.transforms.CombineTest$TestCombineFnWithContext.mergeAccumulators(CombineTest.java:1111)
	at org.apache.beam.sdk.transforms.CombineTest$TestCombineFnWithContext.mergeAccumulators(CombineTest.java:1071)
	at com.google.cloud.dataflow.worker.runners.worker.GroupAlsoByWindowParDoFnFactory$MergingKeyedCombineFnWithContext.extractOutput(GroupAlsoByWindowParDoFnFactory.java:344)
	at com.google.cloud.dataflow.worker.runners.worker.GroupAlsoByWindowParDoFnFactory$MergingKeyedCombineFnWithContext.extractOutput(GroupAlsoByWindowParDoFnFactory.java:305)
	at com.google.cloud.dataflow.worker.util.BatchGroupAlsoByWindowAndCombineFn$KeyedCombineFnWithContextRunner.extractOutput(BatchGroupAlsoByWindowAndCombineFn.java:270)
	at com.google.cloud.dataflow.worker.util.BatchGroupAlsoByWindowAndCombineFn.closeWindow(BatchGroupAlsoByWindowAndCombineFn.java:192)
	at com.google.cloud.dataflow.worker.util.BatchGroupAlsoByWindowAndCombineFn.processElement(BatchGroupAlsoByWindowAndCombineFn.java:170)
	at com.google.cloud.dataflow.worker.util.BatchGroupAlsoByWindowAndCombineFn.processElement(BatchGroupAlsoByWindowAndCombineFn.java:57)
	at com.google.cloud.dataflow.worker.runners.worker.GroupAlsoByWindowFnRunner.invokeProcessElement(GroupAlsoByWindowFnRunner.java:117)
	at com.google.cloud.dataflow.worker.runners.worker.GroupAlsoByWindowFnRunner.processElement(GroupAlsoByWindowFnRunner.java:74)
	at com.google.cloud.dataflow.worker.runners.worker.GroupAlsoByWindowsParDoFn.processElement(GroupAlsoByWindowsParDoFn.java:101)
	at com.google.cloud.dataflow.worker.runners.worker.ForwardingParDoFn.processElement(ForwardingParDoFn.java:42)
	at com.google.cloud.dataflow.worker.runners.worker.DataflowWorkerLoggingParDoFn.processElement(DataflowWorkerLoggingParDoFn.java:47)
	at com.google.cloud.dataflow.worker.util.common.worker.ParDoOperation.process(ParDoOperation.java:48)
	at com.google.cloud.dataflow.worker.util.common.worker.OutputReceiver.process(OutputReceiver.java:52)
	at com.google.cloud.dataflow.worker.util.common.worker.ReadOperation.runReadLoop(ReadOperation.java:188)
	at com.google.cloud.dataflow.worker.util.common.worker.ReadOperation.start(ReadOperation.java:149)
	at com.google.cloud.dataflow.worker.util.common.worker.MapTaskExecutor.execute(MapTaskExecutor.java:72)
	at com.google.cloud.dataflow.worker.runners.worker.DataflowWorker.executeWork(DataflowWorker.java:341)
	at com.google.cloud.dataflow.worker.runners.worker.DataflowWorker.doWork(DataflowWorker.java:297)
	at com.google.cloud.dataflow.worker.runners.worker.DataflowWorker.getAndPerformWork(DataflowWorker.java:244)
	at com.google.cloud.dataflow.worker.runners.worker.DataflowBatchWorkerHarness$WorkerThread.doWork(DataflowBatchWorkerHarness.java:125)
	at com.google.cloud.dataflow.worker.runners.worker.DataflowBatchWorkerHarness$WorkerThread.call(DataflowBatchWorkerHarness.java:105)
	at com.google.cloud.dataflow.worker.runners.worker.DataflowBatchWorkerHarness$WorkerThread.call(DataflowBatchWorkerHarness.java:92)
	at java.util.concurrent.FutureTask.run(FutureTask.java:266)
	at java.util.concurrent.ThreadPoolExecutor.runWorker(ThreadPoolExecutor.java:1142)
	at java.util.concurrent.ThreadPoolExecutor$Worker.run(ThreadPoolExecutor.java:617)
	at java.lang.Thread.run(Thread.java:745)
(96edac8154a359fc): java.lang.AssertionError: Accumulators should all have the same Side Input
Value
Expected: "2"
     but: was "21"
	at org.hamcrest.MatcherAssert.assertThat(MatcherAssert.java:20)
	at org.junit.Assert.assertThat(Assert.java:956)
	at org.apache.beam.sdk.transforms.CombineTest$TestCombineFnWithContext.mergeAccumulators(CombineTest.java:1111)
	at org.apache.beam.sdk.transforms.CombineTest$TestCombineFnWithContext.mergeAccumulators(CombineTest.java:1071)
	at com.google.cloud.dataflow.worker.runners.worker.GroupAlsoByWindowParDoFnFactory$MergingKeyedCombineFnWithContext.extractOutput(GroupAlsoByWindowParDoFnFactory.java:344)
	at com.google.cloud.dataflow.worker.runners.worker.GroupAlsoByWindowParDoFnFactory$MergingKeyedCombineFnWithContext.extractOutput(GroupAlsoByWindowParDoFnFactory.java:305)
	at com.google.cloud.dataflow.worker.util.BatchGroupAlsoByWindowAndCombineFn$KeyedCombineFnWithContextRunner.extractOutput(BatchGroupAlsoByWindowAndCombineFn.java:270)
	at com.google.cloud.dataflow.worker.util.BatchGroupAlsoByWindowAndCombineFn.closeWindow(BatchGroupAlsoByWindowAndCombineFn.java:192)
	at com.google.cloud.dataflow.worker.util.BatchGroupAlsoByWindowAndCombineFn.processElement(BatchGroupAlsoByWindowAndCombineFn.java:170)
	at com.google.cloud.dataflow.worker.util.BatchGroupAlsoByWindowAndCombineFn.processElement(BatchGroupAlsoByWindowAndCombineFn.java:57)
	at com.google.cloud.dataflow.worker.runners.worker.GroupAlsoByWindowFnRunner.invokeProcessElement(GroupAlsoByWindowFnRunner.java:117)
	at com.google.cloud.dataflow.worker.runners.worker.GroupAlsoByWindowFnRunner.processElement(GroupAlsoByWindowFnRunner.java:74)
	at com.google.cloud.dataflow.worker.runners.worker.GroupAlsoByWindowsParDoFn.processElement(GroupAlsoByWindowsParDoFn.java:101)
	at com.google.cloud.dataflow.worker.runners.worker.ForwardingParDoFn.processElement(ForwardingParDoFn.java:42)
	at com.google.cloud.dataflow.worker.runners.worker.DataflowWorkerLoggingParDoFn.processElement(DataflowWorkerLoggingParDoFn.java:47)
	at com.google.cloud.dataflow.worker.util.common.worker.ParDoOperation.process(ParDoOperation.java:48)
	at com.google.cloud.dataflow.worker.util.common.worker.OutputReceiver.process(OutputReceiver.java:52)
	at com.google.cloud.dataflow.worker.util.common.worker.ReadOperation.runReadLoop(ReadOperation.java:188)
	at com.google.cloud.dataflow.worker.util.common.worker.ReadOperation.start(ReadOperation.java:149)
	at com.google.cloud.dataflow.worker.util.common.worker.MapTaskExecutor.execute(MapTaskExecutor.java:72)
	at com.google.cloud.dataflow.worker.runners.worker.DataflowWorker.executeWork(DataflowWorker.java:341)
	at com.google.cloud.dataflow.worker.runners.worker.DataflowWorker.doWork(DataflowWorker.java:297)
	at com.google.cloud.dataflow.worker.runners.worker.DataflowWorker.getAndPerformWork(DataflowWorker.java:244)
	at com.google.cloud.dataflow.worker.runners.worker.DataflowBatchWorkerHarness$WorkerThread.doWork(DataflowBatchWorkerHarness.java:125)
	at com.google.cloud.dataflow.worker.runners.worker.DataflowBatchWorkerHarness$WorkerThread.call(DataflowBatchWorkerHarness.java:105)
	at com.google.cloud.dataflow.worker.runners.worker.DataflowBatchWorkerHarness$WorkerThread.call(DataflowBatchWorkerHarness.java:92)
	at java.util.concurrent.FutureTask.run(FutureTask.java:266)
	at java.util.concurrent.ThreadPoolExecutor.runWorker(ThreadPoolExecutor.java:1142)
	at java.util.concurrent.ThreadPoolExecutor$Worker.run(ThreadPoolExecutor.java:617)
	at java.lang.Thread.run(Thread.java:745)
(96edac8154a35e63): java.lang.AssertionError: Accumulators should all have the same Side Input
Value
Expected: "2"
     but: was "21"
	at org.hamcrest.MatcherAssert.assertThat(MatcherAssert.java:20)
	at org.junit.Assert.assertThat(Assert.java:956)
	at org.apache.beam.sdk.transforms.CombineTest$TestCombineFnWithContext.mergeAccumulators(CombineTest.java:1111)
	at org.apache.beam.sdk.transforms.CombineTest$TestCombineFnWithContext.mergeAccumulators(CombineTest.java:1071)
	at com.google.cloud.dataflow.worker.runners.worker.GroupAlsoByWindowParDoFnFactory$MergingKeyedCombineFnWithContext.extractOutput(GroupAlsoByWindowParDoFnFactory.java:344)
	at com.google.cloud.dataflow.worker.runners.worker.GroupAlsoByWindowParDoFnFactory$MergingKeyedCombineFnWithContext.extractOutput(GroupAlsoByWindowParDoFnFactory.java:305)
	at com.google.cloud.dataflow.worker.util.BatchGroupAlsoByWindowAndCombineFn$KeyedCombineFnWithContextRunner.extractOutput(BatchGroupAlsoByWindowAndCombineFn.java:270)
	at com.google.cloud.dataflow.worker.util.BatchGroupAlsoByWindowAndCombineFn.closeWindow(BatchGroupAlsoByWindowAndCombineFn.java:192)
	at com.google.cloud.dataflow.worker.util.BatchGroupAlsoByWindowAndCombineFn.processElement(BatchGroupAlsoByWindowAndCombineFn.java:170)
	at com.google.cloud.dataflow.worker.util.BatchGroupAlsoByWindowAndCombineFn.processElement(BatchGroupAlsoByWindowAndCombineFn.java:57)
	at com.google.cloud.dataflow.worker.runners.worker.GroupAlsoByWindowFnRunner.invokeProcessElement(GroupAlsoByWindowFnRunner.java:117)
	at com.google.cloud.dataflow.worker.runners.worker.GroupAlsoByWindowFnRunner.processElement(GroupAlsoByWindowFnRunner.java:74)
	at com.google.cloud.dataflow.worker.runners.worker.GroupAlsoByWindowsParDoFn.processElement(GroupAlsoByWindowsParDoFn.java:101)
	at com.google.cloud.dataflow.worker.runners.worker.ForwardingParDoFn.processElement(ForwardingParDoFn.java:42)
	at com.google.cloud.dataflow.worker.runners.worker.DataflowWorkerLoggingParDoFn.processElement(DataflowWorkerLoggingParDoFn.java:47)
	at com.google.cloud.dataflow.worker.util.common.worker.ParDoOperation.process(ParDoOperation.java:48)
	at com.google.cloud.dataflow.worker.util.common.worker.OutputReceiver.process(OutputReceiver.java:52)
	at com.google.cloud.dataflow.worker.util.common.worker.ReadOperation.runReadLoop(ReadOperation.java:188)
	at com.google.cloud.dataflow.worker.util.common.worker.ReadOperation.start(ReadOperation.java:149)
	at com.google.cloud.dataflow.worker.util.common.worker.MapTaskExecutor.execute(MapTaskExecutor.java:72)
	at com.google.cloud.dataflow.worker.runners.worker.DataflowWorker.executeWork(DataflowWorker.java:341)
	at com.google.cloud.dataflow.worker.runners.worker.DataflowWorker.doWork(DataflowWorker.java:297)
	at com.google.cloud.dataflow.worker.runners.worker.DataflowWorker.getAndPerformWork(DataflowWorker.java:244)
	at com.google.cloud.dataflow.worker.runners.worker.DataflowBatchWorkerHarness$WorkerThread.doWork(DataflowBatchWorkerHarness.java:125)
	at com.google.cloud.dataflow.worker.runners.worker.DataflowBatchWorkerHarness$WorkerThread.call(DataflowBatchWorkerHarness.java:105)
	at com.google.cloud.dataflow.worker.runners.worker.DataflowBatchWorkerHarness$WorkerThread.call(DataflowBatchWorkerHarness.java:92)
	at java.util.concurrent.FutureTask.run(FutureTask.java:266)
	at java.util.concurrent.ThreadPoolExecutor.runWorker(ThreadPoolExecutor.java:1142)
	at java.util.concurrent.ThreadPoolExecutor$Worker.run(ThreadPoolExecutor.java:617)
	at java.lang.Thread.run(Thread.java:745)
(b2e122021ca221cf): Workflow failed. Causes: (b2e122021ca227b7): S28:Combine.perKey(TestCombineFnWithContext)/GroupByKey/Read+Combine.perKey(TestCombineFnWithContext)/Combine.GroupedValues+Combine.perKey(TestCombineFnWithContext)/Combine.GroupedValues/Extract+PAssert$290/GroupGlobally/Window.Into()/Window.Assign+PAssert$290/GroupGlobally/GatherAllOutputs/ParDo(ReifyTimestampsAndWindows)+PAssert$290/GroupGlobally/GatherAllOutputs/WithKeys/AddKeys/Map+PAssert$290/GroupGlobally/GatherAllOutputs/Window.Into()/Window.Assign+PAssert$290/GroupGlobally/GatherAllOutputs/GroupByKey/Reify+PAssert$290/GroupGlobally/GatherAllOutputs/GroupByKey/Write
failed.(96edac8154a35c40): java.lang.AssertionError: Accumulators should all have the same
Side Input Value
Expected: "2"
     but: was "21"
	at org.hamcrest.MatcherAssert.assertThat(MatcherAssert.java:20)
	at org.junit.Assert.assertThat(Assert.java:956)
	at org.apache.beam.sdk.transforms.CombineTest$TestCombineFnWithContext.mergeAccumulators(CombineTest.java:1111)
	at org.apache.beam.sdk.transforms.CombineTest$TestCombineFnWithContext.mergeAccumulators(CombineTest.java:1071)
	at com.google.cloud.dataflow.worker.runners.worker.GroupAlsoByWindowParDoFnFactory$MergingKeyedCombineFnWithContext.extractOutput(GroupAlsoByWindowParDoFnFactory.java:344)
	at com.google.cloud.dataflow.worker.runners.worker.GroupAlsoByWindowParDoFnFactory$MergingKeyedCombineFnWithContext.extractOutput(GroupAlsoByWindowParDoFnFactory.java:305)
	at com.google.cloud.dataflow.worker.util.BatchGroupAlsoByWindowAndCombineFn$KeyedCombineFnWithContextRunner.extractOutput(BatchGroupAlsoByWindowAndCombineFn.java:270)
	at com.google.cloud.dataflow.worker.util.BatchGroupAlsoByWindowAndCombineFn.closeWindow(BatchGroupAlsoByWindowAndCombineFn.java:192)
	at com.google.cloud.dataflow.worker.util.BatchGroupAlsoByWindowAndCombineFn.processElement(BatchGroupAlsoByWindowAndCombineFn.java:170)
	at com.google.cloud.dataflow.worker.util.BatchGroupAlsoByWindowAndCombineFn.processElement(BatchGroupAlsoByWindowAndCombineFn.java:57)
	at com.google.cloud.dataflow.worker.runners.worker.GroupAlsoByWindowFnRunner.invokeProcessElement(GroupAlsoByWindowFnRunner.java:117)
	at com.google.cloud.dataflow.worker.runners.worker.GroupAlsoByWindowFnRunner.processElement(GroupAlsoByWindowFnRunner.java:74)
	at com.google.cloud.dataflow.worker.runners.worker.GroupAlsoByWindowsParDoFn.processElement(GroupAlsoByWindowsParDoFn.java:101)
	at com.google.cloud.dataflow.worker.runners.worker.ForwardingParDoFn.processElement(ForwardingParDoFn.java:42)
	at com.google.cloud.dataflow.worker.runners.worker.DataflowWorkerLoggingParDoFn.processElement(DataflowWorkerLoggingParDoFn.java:47)
	at com.google.cloud.dataflow.worker.util.common.worker.ParDoOperation.process(ParDoOperation.java:48)
	at com.google.cloud.dataflow.worker.util.common.worker.OutputReceiver.process(OutputReceiver.java:52)
	at com.google.cloud.dataflow.worker.util.common.worker.ReadOperation.runReadLoop(ReadOperation.java:188)
	at com.google.cloud.dataflow.worker.util.common.worker.ReadOperation.start(ReadOperation.java:149)
	at com.google.cloud.dataflow.worker.util.common.worker.MapTaskExecutor.execute(MapTaskExecutor.java:72)
	at com.google.cloud.dataflow.worker.runners.worker.DataflowWorker.executeWork(DataflowWorker.java:341)
	at com.google.cloud.dataflow.worker.runners.worker.DataflowWorker.doWork(DataflowWorker.java:297)
	at com.google.cloud.dataflow.worker.runners.worker.DataflowWorker.getAndPerformWork(DataflowWorker.java:244)
	at com.google.cloud.dataflow.worker.runners.worker.DataflowBatchWorkerHarness$WorkerThread.doWork(DataflowBatchWorkerHarness.java:125)
	at com.google.cloud.dataflow.worker.runners.worker.DataflowBatchWorkerHarness$WorkerThread.call(DataflowBatchWorkerHarness.java:105)
	at com.google.cloud.dataflow.worker.runners.worker.DataflowBatchWorkerHarness$WorkerThread.call(DataflowBatchWorkerHarness.java:92)
	at java.util.concurrent.FutureTask.run(FutureTask.java:266)
	at java.util.concurrent.ThreadPoolExecutor.runWorker(ThreadPoolExecutor.java:1142)
	at java.util.concurrent.ThreadPoolExecutor$Worker.run(ThreadPoolExecutor.java:617)
	at java.lang.Thread.run(Thread.java:745)

	at org.apache.beam.runners.dataflow.TestDataflowRunner.run(TestDataflowRunner.java:133)
	at org.apache.beam.runners.dataflow.TestDataflowRunner.run(TestDataflowRunner.java:89)
	at org.apache.beam.runners.dataflow.TestDataflowRunner.run(TestDataflowRunner.java:54)
	at org.apache.beam.sdk.Pipeline.run(Pipeline.java:297)
	at org.apache.beam.sdk.Pipeline.run(Pipeline.java:283)
	at org.apache.beam.sdk.testing.TestPipeline.run(TestPipeline.java:340)
	at org.apache.beam.sdk.transforms.CombineTest.testFixedWindowsCombineWithContext(CombineTest.java:330)
	at sun.reflect.NativeMethodAccessorImpl.invoke0(Native Method)
	at sun.reflect.NativeMethodAccessorImpl.invoke(NativeMethodAccessorImpl.java:62)
	at sun.reflect.DelegatingMethodAccessorImpl.invoke(DelegatingMethodAccessorImpl.java:43)
	at java.lang.reflect.Method.invoke(Method.java:498)
	at org.junit.runners.model.FrameworkMethod$1.runReflectiveCall(FrameworkMethod.java:50)
	at org.junit.internal.runners.model.ReflectiveCallable.run(ReflectiveCallable.java:12)
	at org.junit.runners.model.FrameworkMethod.invokeExplosively(FrameworkMethod.java:47)
	at org.junit.internal.runners.statements.InvokeMethod.evaluate(InvokeMethod.java:17)
	at org.apache.beam.sdk.testing.TestPipeline$1.evaluate(TestPipeline.java:321)
	at org.junit.rules.RunRules.evaluate(RunRules.java:20)
	at org.junit.runners.ParentRunner.runLeaf(ParentRunner.java:325)
	at org.junit.runners.BlockJUnit4ClassRunner.runChild(BlockJUnit4ClassRunner.java:78)
	at org.junit.runners.BlockJUnit4ClassRunner.runChild(BlockJUnit4ClassRunner.java:57)
	at org.junit.runners.ParentRunner$3.run(ParentRunner.java:290)
	at org.apache.maven.surefire.junitcore.pc.Scheduler$1.run(Scheduler.java:393)
	at java.util.concurrent.Executors$RunnableAdapter.call(Executors.java:511)
	at java.util.concurrent.FutureTask.run(FutureTask.java:266)
	at java.util.concurrent.ThreadPoolExecutor.runWorker(ThreadPoolExecutor.java:1142)
	at java.util.concurrent.ThreadPoolExecutor$Worker.run(ThreadPoolExecutor.java:617)
	at java.lang.Thread.run(Thread.java:748)

2017-06-16T07:28:54.802 [INFO] Running org.apache.beam.sdk.values.PDoneTest
2017-06-16T07:28:54.805 [WARNING] Tests run: 1, Failures: 0, Errors: 0, Skipped: 1, Time elapsed:
0 s - in org.apache.beam.sdk.values.PDoneTest
2017-06-16T07:28:54.808 [INFO] 
2017-06-16T07:28:54.808 [INFO] Results:
2017-06-16T07:28:54.808 [INFO] 
2017-06-16T07:28:54.808 [ERROR] Errors: 
2017-06-16T07:28:54.810 [ERROR]   CombineTest.testFixedWindowsCombine:288 » Runtime (d17112fdbe8557a8):
java.lan...
2017-06-16T07:28:54.810 [ERROR]   CombineTest.testFixedWindowsCombineWithContext:330 » Runtime
(96edac8154a35351...
2017-06-16T07:28:54.810 [ERROR]   CombineTest.testSimpleCombine:163->runTestSimpleCombine:127
» Runtime (3bce368...
2017-06-16T07:28:54.810 [ERROR]   CombineTest.testSimpleCombineWithContext:176->runTestSimpleCombineWithContext:156
» Runtime
2017-06-16T07:28:54.810 [ERROR]   CombineTest.testSlidingWindowsCombineWithContext:377 »
Runtime (a33c09716d8778...
2017-06-16T07:28:54.811 [INFO] 
2017-06-16T07:28:54.811 [ERROR] Tests run: 245, Failures: 0, Errors: 5, Skipped: 1
2017-06-16T07:28:54.811 [INFO] 
2017-06-16T07:28:55.103 [ERROR] There are test failures.

Please refer to <https://builds.apache.org/job/beam_PostCommit_Java_ValidatesRunner_Dataflow/ws/runners/google-cloud-dataflow-java/target/surefire-reports>
for the individual test results.
Please refer to dump files (if any exist) [date]-jvmRun[N].dump, [date].dumpstream and [date]-jvmRun[N].dumpstream.
[JENKINS] Recording test results
2017-06-16T07:28:57.889 [INFO] 
2017-06-16T07:28:57.889 [INFO] --- maven-dependency-plugin:3.0.1:analyze-only (default) @
beam-runners-google-cloud-dataflow-java ---
2017-06-16T07:28:58.022 [INFO] No dependency problems found
[JENKINS] Archiving disabled
[JENKINS] Archiving disabled
[JENKINS] Archiving disabled
[JENKINS] Archiving disabled
[JENKINS] Archiving disabled
[JENKINS] Archiving disabled
[JENKINS] Archiving disabled
[JENKINS] Archiving disabled
[JENKINS] Archiving disabled
[JENKINS] Archiving disabled
[JENKINS] Archiving disabled
[JENKINS] Archiving disabled
[JENKINS] Archiving disabled
[JENKINS] Archiving disabled
[JENKINS] Archiving disabled
[JENKINS] Archiving disabled
[JENKINS] Archiving disabled
[JENKINS] Archiving disabled
[JENKINS] Archiving disabled
2017-06-16T07:29:05.969 [INFO] ------------------------------------------------------------------------
2017-06-16T07:29:05.969 [INFO] Reactor Summary:
2017-06-16T07:29:05.969 [INFO] 
2017-06-16T07:29:05.970 [INFO] Apache Beam :: Parent .............................. SUCCESS
[ 18.990 s]
2017-06-16T07:29:05.970 [INFO] Apache Beam :: SDKs :: Java :: Build Tools ......... SUCCESS
[  8.582 s]
2017-06-16T07:29:05.970 [INFO] Apache Beam :: SDKs ................................ SUCCESS
[  1.473 s]
2017-06-16T07:29:05.970 [INFO] Apache Beam :: SDKs :: Common ...................... SUCCESS
[  1.316 s]
2017-06-16T07:29:05.970 [INFO] Apache Beam :: SDKs :: Common :: Runner API ........ SUCCESS
[  9.048 s]
2017-06-16T07:29:05.970 [INFO] Apache Beam :: SDKs :: Common :: Fn API ............ SUCCESS
[  6.378 s]
2017-06-16T07:29:05.970 [INFO] Apache Beam :: SDKs :: Java ........................ SUCCESS
[  1.300 s]
2017-06-16T07:29:05.970 [INFO] Apache Beam :: SDKs :: Java :: Core ................ SUCCESS
[01:23 min]
2017-06-16T07:29:05.970 [INFO] Apache Beam :: Runners ............................. SUCCESS
[  1.288 s]
2017-06-16T07:29:05.970 [INFO] Apache Beam :: Runners :: Core Construction Java ... SUCCESS
[ 11.514 s]
2017-06-16T07:29:05.970 [INFO] Apache Beam :: Runners :: Core Java ................ SUCCESS
[ 33.149 s]
2017-06-16T07:29:05.970 [INFO] Apache Beam :: Runners :: Direct Java .............. SUCCESS
[03:15 min]
2017-06-16T07:29:05.970 [INFO] Apache Beam :: SDKs :: Java :: IO .................. SUCCESS
[  1.442 s]
2017-06-16T07:29:05.970 [INFO] Apache Beam :: SDKs :: Java :: Extensions .......... SUCCESS
[  1.435 s]
2017-06-16T07:29:05.970 [INFO] Apache Beam :: SDKs :: Java :: Extensions :: Google Cloud Platform
Core SUCCESS [ 18.904 s]
2017-06-16T07:29:05.970 [INFO] Apache Beam :: SDKs :: Java :: Extensions :: Protobuf SUCCESS
[ 13.899 s]
2017-06-16T07:29:05.970 [INFO] Apache Beam :: SDKs :: Java :: IO :: Google Cloud Platform
SUCCESS [ 57.421 s]
2017-06-16T07:29:05.970 [INFO] Apache Beam :: Runners :: Google Cloud Dataflow .... SUCCESS
[  01:19 h]
2017-06-16T07:29:05.970 [INFO] ------------------------------------------------------------------------
2017-06-16T07:29:05.970 [INFO] BUILD SUCCESS
2017-06-16T07:29:05.970 [INFO] ------------------------------------------------------------------------
2017-06-16T07:29:05.970 [INFO] Total time: 01:28 h
2017-06-16T07:29:05.970 [INFO] Finished at: 2017-06-16T07:29:05+00:00
2017-06-16T07:29:07.094 [INFO] Final Memory: 296M/2049M
2017-06-16T07:29:07.094 [INFO] ------------------------------------------------------------------------
Waiting for Jenkins to finish collecting data
channel stopped
Not sending mail to unregistered user klk@google.com
Not sending mail to unregistered user aljoscha.krettek@gmail.com
Not sending mail to unregistered user ccy@google.com
Not sending mail to unregistered user kirpichov@google.com

Mime
View raw message