beam-commits mailing list archives

Site index · List index
Message view « Date » · « Thread »
Top « Date » · « Thread »
From Apache Jenkins Server <jenk...@builds.apache.org>
Subject Build failed in Jenkins: beam_PostCommit_Java_MavenInstall_Windows #160
Date Wed, 21 Jun 2017 12:40:34 GMT
See <https://builds.apache.org/job/beam_PostCommit_Java_MavenInstall_Windows/160/display/redirect?page=changes>

Changes:

[iemejia] Return a valid Coder for any subtype of Mutation on

[jbonofre] [BEAM-2481] Update commons-lang3 dependency to version 3.6

------------------------------------------
[...truncated 2.66 MB...]
2017-06-21T12:38:26.826 [INFO] Downloading: https://repo.maven.apache.org/maven2/org/sonatype/gossip/gossip/1.8/gossip-1.8.pom
2017-06-21T12:38:26.837 [INFO] Downloaded: https://repo.maven.apache.org/maven2/org/sonatype/gossip/gossip/1.8/gossip-1.8.pom
(12 KB at 1023.3 KB/sec)
2017-06-21T12:38:26.840 [INFO] Downloading: https://repo.maven.apache.org/maven2/org/sonatype/forge/forge-parent/9/forge-parent-9.pom
2017-06-21T12:38:26.852 [INFO] Downloaded: https://repo.maven.apache.org/maven2/org/sonatype/forge/forge-parent/9/forge-parent-9.pom
(13 KB at 1069.5 KB/sec)
2017-06-21T12:38:26.856 [INFO] Downloading: https://repo.maven.apache.org/maven2/org/sonatype/gossip/gossip-core/1.8/gossip-core-1.8.pom
2017-06-21T12:38:26.865 [INFO] Downloaded: https://repo.maven.apache.org/maven2/org/sonatype/gossip/gossip-core/1.8/gossip-core-1.8.pom
(3 KB at 241.4 KB/sec)
2017-06-21T12:38:26.869 [INFO] Downloading: https://repo.maven.apache.org/maven2/org/sonatype/gossip/gossip-bootstrap/1.8/gossip-bootstrap-1.8.pom
2017-06-21T12:38:26.879 [INFO] Downloaded: https://repo.maven.apache.org/maven2/org/sonatype/gossip/gossip-bootstrap/1.8/gossip-bootstrap-1.8.pom
(2 KB at 157.3 KB/sec)
2017-06-21T12:38:26.883 [INFO] Downloading: https://repo.maven.apache.org/maven2/com/google/guava/guava/14.0.1/guava-14.0.1.pom
2017-06-21T12:38:26.893 [INFO] Downloaded: https://repo.maven.apache.org/maven2/com/google/guava/guava/14.0.1/guava-14.0.1.pom
(6 KB at 525.0 KB/sec)
2017-06-21T12:38:26.896 [INFO] Downloading: https://repo.maven.apache.org/maven2/com/google/guava/guava-parent/14.0.1/guava-parent-14.0.1.pom
2017-06-21T12:38:26.905 [INFO] Downloaded: https://repo.maven.apache.org/maven2/com/google/guava/guava-parent/14.0.1/guava-parent-14.0.1.pom
(3 KB at 277.2 KB/sec)
2017-06-21T12:38:26.909 [INFO] Downloading: https://repo.maven.apache.org/maven2/org/codehaus/plexus/plexus-classworlds/2.4.2/plexus-classworlds-2.4.2.pom
2017-06-21T12:38:26.917 [INFO] Downloaded: https://repo.maven.apache.org/maven2/org/codehaus/plexus/plexus-classworlds/2.4.2/plexus-classworlds-2.4.2.pom
(4 KB at 428.3 KB/sec)
2017-06-21T12:38:26.921 [INFO] Downloading: https://repo.maven.apache.org/maven2/org/codehaus/plexus/plexus-interpolation/1.16/plexus-interpolation-1.16.pom
2017-06-21T12:38:26.932 [INFO] Downloaded: https://repo.maven.apache.org/maven2/org/codehaus/plexus/plexus-interpolation/1.16/plexus-interpolation-1.16.pom
(2 KB at 91.2 KB/sec)
2017-06-21T12:38:26.937 [INFO] Downloading: https://repo.maven.apache.org/maven2/org/eclipse/aether/aether-api/0.9.0.M2/aether-api-0.9.0.M2.pom
2017-06-21T12:38:26.948 [INFO] Downloaded: https://repo.maven.apache.org/maven2/org/eclipse/aether/aether-api/0.9.0.M2/aether-api-0.9.0.M2.pom
(2 KB at 154.2 KB/sec)
2017-06-21T12:38:26.953 [INFO] Downloading: https://repo.maven.apache.org/maven2/org/codehaus/gmaven/gmaven-adapter-api/2.0/gmaven-adapter-api-2.0.pom
2017-06-21T12:38:26.961 [INFO] Downloaded: https://repo.maven.apache.org/maven2/org/codehaus/gmaven/gmaven-adapter-api/2.0/gmaven-adapter-api-2.0.pom
(2 KB at 220.5 KB/sec)
2017-06-21T12:38:26.966 [INFO] Downloading: https://repo.maven.apache.org/maven2/org/codehaus/gmaven/gmaven-adapter-impl/2.0/gmaven-adapter-impl-2.0.pom
2017-06-21T12:38:26.977 [INFO] Downloaded: https://repo.maven.apache.org/maven2/org/codehaus/gmaven/gmaven-adapter-impl/2.0/gmaven-adapter-impl-2.0.pom
(3 KB at 241.3 KB/sec)
2017-06-21T12:38:26.982 [INFO] Downloading: https://repo.maven.apache.org/maven2/org/codehaus/groovy/groovy-all/2.1.5/groovy-all-2.1.5.pom
2017-06-21T12:38:27.075 [INFO] Downloaded: https://repo.maven.apache.org/maven2/org/codehaus/groovy/groovy-all/2.1.5/groovy-all-2.1.5.pom
(18 KB at 189.4 KB/sec)
2017-06-21T12:38:27.080 [INFO] Downloading: https://repo.maven.apache.org/maven2/org/apache/ant/ant/1.8.4/ant-1.8.4.pom
2017-06-21T12:38:27.093 [INFO] Downloaded: https://repo.maven.apache.org/maven2/org/apache/ant/ant/1.8.4/ant-1.8.4.pom
(10 KB at 725.2 KB/sec)
2017-06-21T12:38:27.097 [INFO] Downloading: https://repo.maven.apache.org/maven2/org/apache/ant/ant-parent/1.8.4/ant-parent-1.8.4.pom
2017-06-21T12:38:27.108 [INFO] Downloaded: https://repo.maven.apache.org/maven2/org/apache/ant/ant-parent/1.8.4/ant-parent-1.8.4.pom
(5 KB at 404.9 KB/sec)
2017-06-21T12:38:27.113 [INFO] Downloading: https://repo.maven.apache.org/maven2/org/apache/ant/ant-launcher/1.8.4/ant-launcher-1.8.4.pom
2017-06-21T12:38:27.123 [INFO] Downloaded: https://repo.maven.apache.org/maven2/org/apache/ant/ant-launcher/1.8.4/ant-launcher-1.8.4.pom
(3 KB at 230.6 KB/sec)
2017-06-21T12:38:27.128 [INFO] Downloading: https://repo.maven.apache.org/maven2/org/fusesource/jansi/jansi/1.11/jansi-1.11.pom
2017-06-21T12:38:27.139 [INFO] Downloaded: https://repo.maven.apache.org/maven2/org/fusesource/jansi/jansi/1.11/jansi-1.11.pom
(4 KB at 319.7 KB/sec)
2017-06-21T12:38:27.143 [INFO] Downloading: https://repo.maven.apache.org/maven2/org/fusesource/jansi/jansi-project/1.11/jansi-project-1.11.pom
2017-06-21T12:38:27.154 [INFO] Downloaded: https://repo.maven.apache.org/maven2/org/fusesource/jansi/jansi-project/1.11/jansi-project-1.11.pom
(12 KB at 1016.2 KB/sec)
2017-06-21T12:38:27.159 [INFO] Downloading: https://repo.maven.apache.org/maven2/org/fusesource/fusesource-pom/1.8/fusesource-pom-1.8.pom
2017-06-21T12:38:27.171 [INFO] Downloaded: https://repo.maven.apache.org/maven2/org/fusesource/fusesource-pom/1.8/fusesource-pom-1.8.pom
(15 KB at 1192.6 KB/sec)
2017-06-21T12:38:27.186 [INFO] Downloading: https://repo.maven.apache.org/maven2/org/sonatype/gossip/gossip-slf4j/1.8/gossip-slf4j-1.8.jar
2017-06-21T12:38:27.187 [INFO] Downloading: https://repo.maven.apache.org/maven2/org/sonatype/gossip/gossip-bootstrap/1.8/gossip-bootstrap-1.8.jar
2017-06-21T12:38:27.186 [INFO] Downloading: https://repo.maven.apache.org/maven2/org/sonatype/gossip/gossip-core/1.8/gossip-core-1.8.jar
2017-06-21T12:38:27.188 [INFO] Downloading: https://repo.maven.apache.org/maven2/org/codehaus/plexus/plexus-classworlds/2.4.2/plexus-classworlds-2.4.2.jar
2017-06-21T12:38:27.188 [INFO] Downloading: https://repo.maven.apache.org/maven2/com/google/guava/guava/14.0.1/guava-14.0.1.jar
2017-06-21T12:38:27.202 [INFO] Downloaded: https://repo.maven.apache.org/maven2/org/sonatype/gossip/gossip-slf4j/1.8/gossip-slf4j-1.8.jar
(5 KB at 258.0 KB/sec)
2017-06-21T12:38:27.202 [INFO] Downloading: https://repo.maven.apache.org/maven2/org/codehaus/plexus/plexus-interpolation/1.16/plexus-interpolation-1.16.jar
2017-06-21T12:38:27.211 [INFO] Downloaded: https://repo.maven.apache.org/maven2/org/sonatype/gossip/gossip-bootstrap/1.8/gossip-bootstrap-1.8.jar
(20 KB at 771.8 KB/sec)
2017-06-21T12:38:27.211 [INFO] Downloading: https://repo.maven.apache.org/maven2/org/eclipse/aether/aether-api/0.9.0.M2/aether-api-0.9.0.M2.jar
2017-06-21T12:38:27.212 [INFO] Downloaded: https://repo.maven.apache.org/maven2/org/sonatype/gossip/gossip-core/1.8/gossip-core-1.8.jar
(57 KB at 2171.5 KB/sec)
2017-06-21T12:38:27.212 [INFO] Downloading: https://repo.maven.apache.org/maven2/org/codehaus/gmaven/gmaven-adapter-api/2.0/gmaven-adapter-api-2.0.jar
2017-06-21T12:38:27.213 [INFO] Downloaded: https://repo.maven.apache.org/maven2/org/codehaus/plexus/plexus-classworlds/2.4.2/plexus-classworlds-2.4.2.jar
(46 KB at 1764.2 KB/sec)
2017-06-21T12:38:27.213 [INFO] Downloading: https://repo.maven.apache.org/maven2/org/codehaus/gmaven/gmaven-adapter-impl/2.0/gmaven-adapter-impl-2.0.jar
2017-06-21T12:38:27.223 [INFO] Downloaded: https://repo.maven.apache.org/maven2/org/codehaus/gmaven/gmaven-adapter-api/2.0/gmaven-adapter-api-2.0.jar
(7 KB at 192.0 KB/sec)
2017-06-21T12:38:27.224 [INFO] Downloading: https://repo.maven.apache.org/maven2/org/codehaus/groovy/groovy-all/2.1.5/groovy-all-2.1.5.jar
2017-06-21T12:38:27.226 [INFO] Downloaded: https://repo.maven.apache.org/maven2/org/codehaus/plexus/plexus-interpolation/1.16/plexus-interpolation-1.16.jar
(60 KB at 1535.2 KB/sec)
2017-06-21T12:38:27.226 [INFO] Downloading: https://repo.maven.apache.org/maven2/org/apache/ant/ant/1.8.4/ant-1.8.4.jar
2017-06-21T12:38:27.233 [INFO] Downloaded: https://repo.maven.apache.org/maven2/org/codehaus/gmaven/gmaven-adapter-impl/2.0/gmaven-adapter-impl-2.0.jar
(16 KB at 343.3 KB/sec)
2017-06-21T12:38:27.233 [INFO] Downloading: https://repo.maven.apache.org/maven2/org/apache/ant/ant-launcher/1.8.4/ant-launcher-1.8.4.jar
2017-06-21T12:38:27.244 [INFO] Downloaded: https://repo.maven.apache.org/maven2/org/eclipse/aether/aether-api/0.9.0.M2/aether-api-0.9.0.M2.jar
(131 KB at 2295.0 KB/sec)
2017-06-21T12:38:27.244 [INFO] Downloading: https://repo.maven.apache.org/maven2/org/fusesource/jansi/jansi/1.11/jansi-1.11.jar
2017-06-21T12:38:27.271 [INFO] Downloaded: https://repo.maven.apache.org/maven2/org/fusesource/jansi/jansi/1.11/jansi-1.11.jar
(112 KB at 1330.2 KB/sec)
2017-06-21T12:38:27.315 [INFO] Downloaded: https://repo.maven.apache.org/maven2/org/apache/ant/ant-launcher/1.8.4/ant-launcher-1.8.4.jar
(18 KB at 140.6 KB/sec)
2017-06-21T12:38:27.405 [INFO] Downloaded: https://repo.maven.apache.org/maven2/com/google/guava/guava/14.0.1/guava-14.0.1.jar
(2138 KB at 9761.7 KB/sec)
2017-06-21T12:38:27.411 [INFO] Downloaded: https://repo.maven.apache.org/maven2/org/apache/ant/ant/1.8.4/ant-1.8.4.jar
(1897 KB at 8465.3 KB/sec)
2017-06-21T12:38:27.846 [INFO] Downloaded: https://repo.maven.apache.org/maven2/org/codehaus/groovy/groovy-all/2.1.5/groovy-all-2.1.5.jar
(6219 KB at 9435.9 KB/sec)
[JENKINS] Archiving disabled
2017-06-21T12:38:31.108 [INFO]                                                           
             
2017-06-21T12:38:31.108 [INFO] ------------------------------------------------------------------------
2017-06-21T12:38:31.108 [INFO] Skipping Apache Beam :: Parent
2017-06-21T12:38:31.108 [INFO] This project has been banned from the build due to previous
failures.
2017-06-21T12:38:31.108 [INFO] ------------------------------------------------------------------------
[JENKINS] Archiving disabled
[JENKINS] Archiving disabled
[JENKINS] Archiving disabled
[JENKINS] Archiving disabled
[JENKINS] Archiving disabled
[JENKINS] Archiving disabled
[JENKINS] Archiving disabled
[JENKINS] Archiving disabled
[JENKINS] Archiving disabled
[JENKINS] Archiving disabled
[JENKINS] Archiving disabled
[JENKINS] Archiving disabled
[JENKINS] Archiving disabled
[JENKINS] Archiving disabled
[JENKINS] Archiving disabled
[JENKINS] Archiving disabled
[JENKINS] Archiving disabled
[JENKINS] Archiving disabled
[JENKINS] Archiving disabled
[JENKINS] Archiving disabled
[JENKINS] Archiving disabled
[JENKINS] Archiving disabled
[JENKINS] Archiving disabled
[JENKINS] Archiving disabled
[JENKINS] Archiving disabled
[JENKINS] Archiving disabled
[JENKINS] Archiving disabled
[JENKINS] Archiving disabled
[JENKINS] Archiving disabled
[JENKINS] Archiving disabled
[JENKINS] Archiving disabled
[JENKINS] Archiving disabled
[JENKINS] Archiving disabled
[JENKINS] Archiving disabled
[JENKINS] Archiving disabled
[JENKINS] Archiving disabled
[JENKINS] Archiving disabled
[JENKINS] Archiving disabled
[JENKINS] Archiving disabled
[JENKINS] Archiving disabled
[JENKINS] Archiving disabled
[JENKINS] Archiving disabled
[JENKINS] Archiving disabled
[JENKINS] Archiving disabled
[JENKINS] Archiving disabled
[JENKINS] Archiving disabled
[JENKINS] Archiving disabled
[JENKINS] Archiving disabled
[JENKINS] Archiving disabled
[JENKINS] Archiving disabled
2017-06-21T12:39:35.846 [INFO] ------------------------------------------------------------------------
2017-06-21T12:39:35.846 [INFO] Reactor Summary:
2017-06-21T12:39:35.846 [INFO] 
2017-06-21T12:39:35.846 [INFO] Apache Beam :: Parent .............................. SUCCESS
[ 25.269 s]
2017-06-21T12:39:35.847 [INFO] Apache Beam :: SDKs :: Java :: Build Tools ......... SUCCESS
[ 16.124 s]
2017-06-21T12:39:35.847 [INFO] Apache Beam :: SDKs ................................ SUCCESS
[  8.877 s]
2017-06-21T12:39:35.847 [INFO] Apache Beam :: SDKs :: Common ...................... SUCCESS
[  8.681 s]
2017-06-21T12:39:35.847 [INFO] Apache Beam :: SDKs :: Common :: Runner API ........ SUCCESS
[ 30.887 s]
2017-06-21T12:39:35.847 [INFO] Apache Beam :: SDKs :: Common :: Fn API ............ SUCCESS
[ 24.762 s]
2017-06-21T12:39:35.847 [INFO] Apache Beam :: SDKs :: Java ........................ SUCCESS
[  7.635 s]
2017-06-21T12:39:35.847 [INFO] Apache Beam :: SDKs :: Java :: Core ................ SUCCESS
[04:54 min]
2017-06-21T12:39:35.847 [INFO] Apache Beam :: Runners ............................. SUCCESS
[  9.854 s]
2017-06-21T12:39:35.847 [INFO] Apache Beam :: Runners :: Core Construction Java ... SUCCESS
[ 57.689 s]
2017-06-21T12:39:35.847 [INFO] Apache Beam :: Runners :: Core Java ................ SUCCESS
[01:23 min]
2017-06-21T12:39:35.847 [INFO] Apache Beam :: Runners :: Direct Java .............. SUCCESS
[04:07 min]
2017-06-21T12:39:35.847 [INFO] Apache Beam :: SDKs :: Java :: IO .................. SUCCESS
[  8.142 s]
2017-06-21T12:39:35.847 [INFO] Apache Beam :: SDKs :: Java :: IO :: Common ........ SUCCESS
[ 15.947 s]
2017-06-21T12:39:35.847 [INFO] Apache Beam :: SDKs :: Java :: IO :: Cassandra ..... SUCCESS
[ 46.950 s]
2017-06-21T12:39:35.847 [INFO] Apache Beam :: SDKs :: Java :: IO :: Elasticsearch . SUCCESS
[01:03 min]
2017-06-21T12:39:35.847 [INFO] Apache Beam :: SDKs :: Java :: Extensions .......... SUCCESS
[ 13.415 s]
2017-06-21T12:39:35.847 [INFO] Apache Beam :: SDKs :: Java :: Extensions :: Google Cloud Platform
Core SUCCESS [ 59.478 s]
2017-06-21T12:39:35.847 [INFO] Apache Beam :: SDKs :: Java :: Extensions :: Protobuf SUCCESS
[ 32.635 s]
2017-06-21T12:39:35.847 [INFO] Apache Beam :: SDKs :: Java :: IO :: Google Cloud Platform
SUCCESS [01:37 min]
2017-06-21T12:39:35.847 [INFO] Apache Beam :: SDKs :: Java :: IO :: Hadoop Common . SUCCESS
[ 34.993 s]
2017-06-21T12:39:35.848 [INFO] Apache Beam :: SDKs :: Java :: IO :: Hadoop File System SUCCESS
[ 44.468 s]
2017-06-21T12:39:35.848 [INFO] Apache Beam :: SDKs :: Java :: IO :: Hadoop ........ SUCCESS
[ 12.018 s]
2017-06-21T12:39:35.848 [INFO] Apache Beam :: SDKs :: Java :: IO :: Hadoop :: input-format
SUCCESS [ 39.747 s]
2017-06-21T12:39:35.848 [INFO] Apache Beam :: SDKs :: Java :: IO :: Hadoop :: jdk1.8-tests
SUCCESS [01:45 min]
2017-06-21T12:39:35.848 [INFO] Apache Beam :: SDKs :: Java :: IO :: HBase ......... SUCCESS
[ 43.666 s]
2017-06-21T12:39:35.848 [INFO] Apache Beam :: SDKs :: Java :: IO :: HCatalog ...... SUCCESS
[01:03 min]
2017-06-21T12:39:35.848 [INFO] Apache Beam :: SDKs :: Java :: IO :: JDBC .......... SUCCESS
[ 39.094 s]
2017-06-21T12:39:35.848 [INFO] Apache Beam :: SDKs :: Java :: IO :: JMS ........... SUCCESS
[ 33.048 s]
2017-06-21T12:39:35.848 [INFO] Apache Beam :: SDKs :: Java :: IO :: Kafka ......... SUCCESS
[ 43.960 s]
2017-06-21T12:39:35.848 [INFO] Apache Beam :: SDKs :: Java :: IO :: Kinesis ....... SUCCESS
[ 40.423 s]
2017-06-21T12:39:35.848 [INFO] Apache Beam :: SDKs :: Java :: IO :: MongoDB ....... SUCCESS
[ 55.788 s]
2017-06-21T12:39:35.848 [INFO] Apache Beam :: SDKs :: Java :: IO :: MQTT .......... SUCCESS
[ 33.196 s]
2017-06-21T12:39:35.848 [INFO] Apache Beam :: SDKs :: Java :: IO :: XML ........... SUCCESS
[ 31.490 s]
2017-06-21T12:39:35.848 [INFO] Apache Beam :: SDKs :: Java :: Maven Archetypes .... SUCCESS
[  6.508 s]
2017-06-21T12:39:35.848 [INFO] Apache Beam :: SDKs :: Java :: Maven Archetypes :: Starter
SUCCESS [ 25.455 s]
2017-06-21T12:39:35.848 [INFO] Apache Beam :: SDKs :: Java :: Extensions :: Jackson SUCCESS
[ 31.826 s]
2017-06-21T12:39:35.848 [INFO] Apache Beam :: SDKs :: Java :: Extensions :: Join library SUCCESS
[ 29.918 s]
2017-06-21T12:39:35.848 [INFO] Apache Beam :: SDKs :: Java :: Extensions :: Sorter  SUCCESS
[ 37.378 s]
2017-06-21T12:39:35.848 [INFO] Apache Beam :: Runners :: Google Cloud Dataflow .... SUCCESS
[ 52.018 s]
2017-06-21T12:39:35.848 [INFO] Apache Beam :: SDKs :: Java :: Harness ............. SUCCESS
[ 56.275 s]
2017-06-21T12:39:35.848 [INFO] Apache Beam :: SDKs :: Java :: Java 8 Tests ........ SUCCESS
[ 25.568 s]
2017-06-21T12:39:35.849 [INFO] Apache Beam :: SDKs :: Python ...................... FAILURE
[  3.662 s]
2017-06-21T12:39:35.849 [INFO] Apache Beam :: Runners :: Flink .................... SKIPPED
2017-06-21T12:39:35.849 [INFO] Apache Beam :: Runners :: Spark .................... SKIPPED
2017-06-21T12:39:35.849 [INFO] Apache Beam :: Runners :: Apex ..................... SKIPPED
2017-06-21T12:39:35.849 [INFO] Apache Beam :: Examples ............................ SKIPPED
2017-06-21T12:39:35.849 [INFO] Apache Beam :: Examples :: Java .................... SKIPPED
2017-06-21T12:39:35.849 [INFO] Apache Beam :: Examples :: Java 8 .................. SKIPPED
2017-06-21T12:39:35.849 [INFO] Apache Beam :: SDKs :: Java :: Aggregated Javadoc .. SKIPPED
2017-06-21T12:39:35.849 [INFO] ------------------------------------------------------------------------
2017-06-21T12:39:35.849 [INFO] BUILD FAILURE
2017-06-21T12:39:35.849 [INFO] ------------------------------------------------------------------------
2017-06-21T12:39:35.849 [INFO] Total time: 37:58 min
2017-06-21T12:39:35.849 [INFO] Finished at: 2017-06-21T12:39:35+00:00
2017-06-21T12:39:37.023 [INFO] Final Memory: 407M/2668M
2017-06-21T12:39:37.024 [INFO] ------------------------------------------------------------------------
2017-06-21T12:39:37.042 [ERROR] Failed to execute goal org.codehaus.gmaven:groovy-maven-plugin:2.0:execute
(find-supported-python-for-clean) on project beam-sdks-python: Unable to find Python 2.7 in
path -> [Help 1]
org.apache.maven.lifecycle.LifecycleExecutionException: Failed to execute goal org.codehaus.gmaven:groovy-maven-plugin:2.0:execute
(find-supported-python-for-clean) on project beam-sdks-python: Unable to find Python 2.7 in
path
	at org.apache.maven.lifecycle.internal.MojoExecutor.execute(MojoExecutor.java:212)
	at org.apache.maven.lifecycle.internal.MojoExecutor.execute(MojoExecutor.java:153)
	at org.apache.maven.lifecycle.internal.MojoExecutor.execute(MojoExecutor.java:145)
	at org.apache.maven.lifecycle.internal.LifecycleModuleBuilder.buildProject(LifecycleModuleBuilder.java:116)
	at org.apache.maven.lifecycle.internal.LifecycleModuleBuilder.buildProject(LifecycleModuleBuilder.java:80)
	at org.apache.maven.lifecycle.internal.builder.singlethreaded.SingleThreadedBuilder.build(SingleThreadedBuilder.java:51)
	at org.apache.maven.lifecycle.internal.LifecycleStarter.execute(LifecycleStarter.java:128)
	at org.apache.maven.DefaultMaven.doExecute(DefaultMaven.java:307)
	at org.apache.maven.DefaultMaven.doExecute(DefaultMaven.java:193)
	at org.apache.maven.DefaultMaven.execute(DefaultMaven.java:106)
	at org.jvnet.hudson.maven3.launcher.Maven33Launcher.main(Maven33Launcher.java:129)
	at sun.reflect.NativeMethodAccessorImpl.invoke0(Native Method)
	at sun.reflect.NativeMethodAccessorImpl.invoke(NativeMethodAccessorImpl.java:62)
	at sun.reflect.DelegatingMethodAccessorImpl.invoke(DelegatingMethodAccessorImpl.java:43)
	at java.lang.reflect.Method.invoke(Method.java:498)
	at org.codehaus.plexus.classworlds.launcher.Launcher.launchStandard(Launcher.java:330)
	at org.codehaus.plexus.classworlds.launcher.Launcher.launch(Launcher.java:238)
	at jenkins.maven3.agent.Maven33Main.launch(Maven33Main.java:176)
	at sun.reflect.NativeMethodAccessorImpl.invoke0(Native Method)
	at sun.reflect.NativeMethodAccessorImpl.invoke(NativeMethodAccessorImpl.java:62)
	at sun.reflect.DelegatingMethodAccessorImpl.invoke(DelegatingMethodAccessorImpl.java:43)
	at java.lang.reflect.Method.invoke(Method.java:498)
	at hudson.maven.Maven3Builder.call(Maven3Builder.java:139)
	at hudson.maven.Maven3Builder.call(Maven3Builder.java:70)
	at hudson.remoting.UserRequest.perform(UserRequest.java:120)
	at hudson.remoting.UserRequest.perform(UserRequest.java:48)
	at hudson.remoting.Request$2.run(Request.java:326)
	at hudson.remoting.InterceptingExecutorService$1.call(InterceptingExecutorService.java:68)
	at java.util.concurrent.FutureTask.run(FutureTask.java:266)
	at java.util.concurrent.ThreadPoolExecutor.runWorker(ThreadPoolExecutor.java:1142)
	at java.util.concurrent.ThreadPoolExecutor$Worker.run(ThreadPoolExecutor.java:617)
	at java.lang.Thread.run(Thread.java:745)
Caused by: org.apache.maven.plugin.MojoFailureException: Unable to find Python 2.7 in path
	at sun.reflect.NativeConstructorAccessorImpl.newInstance0(Native Method)
	at sun.reflect.NativeConstructorAccessorImpl.newInstance(NativeConstructorAccessorImpl.java:62)
	at sun.reflect.DelegatingConstructorAccessorImpl.newInstance(DelegatingConstructorAccessorImpl.java:45)
	at java.lang.reflect.Constructor.newInstance(Constructor.java:423)
	at org.codehaus.groovy.reflection.CachedConstructor.invoke(CachedConstructor.java:77)
	at org.codehaus.groovy.runtime.callsite.ConstructorSite$ConstructorSiteNoUnwrapNoCoerce.callConstructor(ConstructorSite.java:102)
	at org.codehaus.groovy.runtime.callsite.CallSiteArray.defaultCallConstructor(CallSiteArray.java:57)
	at org.codehaus.groovy.runtime.callsite.AbstractCallSite.callConstructor(AbstractCallSite.java:182)
	at org.codehaus.groovy.runtime.callsite.AbstractCallSite.callConstructor(AbstractCallSite.java:190)
	at findSupportedPython.run(findSupportedPython.groovy:70)
	at groovy.lang.GroovyShell.evaluate(GroovyShell.java:518)
	at org.codehaus.gmaven.adapter.impl.ScriptExecutorImpl.execute(ScriptExecutorImpl.java:80)
	at org.codehaus.gmaven.plugin.ExecuteMojo$1.run(ExecuteMojo.java:100)
	at org.codehaus.gmaven.plugin.util.SystemNoExitGuard.run(SystemNoExitGuard.java:45)
	at org.codehaus.gmaven.plugin.ExecuteMojo.run(ExecuteMojo.java:96)
	at org.codehaus.gmaven.plugin.MojoSupport.execute(MojoSupport.java:45)
	at org.apache.maven.plugin.DefaultBuildPluginManager.executeMojo(DefaultBuildPluginManager.java:134)
	at org.apache.maven.lifecycle.internal.MojoExecutor.execute(MojoExecutor.java:208)
	... 31 more
2017-06-21T12:39:37.049 [ERROR] 
2017-06-21T12:39:37.049 [ERROR] Re-run Maven using the -X switch to enable full debug logging.
2017-06-21T12:39:37.049 [ERROR] 
2017-06-21T12:39:37.049 [ERROR] For more information about the errors and possible solutions,
please read the following articles:
2017-06-21T12:39:37.049 [ERROR] [Help 1] http://cwiki.apache.org/confluence/display/MAVEN/MojoFailureException
2017-06-21T12:39:37.050 [ERROR] 
2017-06-21T12:39:37.050 [ERROR] After correcting the problems, you can resume the build with
the command
2017-06-21T12:39:37.050 [ERROR]   mvn <goals> -rf :beam-sdks-python
channel stopped
Not sending mail to unregistered user aljoscha.krettek@gmail.com
Not sending mail to unregistered user github@nakomis.com
Not sending mail to unregistered user hepei.hp@alibaba-inc.com
Not sending mail to unregistered user sourabhbajaj@google.com
Not sending mail to unregistered user klk@google.com
Not sending mail to unregistered user ccy@google.com
Not sending mail to unregistered user kirpichov@google.com
Not sending mail to unregistered user mingmxu@ebay.com

Mime
View raw message