beam-commits mailing list archives

Site index · List index
Message view « Date » · « Thread »
Top « Date » · « Thread »
From Apache Jenkins Server <jenk...@builds.apache.org>
Subject Build failed in Jenkins: beam_PostCommit_Java_ValidatesRunner_Flink #3203
Date Wed, 21 Jun 2017 20:50:01 GMT
See <https://builds.apache.org/job/beam_PostCommit_Java_ValidatesRunner_Flink/3203/display/redirect?page=changes>

Changes:

[altay] Allow production of unprocessed bundles, introduce TestStream evaluator

------------------------------------------
[...truncated 465.87 KB...]
2017-06-21T20:49:50.968 [INFO] Downloaded: https://repo.maven.apache.org/maven2/commons-beanutils/commons-beanutils-bean-collections/1.8.3/commons-beanutils-bean-collections-1.8.3.pom
(2 KB at 72.9 KB/sec)
2017-06-21T20:49:50.970 [INFO] Downloading: https://repo.maven.apache.org/maven2/commons-daemon/commons-daemon/1.0.13/commons-daemon-1.0.13.pom
2017-06-21T20:49:50.998 [INFO] Downloaded: https://repo.maven.apache.org/maven2/commons-daemon/commons-daemon/1.0.13/commons-daemon-1.0.13.pom
(5 KB at 151.7 KB/sec)
2017-06-21T20:49:51.001 [INFO] Downloading: https://repo.maven.apache.org/maven2/javax/xml/bind/jaxb-api/2.2.2/jaxb-api-2.2.2.pom
2017-06-21T20:49:51.030 [INFO] Downloaded: https://repo.maven.apache.org/maven2/javax/xml/bind/jaxb-api/2.2.2/jaxb-api-2.2.2.pom
(6 KB at 187.6 KB/sec)
2017-06-21T20:49:51.032 [INFO] Downloading: https://repo.maven.apache.org/maven2/javax/xml/stream/stax-api/1.0-2/stax-api-1.0-2.pom
2017-06-21T20:49:51.069 [INFO] Downloaded: https://repo.maven.apache.org/maven2/javax/xml/stream/stax-api/1.0-2/stax-api-1.0-2.pom
(962 B at 25.4 KB/sec)
2017-06-21T20:49:51.070 [INFO] Downloading: https://repo.maven.apache.org/maven2/javax/activation/activation/1.1/activation-1.1.pom
2017-06-21T20:49:51.097 [INFO] Downloaded: https://repo.maven.apache.org/maven2/javax/activation/activation/1.1/activation-1.1.pom
(2 KB at 38.3 KB/sec)
2017-06-21T20:49:51.099 [INFO] Downloading: https://repo.maven.apache.org/maven2/org/apache/flink/flink-runtime_2.10/1.3.0/flink-runtime_2.10-1.3.0.pom
2017-06-21T20:49:51.139 [INFO] Downloaded: https://repo.maven.apache.org/maven2/org/apache/flink/flink-runtime_2.10/1.3.0/flink-runtime_2.10-1.3.0.pom
(14 KB at 348.2 KB/sec)
2017-06-21T20:49:51.143 [INFO] Downloading: https://repo.maven.apache.org/maven2/io/netty/netty-all/4.0.27.Final/netty-all-4.0.27.Final.pom
2017-06-21T20:49:51.171 [INFO] Downloaded: https://repo.maven.apache.org/maven2/io/netty/netty-all/4.0.27.Final/netty-all-4.0.27.Final.pom
(17 KB at 601.8 KB/sec)
2017-06-21T20:49:51.173 [INFO] Downloading: https://repo.maven.apache.org/maven2/io/netty/netty-parent/4.0.27.Final/netty-parent-4.0.27.Final.pom
2017-06-21T20:49:51.208 [INFO] Downloaded: https://repo.maven.apache.org/maven2/io/netty/netty-parent/4.0.27.Final/netty-parent-4.0.27.Final.pom
(48 KB at 1361.2 KB/sec)
2017-06-21T20:49:51.215 [INFO] Downloading: https://repo.maven.apache.org/maven2/org/javassist/javassist/3.18.2-GA/javassist-3.18.2-GA.pom
2017-06-21T20:49:51.246 [INFO] Downloaded: https://repo.maven.apache.org/maven2/org/javassist/javassist/3.18.2-GA/javassist-3.18.2-GA.pom
(10 KB at 300.0 KB/sec)
2017-06-21T20:49:51.248 [INFO] Downloading: https://repo.maven.apache.org/maven2/org/scala-lang/scala-library/2.10.4/scala-library-2.10.4.pom
2017-06-21T20:49:51.275 [INFO] Downloaded: https://repo.maven.apache.org/maven2/org/scala-lang/scala-library/2.10.4/scala-library-2.10.4.pom
(2 KB at 73.9 KB/sec)
2017-06-21T20:49:51.277 [INFO] Downloading: https://repo.maven.apache.org/maven2/com/data-artisans/flakka-actor_2.10/2.3-custom/flakka-actor_2.10-2.3-custom.pom
2017-06-21T20:49:51.313 [INFO] Downloaded: https://repo.maven.apache.org/maven2/com/data-artisans/flakka-actor_2.10/2.3-custom/flakka-actor_2.10-2.3-custom.pom
(2 KB at 52.5 KB/sec)
2017-06-21T20:49:51.315 [INFO] Downloading: https://repo.maven.apache.org/maven2/com/typesafe/config/1.2.1/config-1.2.1.pom
2017-06-21T20:49:51.343 [INFO] Downloaded: https://repo.maven.apache.org/maven2/com/typesafe/config/1.2.1/config-1.2.1.pom
(2 KB at 65.1 KB/sec)
2017-06-21T20:49:51.345 [INFO] Downloading: https://repo.maven.apache.org/maven2/com/data-artisans/flakka-remote_2.10/2.3-custom/flakka-remote_2.10-2.3-custom.pom
2017-06-21T20:49:51.375 [INFO] Downloaded: https://repo.maven.apache.org/maven2/com/data-artisans/flakka-remote_2.10/2.3-custom/flakka-remote_2.10-2.3-custom.pom
(4 KB at 116.8 KB/sec)
2017-06-21T20:49:51.377 [INFO] Downloading: https://repo.maven.apache.org/maven2/io/netty/netty/3.8.0.Final/netty-3.8.0.Final.pom
2017-06-21T20:49:51.407 [INFO] Downloaded: https://repo.maven.apache.org/maven2/io/netty/netty/3.8.0.Final/netty-3.8.0.Final.pom
(26 KB at 853.0 KB/sec)
2017-06-21T20:49:51.412 [INFO] Downloading: https://repo.maven.apache.org/maven2/org/uncommons/maths/uncommons-maths/1.2.2a/uncommons-maths-1.2.2a.pom
2017-06-21T20:49:51.445 [INFO] Downloaded: https://repo.maven.apache.org/maven2/org/uncommons/maths/uncommons-maths/1.2.2a/uncommons-maths-1.2.2a.pom
(2 KB at 48.8 KB/sec)
2017-06-21T20:49:51.446 [INFO] Downloading: https://repo.maven.apache.org/maven2/com/data-artisans/flakka-slf4j_2.10/2.3-custom/flakka-slf4j_2.10-2.3-custom.pom
2017-06-21T20:49:51.475 [INFO] Downloaded: https://repo.maven.apache.org/maven2/com/data-artisans/flakka-slf4j_2.10/2.3-custom/flakka-slf4j_2.10-2.3-custom.pom
(3 KB at 86.2 KB/sec)
2017-06-21T20:49:51.476 [INFO] Downloading: https://repo.maven.apache.org/maven2/org/clapper/grizzled-slf4j_2.10/1.0.2/grizzled-slf4j_2.10-1.0.2.pom
2017-06-21T20:49:51.503 [INFO] Downloaded: https://repo.maven.apache.org/maven2/org/clapper/grizzled-slf4j_2.10/1.0.2/grizzled-slf4j_2.10-1.0.2.pom
(2 KB at 69.3 KB/sec)
2017-06-21T20:49:51.504 [INFO] Downloading: https://repo.maven.apache.org/maven2/org/scala-lang/scala-library/2.10.3/scala-library-2.10.3.pom
2017-06-21T20:49:51.532 [INFO] Downloaded: https://repo.maven.apache.org/maven2/org/scala-lang/scala-library/2.10.3/scala-library-2.10.3.pom
(2 KB at 71.3 KB/sec)
2017-06-21T20:49:51.534 [INFO] Downloading: https://repo.maven.apache.org/maven2/com/github/scopt/scopt_2.10/3.5.0/scopt_2.10-3.5.0.pom
2017-06-21T20:49:51.563 [INFO] Downloaded: https://repo.maven.apache.org/maven2/com/github/scopt/scopt_2.10/3.5.0/scopt_2.10-3.5.0.pom
(2 KB at 56.4 KB/sec)
2017-06-21T20:49:51.564 [INFO] Downloading: https://repo.maven.apache.org/maven2/org/apache/zookeeper/zookeeper/3.4.6/zookeeper-3.4.6.pom
2017-06-21T20:49:51.591 [INFO] Downloaded: https://repo.maven.apache.org/maven2/org/apache/zookeeper/zookeeper/3.4.6/zookeeper-3.4.6.pom
(4 KB at 121.8 KB/sec)
2017-06-21T20:49:51.593 [INFO] Downloading: https://repo.maven.apache.org/maven2/jline/jline/0.9.94/jline-0.9.94.pom
2017-06-21T20:49:51.621 [INFO] Downloaded: https://repo.maven.apache.org/maven2/jline/jline/0.9.94/jline-0.9.94.pom
(7 KB at 221.8 KB/sec)
2017-06-21T20:49:51.623 [INFO] Downloading: https://repo.maven.apache.org/maven2/io/netty/netty/3.7.0.Final/netty-3.7.0.Final.pom
2017-06-21T20:49:51.652 [INFO] Downloaded: https://repo.maven.apache.org/maven2/io/netty/netty/3.7.0.Final/netty-3.7.0.Final.pom
(26 KB at 882.4 KB/sec)
2017-06-21T20:49:51.657 [INFO] Downloading: https://repo.maven.apache.org/maven2/com/twitter/chill_2.10/0.7.4/chill_2.10-0.7.4.pom
2017-06-21T20:49:51.686 [INFO] Downloaded: https://repo.maven.apache.org/maven2/com/twitter/chill_2.10/0.7.4/chill_2.10-0.7.4.pom
(3 KB at 79.9 KB/sec)
2017-06-21T20:49:51.688 [INFO] Downloading: https://repo.maven.apache.org/maven2/org/scala-lang/scala-library/2.10.5/scala-library-2.10.5.pom
2017-06-21T20:49:51.716 [INFO] Downloaded: https://repo.maven.apache.org/maven2/org/scala-lang/scala-library/2.10.5/scala-library-2.10.5.pom
(2 KB at 71.3 KB/sec)
2017-06-21T20:49:51.717 [INFO] Downloading: https://repo.maven.apache.org/maven2/com/twitter/chill-java/0.7.4/chill-java-0.7.4.pom
2017-06-21T20:49:51.766 [INFO] Downloaded: https://repo.maven.apache.org/maven2/com/twitter/chill-java/0.7.4/chill-java-0.7.4.pom
(2 KB at 40.5 KB/sec)
2017-06-21T20:49:51.768 [INFO] Downloading: https://repo.maven.apache.org/maven2/org/apache/flink/flink-streaming-java_2.10/1.3.0/flink-streaming-java_2.10-1.3.0.pom
2017-06-21T20:49:51.799 [INFO] Downloaded: https://repo.maven.apache.org/maven2/org/apache/flink/flink-streaming-java_2.10/1.3.0/flink-streaming-java_2.10-1.3.0.pom
(7 KB at 194.5 KB/sec)
2017-06-21T20:49:51.805 [INFO] Downloading: https://repo.maven.apache.org/maven2/org/apache/sling/org.apache.sling.commons.json/2.0.6/org.apache.sling.commons.json-2.0.6.pom
2017-06-21T20:49:51.838 [INFO] Downloaded: https://repo.maven.apache.org/maven2/org/apache/sling/org.apache.sling.commons.json/2.0.6/org.apache.sling.commons.json-2.0.6.pom
(4 KB at 98.9 KB/sec)
2017-06-21T20:49:51.839 [INFO] Downloading: https://repo.maven.apache.org/maven2/org/apache/sling/sling/10/sling-10.pom
2017-06-21T20:49:51.868 [INFO] Downloaded: https://repo.maven.apache.org/maven2/org/apache/sling/sling/10/sling-10.pom
(26 KB at 864.3 KB/sec)
2017-06-21T20:49:51.870 [INFO] Downloading: https://repo.maven.apache.org/maven2/org/apache/apache/8/apache-8.pom
2017-06-21T20:49:51.898 [INFO] Downloaded: https://repo.maven.apache.org/maven2/org/apache/apache/8/apache-8.pom
(14 KB at 490.2 KB/sec)
2017-06-21T20:49:51.909 [INFO] Downloading: https://repo.maven.apache.org/maven2/com/google/apis/google-api-services-bigquery/v2-rev295-1.22.0/google-api-services-bigquery-v2-rev295-1.22.0.pom
2017-06-21T20:49:51.937 [INFO] Downloaded: https://repo.maven.apache.org/maven2/com/google/apis/google-api-services-bigquery/v2-rev295-1.22.0/google-api-services-bigquery-v2-rev295-1.22.0.pom
(3 KB at 91.2 KB/sec)
2017-06-21T20:49:51.939 [INFO] Downloading: https://repo.maven.apache.org/maven2/com/google/api-client/google-api-client/1.22.0/google-api-client-1.22.0.pom
2017-06-21T20:49:51.965 [INFO] Downloaded: https://repo.maven.apache.org/maven2/com/google/api-client/google-api-client/1.22.0/google-api-client-1.22.0.pom
(4 KB at 146.9 KB/sec)
2017-06-21T20:49:51.966 [INFO] Downloading: https://repo.maven.apache.org/maven2/com/google/api-client/google-api-client-parent/1.22.0/google-api-client-parent-1.22.0.pom
2017-06-21T20:49:51.996 [INFO] Downloaded: https://repo.maven.apache.org/maven2/com/google/api-client/google-api-client-parent/1.22.0/google-api-client-parent-1.22.0.pom
(25 KB at 801.1 KB/sec)
2017-06-21T20:49:51.999 [INFO] Downloading: https://repo.maven.apache.org/maven2/com/google/oauth-client/google-oauth-client/1.22.0/google-oauth-client-1.22.0.pom
2017-06-21T20:49:52.028 [INFO] Downloaded: https://repo.maven.apache.org/maven2/com/google/oauth-client/google-oauth-client/1.22.0/google-oauth-client-1.22.0.pom
(3 KB at 97.4 KB/sec)
2017-06-21T20:49:52.029 [INFO] Downloading: https://repo.maven.apache.org/maven2/com/google/oauth-client/google-oauth-client-parent/1.22.0/google-oauth-client-parent-1.22.0.pom
2017-06-21T20:49:52.058 [INFO] Downloaded: https://repo.maven.apache.org/maven2/com/google/oauth-client/google-oauth-client-parent/1.22.0/google-oauth-client-parent-1.22.0.pom
(21 KB at 717.1 KB/sec)
2017-06-21T20:49:52.061 [INFO] Downloading: https://repo.maven.apache.org/maven2/com/google/http-client/google-http-client/1.22.0/google-http-client-1.22.0.pom
2017-06-21T20:49:52.089 [INFO] Downloaded: https://repo.maven.apache.org/maven2/com/google/http-client/google-http-client/1.22.0/google-http-client-1.22.0.pom
(6 KB at 179.1 KB/sec)
2017-06-21T20:49:52.090 [INFO] Downloading: https://repo.maven.apache.org/maven2/com/google/http-client/google-http-client-parent/1.22.0/google-http-client-parent-1.22.0.pom
2017-06-21T20:49:52.119 [INFO] Downloaded: https://repo.maven.apache.org/maven2/com/google/http-client/google-http-client-parent/1.22.0/google-http-client-parent-1.22.0.pom
(25 KB at 857.2 KB/sec)
2017-06-21T20:49:52.122 [INFO] Downloading: https://repo.maven.apache.org/maven2/org/apache/httpcomponents/httpclient/4.0.1/httpclient-4.0.1.pom
2017-06-21T20:49:52.156 [INFO] Downloaded: https://repo.maven.apache.org/maven2/org/apache/httpcomponents/httpclient/4.0.1/httpclient-4.0.1.pom
(7 KB at 195.3 KB/sec)
2017-06-21T20:49:52.157 [INFO] Downloading: https://repo.maven.apache.org/maven2/org/apache/httpcomponents/httpcomponents-client/4.0.1/httpcomponents-client-4.0.1.pom
2017-06-21T20:49:52.185 [INFO] Downloaded: https://repo.maven.apache.org/maven2/org/apache/httpcomponents/httpcomponents-client/4.0.1/httpcomponents-client-4.0.1.pom
(9 KB at 320.7 KB/sec)
2017-06-21T20:49:52.187 [INFO] Downloading: https://repo.maven.apache.org/maven2/com/google/http-client/google-http-client-jackson2/1.22.0/google-http-client-jackson2-1.22.0.pom
2017-06-21T20:49:52.217 [INFO] Downloaded: https://repo.maven.apache.org/maven2/com/google/http-client/google-http-client-jackson2/1.22.0/google-http-client-jackson2-1.22.0.pom
(3 KB at 89.6 KB/sec)
2017-06-21T20:49:52.222 [INFO] Downloading: https://repo.maven.apache.org/maven2/org/apache/flink/flink-test-utils_2.10/1.3.0/flink-test-utils_2.10-1.3.0.pom
2017-06-21T20:49:52.250 [INFO] Downloaded: https://repo.maven.apache.org/maven2/org/apache/flink/flink-test-utils_2.10/1.3.0/flink-test-utils_2.10-1.3.0.pom
(5 KB at 165.4 KB/sec)
2017-06-21T20:49:52.251 [INFO] Downloading: https://repo.maven.apache.org/maven2/org/apache/flink/flink-test-utils-parent/1.3.0/flink-test-utils-parent-1.3.0.pom
2017-06-21T20:49:52.287 [INFO] Downloaded: https://repo.maven.apache.org/maven2/org/apache/flink/flink-test-utils-parent/1.3.0/flink-test-utils-parent-1.3.0.pom
(2 KB at 39.1 KB/sec)
2017-06-21T20:49:52.291 [INFO] Downloading: https://repo.maven.apache.org/maven2/org/apache/flink/flink-test-utils-junit/1.3.0/flink-test-utils-junit-1.3.0.pom
2017-06-21T20:49:52.317 [INFO] Downloaded: https://repo.maven.apache.org/maven2/org/apache/flink/flink-test-utils-junit/1.3.0/flink-test-utils-junit-1.3.0.pom
(4 KB at 123.4 KB/sec)
2017-06-21T20:49:52.322 [INFO] Downloading: https://repo.maven.apache.org/maven2/org/apache/curator/curator-test/2.12.0/curator-test-2.12.0.pom
2017-06-21T20:49:52.351 [INFO] Downloaded: https://repo.maven.apache.org/maven2/org/apache/curator/curator-test/2.12.0/curator-test-2.12.0.pom
(5 KB at 139.6 KB/sec)
2017-06-21T20:49:52.352 [INFO] Downloading: https://repo.maven.apache.org/maven2/org/apache/curator/apache-curator/2.12.0/apache-curator-2.12.0.pom
2017-06-21T20:49:52.382 [INFO] Downloaded: https://repo.maven.apache.org/maven2/org/apache/curator/apache-curator/2.12.0/apache-curator-2.12.0.pom
(32 KB at 1052.4 KB/sec)
2017-06-21T20:49:52.387 [INFO] Downloading: https://repo.maven.apache.org/maven2/org/apache/zookeeper/zookeeper/3.4.8/zookeeper-3.4.8.pom
2017-06-21T20:49:52.414 [INFO] Downloaded: https://repo.maven.apache.org/maven2/org/apache/zookeeper/zookeeper/3.4.8/zookeeper-3.4.8.pom
(4 KB at 145.6 KB/sec)
2017-06-21T20:49:52.416 [INFO] Downloading: https://repo.maven.apache.org/maven2/log4j/log4j/1.2.16/log4j-1.2.16.pom
2017-06-21T20:49:52.451 [INFO] Downloaded: https://repo.maven.apache.org/maven2/log4j/log4j/1.2.16/log4j-1.2.16.pom
(20 KB at 567.5 KB/sec)
2017-06-21T20:49:52.453 [INFO] Downloading: https://repo.maven.apache.org/maven2/org/javassist/javassist/3.18.1-GA/javassist-3.18.1-GA.pom
2017-06-21T20:49:52.479 [INFO] Downloaded: https://repo.maven.apache.org/maven2/org/javassist/javassist/3.18.1-GA/javassist-3.18.1-GA.pom
(10 KB at 357.6 KB/sec)
[JENKINS] Archiving disabled
[JENKINS] Archiving disabled
[JENKINS] Archiving disabled
[JENKINS] Archiving disabled
[JENKINS] Archiving disabled
[JENKINS] Archiving disabled
[JENKINS] Archiving disabled
[JENKINS] Archiving disabled
[JENKINS] Archiving disabled
[JENKINS] Archiving disabled
[JENKINS] Archiving disabled
[JENKINS] Archiving disabled
[JENKINS] Archiving disabled
2017-06-21T20:49:56.493 [INFO] ------------------------------------------------------------------------
2017-06-21T20:49:56.493 [INFO] Reactor Summary:
2017-06-21T20:49:56.493 [INFO] 
2017-06-21T20:49:56.493 [INFO] Apache Beam :: Parent .............................. SUCCESS
[ 21.165 s]
2017-06-21T20:49:56.493 [INFO] Apache Beam :: SDKs :: Java :: Build Tools ......... SUCCESS
[  8.449 s]
2017-06-21T20:49:56.493 [INFO] Apache Beam :: SDKs ................................ SUCCESS
[  2.017 s]
2017-06-21T20:49:56.493 [INFO] Apache Beam :: SDKs :: Common ...................... SUCCESS
[  1.453 s]
2017-06-21T20:49:56.493 [INFO] Apache Beam :: SDKs :: Common :: Runner API ........ SUCCESS
[  9.791 s]
2017-06-21T20:49:56.493 [INFO] Apache Beam :: SDKs :: Common :: Fn API ............ SUCCESS
[  8.429 s]
2017-06-21T20:49:56.493 [INFO] Apache Beam :: SDKs :: Java ........................ SUCCESS
[  2.121 s]
2017-06-21T20:49:56.493 [INFO] Apache Beam :: SDKs :: Java :: Core ................ SUCCESS
[01:44 min]
2017-06-21T20:49:56.493 [INFO] Apache Beam :: Runners ............................. SUCCESS
[  1.524 s]
2017-06-21T20:49:56.493 [INFO] Apache Beam :: Runners :: Core Construction Java ... SUCCESS
[ 13.691 s]
2017-06-21T20:49:56.493 [INFO] Apache Beam :: Runners :: Core Java ................ SUCCESS
[ 26.976 s]
2017-06-21T20:49:56.493 [INFO] Apache Beam :: Runners :: Flink .................... FAILURE
[  2.910 s]
2017-06-21T20:49:56.493 [INFO] ------------------------------------------------------------------------
2017-06-21T20:49:56.493 [INFO] BUILD FAILURE
2017-06-21T20:49:56.493 [INFO] ------------------------------------------------------------------------
2017-06-21T20:49:56.493 [INFO] Total time: 04:02 min
2017-06-21T20:49:56.494 [INFO] Finished at: 2017-06-21T20:49:56+00:00
2017-06-21T20:49:56.953 [INFO] Final Memory: 118M/1434M
2017-06-21T20:49:56.953 [INFO] ------------------------------------------------------------------------
2017-06-21T20:49:56.953 [WARNING] The requested profile "validates-runner-tests" could not
be activated because it does not exist.
Waiting for Jenkins to finish collecting data
2017-06-21T20:49:57.773 [ERROR] Failed to execute goal on project beam-runners-flink_2.10:
Could not resolve dependencies for project org.apache.beam:beam-runners-flink_2.10:jar:2.1.0-SNAPSHOT:
Failed to collect dependencies at org.apache.flink:flink-clients_2.10:jar:1.3.0: Failed to
read artifact descriptor for org.apache.flink:flink-clients_2.10:jar:1.3.0: Could not transfer
artifact org.apache.flink:flink-clients_2.10:pom:1.3.0 from/to central (https://repo.maven.apache.org/maven2):
Connection reset -> [Help 1]
org.apache.maven.lifecycle.LifecycleExecutionException: Failed to execute goal on project
beam-runners-flink_2.10: Could not resolve dependencies for project org.apache.beam:beam-runners-flink_2.10:jar:2.1.0-SNAPSHOT:
Failed to collect dependencies at org.apache.flink:flink-clients_2.10:jar:1.3.0
	at org.apache.maven.lifecycle.internal.LifecycleDependencyResolver.getDependencies(LifecycleDependencyResolver.java:221)
	at org.apache.maven.lifecycle.internal.LifecycleDependencyResolver.resolveProjectDependencies(LifecycleDependencyResolver.java:127)
	at org.apache.maven.lifecycle.internal.MojoExecutor.ensureDependenciesAreResolved(MojoExecutor.java:257)
	at org.apache.maven.lifecycle.internal.MojoExecutor.execute(MojoExecutor.java:200)
	at org.apache.maven.lifecycle.internal.MojoExecutor.execute(MojoExecutor.java:153)
	at org.apache.maven.lifecycle.internal.MojoExecutor.execute(MojoExecutor.java:145)
	at org.apache.maven.lifecycle.internal.LifecycleModuleBuilder.buildProject(LifecycleModuleBuilder.java:116)
	at org.apache.maven.lifecycle.internal.LifecycleModuleBuilder.buildProject(LifecycleModuleBuilder.java:80)
	at org.apache.maven.lifecycle.internal.builder.singlethreaded.SingleThreadedBuilder.build(SingleThreadedBuilder.java:51)
	at org.apache.maven.lifecycle.internal.LifecycleStarter.execute(LifecycleStarter.java:128)
	at org.apache.maven.DefaultMaven.doExecute(DefaultMaven.java:307)
	at org.apache.maven.DefaultMaven.doExecute(DefaultMaven.java:193)
	at org.apache.maven.DefaultMaven.execute(DefaultMaven.java:106)
	at org.jvnet.hudson.maven3.launcher.Maven33Launcher.main(Maven33Launcher.java:129)
	at sun.reflect.NativeMethodAccessorImpl.invoke0(Native Method)
	at sun.reflect.NativeMethodAccessorImpl.invoke(NativeMethodAccessorImpl.java:62)
	at sun.reflect.DelegatingMethodAccessorImpl.invoke(DelegatingMethodAccessorImpl.java:43)
	at java.lang.reflect.Method.invoke(Method.java:498)
	at org.codehaus.plexus.classworlds.launcher.Launcher.launchStandard(Launcher.java:330)
	at org.codehaus.plexus.classworlds.launcher.Launcher.launch(Launcher.java:238)
	at jenkins.maven3.agent.Maven33Main.launch(Maven33Main.java:176)
	at sun.reflect.NativeMethodAccessorImpl.invoke0(Native Method)
	at sun.reflect.NativeMethodAccessorImpl.invoke(NativeMethodAccessorImpl.java:62)
	at sun.reflect.DelegatingMethodAccessorImpl.invoke(DelegatingMethodAccessorImpl.java:43)
	at java.lang.reflect.Method.invoke(Method.java:498)
	at hudson.maven.Maven3Builder.call(Maven3Builder.java:139)
	at hudson.maven.Maven3Builder.call(Maven3Builder.java:70)
	at hudson.remoting.UserRequest.perform(UserRequest.java:153)
	at hudson.remoting.UserRequest.perform(UserRequest.java:50)
	at hudson.remoting.Request$2.run(Request.java:336)
	at hudson.remoting.InterceptingExecutorService$1.call(InterceptingExecutorService.java:68)
	at java.util.concurrent.FutureTask.run(FutureTask.java:266)
	at java.util.concurrent.ThreadPoolExecutor.runWorker(ThreadPoolExecutor.java:1142)
	at java.util.concurrent.ThreadPoolExecutor$Worker.run(ThreadPoolExecutor.java:617)
	at java.lang.Thread.run(Thread.java:748)
Caused by: org.apache.maven.project.DependencyResolutionException: Could not resolve dependencies
for project org.apache.beam:beam-runners-flink_2.10:jar:2.1.0-SNAPSHOT: Failed to collect
dependencies at org.apache.flink:flink-clients_2.10:jar:1.3.0
	at org.apache.maven.project.DefaultProjectDependenciesResolver.resolve(DefaultProjectDependenciesResolver.java:180)
	at org.apache.maven.lifecycle.internal.LifecycleDependencyResolver.getDependencies(LifecycleDependencyResolver.java:195)
	... 34 more
Caused by: org.eclipse.aether.collection.DependencyCollectionException: Failed to collect
dependencies at org.apache.flink:flink-clients_2.10:jar:1.3.0
	at org.eclipse.aether.internal.impl.DefaultDependencyCollector.collectDependencies(DefaultDependencyCollector.java:291)
	at org.eclipse.aether.internal.impl.DefaultRepositorySystem.collectDependencies(DefaultRepositorySystem.java:316)
	at org.apache.maven.project.DefaultProjectDependenciesResolver.resolve(DefaultProjectDependenciesResolver.java:172)
	... 35 more
Caused by: org.eclipse.aether.resolution.ArtifactDescriptorException: Failed to read artifact
descriptor for org.apache.flink:flink-clients_2.10:jar:1.3.0
	at org.apache.maven.repository.internal.DefaultArtifactDescriptorReader.loadPom(DefaultArtifactDescriptorReader.java:302)
	at org.apache.maven.repository.internal.DefaultArtifactDescriptorReader.readArtifactDescriptor(DefaultArtifactDescriptorReader.java:218)
	at org.eclipse.aether.internal.impl.DefaultDependencyCollector.resolveCachedArtifactDescriptor(DefaultDependencyCollector.java:535)
	at org.eclipse.aether.internal.impl.DefaultDependencyCollector.getArtifactDescriptorResult(DefaultDependencyCollector.java:519)
	at org.eclipse.aether.internal.impl.DefaultDependencyCollector.processDependency(DefaultDependencyCollector.java:409)
	at org.eclipse.aether.internal.impl.DefaultDependencyCollector.processDependency(DefaultDependencyCollector.java:363)
	at org.eclipse.aether.internal.impl.DefaultDependencyCollector.process(DefaultDependencyCollector.java:351)
	at org.eclipse.aether.internal.impl.DefaultDependencyCollector.collectDependencies(DefaultDependencyCollector.java:254)
	... 37 more
Caused by: org.eclipse.aether.resolution.ArtifactResolutionException: Could not transfer artifact
org.apache.flink:flink-clients_2.10:pom:1.3.0 from/to central (https://repo.maven.apache.org/maven2):
Connection reset
	at org.eclipse.aether.internal.impl.DefaultArtifactResolver.resolve(DefaultArtifactResolver.java:444)
	at org.eclipse.aether.internal.impl.DefaultArtifactResolver.resolveArtifacts(DefaultArtifactResolver.java:246)
	at org.eclipse.aether.internal.impl.DefaultArtifactResolver.resolveArtifact(DefaultArtifactResolver.java:223)
	at org.apache.maven.repository.internal.DefaultArtifactDescriptorReader.loadPom(DefaultArtifactDescriptorReader.java:287)
	... 44 more
Caused by: org.eclipse.aether.transfer.ArtifactTransferException: Could not transfer artifact
org.apache.flink:flink-clients_2.10:pom:1.3.0 from/to central (https://repo.maven.apache.org/maven2):
Connection reset
	at org.eclipse.aether.connector.basic.ArtifactTransportListener.transferFailed(ArtifactTransportListener.java:43)
	at org.eclipse.aether.connector.basic.BasicRepositoryConnector$TaskRunner.run(BasicRepositoryConnector.java:355)
	at org.eclipse.aether.util.concurrency.RunnableErrorForwarder$1.run(RunnableErrorForwarder.java:67)
	at org.eclipse.aether.connector.basic.BasicRepositoryConnector$DirectExecutor.execute(BasicRepositoryConnector.java:581)
	at org.eclipse.aether.connector.basic.BasicRepositoryConnector.get(BasicRepositoryConnector.java:249)
	at org.eclipse.aether.internal.impl.DefaultArtifactResolver.performDownloads(DefaultArtifactResolver.java:520)
	at org.eclipse.aether.internal.impl.DefaultArtifactResolver.resolve(DefaultArtifactResolver.java:421)
	... 47 more
Caused by: org.apache.maven.wagon.TransferFailedException: Connection reset
	at org.apache.maven.wagon.providers.http.AbstractHttpClientWagon.fillInputData(AbstractHttpClientWagon.java:1066)
	at org.apache.maven.wagon.providers.http.AbstractHttpClientWagon.fillInputData(AbstractHttpClientWagon.java:960)
	at org.apache.maven.wagon.StreamWagon.getInputStream(StreamWagon.java:116)
	at org.apache.maven.wagon.StreamWagon.getIfNewer(StreamWagon.java:88)
	at org.apache.maven.wagon.StreamWagon.get(StreamWagon.java:61)
	at org.eclipse.aether.transport.wagon.WagonTransporter$GetTaskRunner.run(WagonTransporter.java:560)
	at org.eclipse.aether.transport.wagon.WagonTransporter.execute(WagonTransporter.java:427)
	at org.eclipse.aether.transport.wagon.WagonTransporter.get(WagonTransporter.java:404)
	at org.eclipse.aether.connector.basic.BasicRepositoryConnector$GetTaskRunner.runTask(BasicRepositoryConnector.java:447)
	at org.eclipse.aether.connector.basic.BasicRepositoryConnector$TaskRunner.run(BasicRepositoryConnector.java:350)
	... 52 more
Caused by: java.net.SocketException: Connection reset
	at java.net.SocketInputStream.read(SocketInputStream.java:210)
	at java.net.SocketInputStream.read(SocketInputStream.java:141)
	at sun.security.ssl.InputRecord.readFully(InputRecord.java:465)
	at sun.security.ssl.InputRecord.read(InputRecord.java:503)
	at sun.security.ssl.SSLSocketImpl.readRecord(SSLSocketImpl.java:973)
	at sun.security.ssl.SSLSocketImpl.readDataRecord(SSLSocketImpl.java:930)
	at sun.security.ssl.AppInputStream.read(AppInputStream.java:105)
	at org.apache.maven.wagon.providers.http.httpclient.impl.io.SessionInputBufferImpl.streamRead(SessionInputBufferImpl.java:136)
	at org.apache.maven.wagon.providers.http.httpclient.impl.io.SessionInputBufferImpl.fillBuffer(SessionInputBufferImpl.java:152)
	at org.apache.maven.wagon.providers.http.httpclient.impl.io.SessionInputBufferImpl.readLine(SessionInputBufferImpl.java:270)
	at org.apache.maven.wagon.providers.http.httpclient.impl.conn.DefaultHttpResponseParser.parseHead(DefaultHttpResponseParser.java:140)
	at org.apache.maven.wagon.providers.http.httpclient.impl.conn.DefaultHttpResponseParser.parseHead(DefaultHttpResponseParser.java:57)
	at org.apache.maven.wagon.providers.http.httpclient.impl.io.AbstractMessageParser.parse(AbstractMessageParser.java:260)
	at org.apache.maven.wagon.providers.http.httpclient.impl.DefaultBHttpClientConnection.receiveResponseHeader(DefaultBHttpClientConnection.java:161)
	at org.apache.maven.wagon.providers.http.httpclient.impl.conn.CPoolProxy.receiveResponseHeader(CPoolProxy.java:153)
	at org.apache.maven.wagon.providers.http.httpclient.protocol.HttpRequestExecutor.doReceiveResponse(HttpRequestExecutor.java:271)
	at org.apache.maven.wagon.providers.http.httpclient.protocol.HttpRequestExecutor.execute(HttpRequestExecutor.java:123)
	at org.apache.maven.wagon.providers.http.httpclient.impl.execchain.MainClientExec.execute(MainClientExec.java:254)
	at org.apache.maven.wagon.providers.http.httpclient.impl.execchain.ProtocolExec.execute(ProtocolExec.java:195)
	at org.apache.maven.wagon.providers.http.httpclient.impl.execchain.RetryExec.execute(RetryExec.java:86)
	at org.apache.maven.wagon.providers.http.httpclient.impl.execchain.RedirectExec.execute(RedirectExec.java:108)
	at org.apache.maven.wagon.providers.http.httpclient.impl.client.InternalHttpClient.doExecute(InternalHttpClient.java:184)
	at org.apache.maven.wagon.providers.http.httpclient.impl.client.CloseableHttpClient.execute(CloseableHttpClient.java:82)
	at org.apache.maven.wagon.providers.http.AbstractHttpClientWagon.execute(AbstractHttpClientWagon.java:832)
	at org.apache.maven.wagon.providers.http.AbstractHttpClientWagon.fillInputData(AbstractHttpClientWagon.java:983)
	... 61 more
2017-06-21T20:49:57.775 [ERROR] 
2017-06-21T20:49:57.775 [ERROR] Re-run Maven using the -X switch to enable full debug logging.
2017-06-21T20:49:57.775 [ERROR] 
2017-06-21T20:49:57.775 [ERROR] For more information about the errors and possible solutions,
please read the following articles:
2017-06-21T20:49:57.775 [ERROR] [Help 1] http://cwiki.apache.org/confluence/display/MAVEN/DependencyResolutionException
2017-06-21T20:49:57.775 [ERROR] 
2017-06-21T20:49:57.776 [ERROR] After correcting the problems, you can resume the build with
the command
2017-06-21T20:49:57.776 [ERROR]   mvn <goals> -rf :beam-runners-flink_2.10
channel stopped

Mime
View raw message