beam-commits mailing list archives

Site index · List index
Message view « Date » · « Thread »
Top « Date » · « Thread »
From Apache Jenkins Server <jenk...@builds.apache.org>
Subject Build failed in Jenkins: beam_PostCommit_Java_JDK_Versions_Test » OpenJDK 7 (on Ubuntu only),beam #65
Date Fri, 09 Jun 2017 18:36:16 GMT
See <https://builds.apache.org/job/beam_PostCommit_Java_JDK_Versions_Test/jdk=OpenJDK%207%20(on%20Ubuntu%20only),label=beam/65/display/redirect>

------------------------------------------
[...truncated 1.37 MB...]
2017-06-09\T\18:35:58.023 [INFO] Downloaded: https://repo.maven.apache.org/maven2/org/scala-lang/scala-library/2.10.3/scala-library-2.10.3.pom
(2 KB at 73.9 KB/sec)
2017-06-09\T\18:35:58.025 [INFO] Downloading: https://repo.maven.apache.org/maven2/com/github/scopt/scopt_2.10/3.5.0/scopt_2.10-3.5.0.pom
2017-06-09\T\18:35:58.053 [INFO] Downloaded: https://repo.maven.apache.org/maven2/com/github/scopt/scopt_2.10/3.5.0/scopt_2.10-3.5.0.pom
(2 KB at 58.4 KB/sec)
2017-06-09\T\18:35:58.055 [INFO] Downloading: https://repo.maven.apache.org/maven2/com/twitter/chill_2.10/0.7.4/chill_2.10-0.7.4.pom
2017-06-09\T\18:35:58.082 [INFO] Downloaded: https://repo.maven.apache.org/maven2/com/twitter/chill_2.10/0.7.4/chill_2.10-0.7.4.pom
(3 KB at 85.8 KB/sec)
2017-06-09\T\18:35:58.085 [INFO] Downloading: https://repo.maven.apache.org/maven2/org/scala-lang/scala-library/2.10.5/scala-library-2.10.5.pom
2017-06-09\T\18:35:58.112 [INFO] Downloaded: https://repo.maven.apache.org/maven2/org/scala-lang/scala-library/2.10.5/scala-library-2.10.5.pom
(2 KB at 73.9 KB/sec)
2017-06-09\T\18:35:58.114 [INFO] Downloading: https://repo.maven.apache.org/maven2/com/twitter/chill-java/0.7.4/chill-java-0.7.4.pom
2017-06-09\T\18:35:58.141 [INFO] Downloaded: https://repo.maven.apache.org/maven2/com/twitter/chill-java/0.7.4/chill-java-0.7.4.pom
(2 KB at 73.6 KB/sec)
2017-06-09\T\18:35:58.144 [INFO] Downloading: https://repo.maven.apache.org/maven2/org/apache/flink/flink-optimizer_2.10/1.3.0/flink-optimizer_2.10-1.3.0.pom
2017-06-09\T\18:35:58.171 [INFO] Downloaded: https://repo.maven.apache.org/maven2/org/apache/flink/flink-optimizer_2.10/1.3.0/flink-optimizer_2.10-1.3.0.pom
(5 KB at 156.2 KB/sec)
2017-06-09\T\18:35:58.177 [INFO] Downloading: https://repo.maven.apache.org/maven2/org/apache/flink/flink-streaming-java_2.10/1.3.0/flink-streaming-java_2.10-1.3.0.pom
2017-06-09\T\18:35:58.204 [INFO] Downloaded: https://repo.maven.apache.org/maven2/org/apache/flink/flink-streaming-java_2.10/1.3.0/flink-streaming-java_2.10-1.3.0.pom
(7 KB at 223.3 KB/sec)
2017-06-09\T\18:35:58.210 [INFO] Downloading: https://repo.maven.apache.org/maven2/org/apache/sling/org.apache.sling.commons.json/2.0.6/org.apache.sling.commons.json-2.0.6.pom
2017-06-09\T\18:35:58.238 [INFO] Downloaded: https://repo.maven.apache.org/maven2/org/apache/sling/org.apache.sling.commons.json/2.0.6/org.apache.sling.commons.json-2.0.6.pom
(4 KB at 113.0 KB/sec)
2017-06-09\T\18:35:58.240 [INFO] Downloading: https://repo.maven.apache.org/maven2/org/apache/sling/sling/10/sling-10.pom
2017-06-09\T\18:35:58.269 [INFO] Downloaded: https://repo.maven.apache.org/maven2/org/apache/sling/sling/10/sling-10.pom
(26 KB at 864.3 KB/sec)
2017-06-09\T\18:35:58.271 [INFO] Downloading: https://repo.maven.apache.org/maven2/org/apache/apache/8/apache-8.pom
2017-06-09\T\18:35:58.302 [INFO] Downloaded: https://repo.maven.apache.org/maven2/org/apache/apache/8/apache-8.pom
(14 KB at 442.7 KB/sec)
2017-06-09\T\18:35:58.322 [INFO] Downloading: https://repo.maven.apache.org/maven2/org/apache/flink/flink-test-utils_2.10/1.3.0/flink-test-utils_2.10-1.3.0.pom
2017-06-09\T\18:35:58.349 [INFO] Downloaded: https://repo.maven.apache.org/maven2/org/apache/flink/flink-test-utils_2.10/1.3.0/flink-test-utils_2.10-1.3.0.pom
(5 KB at 171.5 KB/sec)
2017-06-09\T\18:35:58.350 [INFO] Downloading: https://repo.maven.apache.org/maven2/org/apache/flink/flink-test-utils-parent/1.3.0/flink-test-utils-parent-1.3.0.pom
2017-06-09\T\18:35:58.377 [INFO] Downloaded: https://repo.maven.apache.org/maven2/org/apache/flink/flink-test-utils-parent/1.3.0/flink-test-utils-parent-1.3.0.pom
(2 KB at 52.1 KB/sec)
2017-06-09\T\18:35:58.384 [INFO] Downloading: https://repo.maven.apache.org/maven2/org/apache/flink/flink-test-utils-junit/1.3.0/flink-test-utils-junit-1.3.0.pom
2017-06-09\T\18:35:58.412 [INFO] Downloaded: https://repo.maven.apache.org/maven2/org/apache/flink/flink-test-utils-junit/1.3.0/flink-test-utils-junit-1.3.0.pom
(4 KB at 114.6 KB/sec)
2017-06-09\T\18:35:58.419 [INFO] Downloading: https://repo.maven.apache.org/maven2/org/apache/curator/curator-test/2.12.0/curator-test-2.12.0.pom
2017-06-09\T\18:35:58.449 [INFO] Downloaded: https://repo.maven.apache.org/maven2/org/apache/curator/curator-test/2.12.0/curator-test-2.12.0.pom
(5 KB at 135.0 KB/sec)
2017-06-09\T\18:35:58.451 [INFO] Downloading: https://repo.maven.apache.org/maven2/org/apache/curator/apache-curator/2.12.0/apache-curator-2.12.0.pom
2017-06-09\T\18:35:58.490 [INFO] Downloaded: https://repo.maven.apache.org/maven2/org/apache/curator/apache-curator/2.12.0/apache-curator-2.12.0.pom
(32 KB at 809.5 KB/sec)
2017-06-09\T\18:35:58.495 [INFO] Downloading: https://repo.maven.apache.org/maven2/org/apache/zookeeper/zookeeper/3.4.8/zookeeper-3.4.8.pom
2017-06-09\T\18:35:58.523 [INFO] Downloaded: https://repo.maven.apache.org/maven2/org/apache/zookeeper/zookeeper/3.4.8/zookeeper-3.4.8.pom
(4 KB at 140.4 KB/sec)
2017-06-09\T\18:35:58.525 [INFO] Downloading: https://repo.maven.apache.org/maven2/org/javassist/javassist/3.18.1-GA/javassist-3.18.1-GA.pom
2017-06-09\T\18:35:58.553 [INFO] Downloaded: https://repo.maven.apache.org/maven2/org/javassist/javassist/3.18.1-GA/javassist-3.18.1-GA.pom
(10 KB at 332.1 KB/sec)
2017-06-09\T\18:35:58.594 [INFO] Downloading: https://repo.maven.apache.org/maven2/org/apache/flink/flink-clients_2.10/1.3.0/flink-clients_2.10-1.3.0.jar
2017-06-09\T\18:35:58.595 [INFO] Downloading: https://repo.maven.apache.org/maven2/org/apache/flink/force-shading/1.3.0/force-shading-1.3.0.jar
2017-06-09\T\18:35:58.596 [INFO] Downloading: https://repo.maven.apache.org/maven2/org/apache/flink/flink-core/1.3.0/flink-core-1.3.0.jar
2017-06-09\T\18:35:58.609 [INFO] Downloading: https://repo.maven.apache.org/maven2/org/apache/flink/flink-annotations/1.3.0/flink-annotations-1.3.0.jar
2017-06-09\T\18:35:58.609 [INFO] Downloading: https://repo.maven.apache.org/maven2/org/apache/flink/flink-optimizer_2.10/1.3.0/flink-optimizer_2.10-1.3.0.jar
2017-06-09\T\18:35:58.643 [INFO] Downloaded: https://repo.maven.apache.org/maven2/org/apache/flink/flink-clients_2.10/1.3.0/flink-clients_2.10-1.3.0.jar
(89 KB at 1810.4 KB/sec)
2017-06-09\T\18:35:58.643 [INFO] Downloaded: https://repo.maven.apache.org/maven2/org/apache/flink/force-shading/1.3.0/force-shading-1.3.0.jar
(8 KB at 148.1 KB/sec)
2017-06-09\T\18:35:58.644 [INFO] Downloading: https://repo.maven.apache.org/maven2/com/esotericsoftware/kryo/kryo/2.24.0/kryo-2.24.0.jar
2017-06-09\T\18:35:58.644 [INFO] Downloading: https://repo.maven.apache.org/maven2/org/objenesis/objenesis/2.1/objenesis-2.1.jar
2017-06-09\T\18:35:58.647 [INFO] Downloaded: https://repo.maven.apache.org/maven2/org/apache/flink/flink-annotations/1.3.0/flink-annotations-1.3.0.jar
(8 KB at 141.4 KB/sec)
2017-06-09\T\18:35:58.647 [INFO] Downloading: https://repo.maven.apache.org/maven2/org/apache/flink/flink-metrics-core/1.3.0/flink-metrics-core-1.3.0.jar
2017-06-09\T\18:35:58.677 [INFO] Downloaded: https://repo.maven.apache.org/maven2/org/apache/flink/flink-metrics-core/1.3.0/flink-metrics-core-1.3.0.jar
(16 KB at 192.8 KB/sec)
2017-06-09\T\18:35:58.677 [INFO] Downloading: https://repo.maven.apache.org/maven2/org/apache/flink/flink-java/1.3.0/flink-java-1.3.0.jar
2017-06-09\T\18:35:58.683 [INFO] Downloaded: https://repo.maven.apache.org/maven2/org/objenesis/objenesis/2.1/objenesis-2.1.jar
(41 KB at 468.7 KB/sec)
2017-06-09\T\18:35:58.683 [INFO] Downloading: https://repo.maven.apache.org/maven2/org/apache/flink/flink-shaded-hadoop2/1.3.0/flink-shaded-hadoop2-1.3.0.jar
2017-06-09\T\18:35:58.735 [INFO] Downloaded: https://repo.maven.apache.org/maven2/com/esotericsoftware/kryo/kryo/2.24.0/kryo-2.24.0.jar
(332 KB at 2383.7 KB/sec)
2017-06-09\T\18:35:58.735 [INFO] Downloading: https://repo.maven.apache.org/maven2/commons-configuration/commons-configuration/1.7/commons-configuration-1.7.jar
2017-06-09\T\18:35:58.781 [INFO] Downloaded: https://repo.maven.apache.org/maven2/org/apache/flink/flink-java/1.3.0/flink-java-1.3.0.jar
(752 KB at 4064.2 KB/sec)
2017-06-09\T\18:35:58.781 [INFO] Downloading: https://repo.maven.apache.org/maven2/commons-digester/commons-digester/1.8.1/commons-digester-1.8.1.jar
2017-06-09\T\18:35:58.796 [INFO] Downloaded: https://repo.maven.apache.org/maven2/commons-configuration/commons-configuration/1.7/commons-configuration-1.7.jar
(343 KB at 1710.6 KB/sec)
2017-06-09\T\18:35:58.796 [INFO] Downloading: https://repo.maven.apache.org/maven2/commons-beanutils/commons-beanutils-bean-collections/1.8.3/commons-beanutils-bean-collections-1.8.3.jar
2017-06-09\T\18:35:58.842 [INFO] Downloaded: https://repo.maven.apache.org/maven2/commons-beanutils/commons-beanutils-bean-collections/1.8.3/commons-beanutils-bean-collections-1.8.3.jar
(26 KB at 105.5 KB/sec)
2017-06-09\T\18:35:58.842 [INFO] Downloading: https://repo.maven.apache.org/maven2/org/apache/commons/commons-math3/3.5/commons-math3-3.5.jar
2017-06-09\T\18:35:58.856 [INFO] Downloaded: https://repo.maven.apache.org/maven2/commons-digester/commons-digester/1.8.1/commons-digester-1.8.1.jar
(143 KB at 548.8 KB/sec)
2017-06-09\T\18:35:58.856 [INFO] Downloading: https://repo.maven.apache.org/maven2/org/apache/flink/flink-runtime_2.10/1.3.0/flink-runtime_2.10-1.3.0.jar
2017-06-09\T\18:35:58.932 [INFO] Downloaded: https://repo.maven.apache.org/maven2/org/apache/flink/flink-optimizer_2.10/1.3.0/flink-optimizer_2.10-1.3.0.jar
(2679 KB at 7925.9 KB/sec)
2017-06-09\T\18:35:58.932 [INFO] Downloading: https://repo.maven.apache.org/maven2/io/netty/netty-all/4.0.27.Final/netty-all-4.0.27.Final.jar
2017-06-09\T\18:35:58.953 [INFO] Downloaded: https://repo.maven.apache.org/maven2/org/apache/flink/flink-core/1.3.0/flink-core-1.3.0.jar
(1362 KB at 3803.1 KB/sec)
2017-06-09\T\18:35:58.953 [INFO] Downloading: https://repo.maven.apache.org/maven2/org/javassist/javassist/3.18.2-GA/javassist-3.18.2-GA.jar
2017-06-09\T\18:35:59.109 [INFO] Downloaded: https://repo.maven.apache.org/maven2/org/javassist/javassist/3.18.2-GA/javassist-3.18.2-GA.jar
(698 KB at 1360.2 KB/sec)
2017-06-09\T\18:35:59.109 [INFO] Downloading: https://repo.maven.apache.org/maven2/org/scala-lang/scala-library/2.10.4/scala-library-2.10.4.jar
2017-06-09\T\18:35:59.285 [INFO] Downloaded: https://repo.maven.apache.org/maven2/io/netty/netty-all/4.0.27.Final/netty-all-4.0.27.Final.jar
(1894 KB at 2748.9 KB/sec)
2017-06-09\T\18:35:59.285 [INFO] Downloading: https://repo.maven.apache.org/maven2/com/data-artisans/flakka-actor_2.10/2.3-custom/flakka-actor_2.10-2.3-custom.jar
2017-06-09\T\18:35:59.322 [INFO] Downloaded: https://repo.maven.apache.org/maven2/org/apache/commons/commons-math3/3.5/commons-math3-3.5.jar
(1991 KB at 2742.0 KB/sec)
2017-06-09\T\18:35:59.322 [INFO] Downloading: https://repo.maven.apache.org/maven2/com/typesafe/config/1.2.1/config-1.2.1.jar
2017-06-09\T\18:35:59.395 [INFO] Downloaded: https://repo.maven.apache.org/maven2/com/typesafe/config/1.2.1/config-1.2.1.jar
(215 KB at 268.3 KB/sec)
2017-06-09\T\18:35:59.395 [INFO] Downloading: https://repo.maven.apache.org/maven2/com/data-artisans/flakka-remote_2.10/2.3-custom/flakka-remote_2.10-2.3-custom.jar
2017-06-09\T\18:35:59.660 [INFO] Downloaded: https://repo.maven.apache.org/maven2/com/data-artisans/flakka-actor_2.10/2.3-custom/flakka-actor_2.10-2.3-custom.jar
(2754 KB at 2587.8 KB/sec)
2017-06-09\T\18:35:59.660 [INFO] Downloading: https://repo.maven.apache.org/maven2/io/netty/netty/3.8.0.Final/netty-3.8.0.Final.jar
2017-06-09\T\18:35:59.690 [INFO] Downloaded: https://repo.maven.apache.org/maven2/com/data-artisans/flakka-remote_2.10/2.3-custom/flakka-remote_2.10-2.3-custom.jar
(1347 KB at 1231.2 KB/sec)
2017-06-09\T\18:35:59.690 [INFO] Downloading: https://repo.maven.apache.org/maven2/org/uncommons/maths/uncommons-maths/1.2.2a/uncommons-maths-1.2.2a.jar
2017-06-09\T\18:35:59.742 [INFO] Downloaded: https://repo.maven.apache.org/maven2/org/uncommons/maths/uncommons-maths/1.2.2a/uncommons-maths-1.2.2a.jar
(48 KB at 41.8 KB/sec)
2017-06-09\T\18:35:59.742 [INFO] Downloading: https://repo.maven.apache.org/maven2/com/data-artisans/flakka-slf4j_2.10/2.3-custom/flakka-slf4j_2.10-2.3-custom.jar
2017-06-09\T\18:35:59.794 [INFO] Downloaded: https://repo.maven.apache.org/maven2/com/data-artisans/flakka-slf4j_2.10/2.3-custom/flakka-slf4j_2.10-2.3-custom.jar
(16 KB at 12.7 KB/sec)
2017-06-09\T\18:35:59.794 [INFO] Downloading: https://repo.maven.apache.org/maven2/org/clapper/grizzled-slf4j_2.10/1.0.2/grizzled-slf4j_2.10-1.0.2.jar
2017-06-09\T\18:35:59.836 [INFO] Downloaded: https://repo.maven.apache.org/maven2/io/netty/netty/3.8.0.Final/netty-3.8.0.Final.jar
(1202 KB at 968.8 KB/sec)
2017-06-09\T\18:35:59.836 [INFO] Downloading: https://repo.maven.apache.org/maven2/com/github/scopt/scopt_2.10/3.5.0/scopt_2.10-3.5.0.jar
2017-06-09\T\18:35:59.845 [INFO] Downloaded: https://repo.maven.apache.org/maven2/org/clapper/grizzled-slf4j_2.10/1.0.2/grizzled-slf4j_2.10-1.0.2.jar
(7 KB at 5.0 KB/sec)
2017-06-09\T\18:35:59.845 [INFO] Downloading: https://repo.maven.apache.org/maven2/jline/jline/0.9.94/jline-0.9.94.jar
2017-06-09\T\18:35:59.899 [INFO] Downloaded: https://repo.maven.apache.org/maven2/jline/jline/0.9.94/jline-0.9.94.jar
(86 KB at 65.4 KB/sec)
2017-06-09\T\18:35:59.899 [INFO] Downloading: https://repo.maven.apache.org/maven2/com/twitter/chill_2.10/0.7.4/chill_2.10-0.7.4.jar
2017-06-09\T\18:35:59.914 [INFO] Downloaded: https://repo.maven.apache.org/maven2/com/github/scopt/scopt_2.10/3.5.0/scopt_2.10-3.5.0.jar
(140 KB at 106.0 KB/sec)
2017-06-09\T\18:35:59.914 [INFO] Downloading: https://repo.maven.apache.org/maven2/com/twitter/chill-java/0.7.4/chill-java-0.7.4.jar
2017-06-09\T\18:35:59.970 [INFO] Downloaded: https://repo.maven.apache.org/maven2/com/twitter/chill-java/0.7.4/chill-java-0.7.4.jar
(50 KB at 35.8 KB/sec)
2017-06-09\T\18:35:59.970 [INFO] Downloading: https://repo.maven.apache.org/maven2/org/apache/flink/flink-streaming-java_2.10/1.3.0/flink-streaming-java_2.10-1.3.0.jar
2017-06-09\T\18:35:59.998 [INFO] Downloaded: https://repo.maven.apache.org/maven2/com/twitter/chill_2.10/0.7.4/chill_2.10-0.7.4.jar
(217 KB at 154.1 KB/sec)
2017-06-09\T\18:35:59.999 [INFO] Downloading: https://repo.maven.apache.org/maven2/org/apache/sling/org.apache.sling.commons.json/2.0.6/org.apache.sling.commons.json-2.0.6.jar
2017-06-09\T\18:36:00.066 [INFO] Downloaded: https://repo.maven.apache.org/maven2/org/apache/sling/org.apache.sling.commons.json/2.0.6/org.apache.sling.commons.json-2.0.6.jar
(47 KB at 31.8 KB/sec)
2017-06-09\T\18:36:00.066 [INFO] Downloading: https://repo.maven.apache.org/maven2/org/apache/flink/flink-core/1.3.0/flink-core-1.3.0-tests.jar
2017-06-09\T\18:36:00.216 [INFO] Downloaded: https://repo.maven.apache.org/maven2/org/scala-lang/scala-library/2.10.4/scala-library-2.10.4.jar
(6960 KB at 4295.9 KB/sec)
2017-06-09\T\18:36:00.216 [INFO] Downloading: https://repo.maven.apache.org/maven2/org/apache/flink/flink-runtime_2.10/1.3.0/flink-runtime_2.10-1.3.0-tests.jar
2017-06-09\T\18:36:00.231 [INFO] Downloaded: https://repo.maven.apache.org/maven2/org/apache/flink/flink-core/1.3.0/flink-core-1.3.0-tests.jar
(753 KB at 460.0 KB/sec)
2017-06-09\T\18:36:00.231 [INFO] Downloading: https://repo.maven.apache.org/maven2/org/apache/flink/flink-streaming-java_2.10/1.3.0/flink-streaming-java_2.10-1.3.0-tests.jar
2017-06-09\T\18:36:00.347 [INFO] Downloaded: https://repo.maven.apache.org/maven2/org/apache/flink/flink-runtime_2.10/1.3.0/flink-runtime_2.10-1.3.0.jar
(9005 KB at 5142.3 KB/sec)
2017-06-09\T\18:36:00.347 [INFO] Downloading: https://repo.maven.apache.org/maven2/org/apache/flink/flink-test-utils_2.10/1.3.0/flink-test-utils_2.10-1.3.0.jar
2017-06-09\T\18:36:00.407 [INFO] Downloaded: https://repo.maven.apache.org/maven2/org/apache/flink/flink-streaming-java_2.10/1.3.0/flink-streaming-java_2.10-1.3.0-tests.jar
(1133 KB at 625.8 KB/sec)
2017-06-09\T\18:36:00.407 [INFO] Downloading: https://repo.maven.apache.org/maven2/org/apache/flink/flink-test-utils-junit/1.3.0/flink-test-utils-junit-1.3.0.jar
2017-06-09\T\18:36:00.443 [INFO] Downloaded: https://repo.maven.apache.org/maven2/org/apache/flink/flink-streaming-java_2.10/1.3.0/flink-streaming-java_2.10-1.3.0.jar
(3128 KB at 1693.2 KB/sec)
2017-06-09\T\18:36:00.443 [INFO] Downloading: https://repo.maven.apache.org/maven2/org/apache/curator/curator-test/2.12.0/curator-test-2.12.0.jar
2017-06-09\T\18:36:00.444 [INFO] Downloaded: https://repo.maven.apache.org/maven2/org/apache/flink/flink-test-utils-junit/1.3.0/flink-test-utils-junit-1.3.0.jar
(26 KB at 13.7 KB/sec)
2017-06-09\T\18:36:00.584 [INFO] Downloaded: https://repo.maven.apache.org/maven2/org/apache/flink/flink-runtime_2.10/1.3.0/flink-runtime_2.10-1.3.0-tests.jar
(2841 KB at 1429.6 KB/sec)
2017-06-09\T\18:36:00.609 [INFO] Downloaded: https://repo.maven.apache.org/maven2/org/apache/flink/flink-test-utils_2.10/1.3.0/flink-test-utils_2.10-1.3.0.jar
(2365 KB at 1175.1 KB/sec)
2017-06-09\T\18:36:00.774 [INFO] Downloaded: https://repo.maven.apache.org/maven2/org/apache/curator/curator-test/2.12.0/curator-test-2.12.0.jar
(2368 KB at 1087.6 KB/sec)
2017-06-09\T\18:36:01.068 [INFO] Downloaded: https://repo.maven.apache.org/maven2/org/apache/flink/flink-shaded-hadoop2/1.3.0/flink-shaded-hadoop2-1.3.0.jar
(16586 KB at 6709.3 KB/sec)
2017-06-09\T\18:36:01.096 [INFO] 
2017-06-09\T\18:36:01.096 [INFO] --- maven-clean-plugin:3.0.0:clean (default-clean) @ beam-runners-flink_2.10
---
2017-06-09\T\18:36:01.098 [INFO] Deleting <https://builds.apache.org/job/beam_PostCommit_Java_JDK_Versions_Test/jdk=OpenJDK%207%20(on%20Ubuntu%20only),label=beam/ws/runners/flink>
(includes = [**/*.pyc, **/*.egg-info/, **/sdks/python/LICENSE, **/sdks/python/NOTICE, **/sdks/python/README.md],
excludes = [])
2017-06-09\T\18:36:01.104 [INFO] 
2017-06-09\T\18:36:01.104 [INFO] --- maven-enforcer-plugin:1.4.1:enforce (enforce) @ beam-runners-flink_2.10
---
2017-06-09\T\18:36:03.361 [INFO] 
2017-06-09\T\18:36:03.361 [INFO] --- maven-enforcer-plugin:1.4.1:enforce (enforce-banned-dependencies)
@ beam-runners-flink_2.10 ---
2017-06-09\T\18:36:03.393 [INFO] 
2017-06-09\T\18:36:03.393 [INFO] --- maven-remote-resources-plugin:1.5:process (process-resource-bundles)
@ beam-runners-flink_2.10 ---
2017-06-09\T\18:36:04.308 [INFO] 
2017-06-09\T\18:36:04.309 [INFO] --- maven-resources-plugin:3.0.2:resources (default-resources)
@ beam-runners-flink_2.10 ---
2017-06-09\T\18:36:04.310 [INFO] Using 'UTF-8' encoding to copy filtered resources.
2017-06-09\T\18:36:04.310 [INFO] Copying 1 resource
2017-06-09\T\18:36:04.323 [INFO] Copying 3 resources
2017-06-09\T\18:36:04.325 [INFO] 
2017-06-09\T\18:36:04.325 [INFO] --- maven-compiler-plugin:3.6.1:compile (default-compile)
@ beam-runners-flink_2.10 ---
2017-06-09\T\18:36:04.347 [INFO] Changes detected - recompiling the module!
2017-06-09\T\18:36:04.348 [INFO] Compiling 65 source files to <https://builds.apache.org/job/beam_PostCommit_Java_JDK_Versions_Test/jdk=OpenJDK%207%20(on%20Ubuntu%20only),label=beam/ws/runners/flink/target/classes>
2017-06-09\T\18:36:05.897 [INFO] <https://builds.apache.org/job/beam_PostCommit_Java_JDK_Versions_Test/jdk=OpenJDK%207%20(on%20Ubuntu%20only),label=beam/ws/runners/flink/src/main/java/org/apache/beam/runners/flink/translation/wrappers/streaming/io/DedupingOperator.java>:
Some input files use or override a deprecated API.
2017-06-09\T\18:36:05.897 [INFO] <https://builds.apache.org/job/beam_PostCommit_Java_JDK_Versions_Test/jdk=OpenJDK%207%20(on%20Ubuntu%20only),label=beam/ws/runners/flink/src/main/java/org/apache/beam/runners/flink/translation/wrappers/streaming/io/DedupingOperator.java>:
Recompile with -Xlint:deprecation for details.
2017-06-09\T\18:36:05.897 [INFO] <https://builds.apache.org/job/beam_PostCommit_Java_JDK_Versions_Test/jdk=OpenJDK%207%20(on%20Ubuntu%20only),label=beam/ws/runners/flink/src/main/java/org/apache/beam/runners/flink/translation/wrappers/streaming/io/UnboundedSocketSource.java>:
Some input files use unchecked or unsafe operations.
2017-06-09\T\18:36:05.897 [INFO] <https://builds.apache.org/job/beam_PostCommit_Java_JDK_Versions_Test/jdk=OpenJDK%207%20(on%20Ubuntu%20only),label=beam/ws/runners/flink/src/main/java/org/apache/beam/runners/flink/translation/wrappers/streaming/io/UnboundedSocketSource.java>:
Recompile with -Xlint:unchecked for details.
2017-06-09\T\18:36:05.897 [INFO] -------------------------------------------------------------
2017-06-09\T\18:36:05.897 [ERROR] COMPILATION ERROR : 
2017-06-09\T\18:36:05.897 [INFO] -------------------------------------------------------------
2017-06-09\T\18:36:05.897 [ERROR] <https://builds.apache.org/job/beam_PostCommit_Java_JDK_Versions_Test/jdk=OpenJDK%207%20(on%20Ubuntu%20only),label=beam/ws/runners/flink/src/main/java/org/apache/beam/runners/flink/FlinkStreamingTransformTranslators.java>:[366,27]
method put in interface java.util.Map<K,V> cannot be applied to given types;
  required: org.apache.beam.sdk.values.TupleTag<?>,org.apache.flink.util.OutputTag<org.apache.beam.sdk.util.WindowedValue<?>>
  found: org.apache.beam.sdk.values.TupleTag<capture#1 of ?>,org.apache.flink.util.OutputTag<java.lang.Object>
  reason: actual argument org.apache.flink.util.OutputTag<java.lang.Object> cannot be
converted to org.apache.flink.util.OutputTag<org.apache.beam.sdk.util.WindowedValue<?>>
by method invocation conversion
2017-06-09\T\18:36:05.897 [INFO] 1 error
2017-06-09\T\18:36:05.897 [INFO] -------------------------------------------------------------
2017-06-09\T\18:36:05.898 [INFO] ------------------------------------------------------------------------
2017-06-09\T\18:36:05.898 [INFO] Reactor Summary:
2017-06-09\T\18:36:05.898 [INFO] 
2017-06-09\T\18:36:05.898 [INFO] Apache Beam :: Parent .............................. SUCCESS
[ 20.174 s]
2017-06-09\T\18:36:05.898 [INFO] Apache Beam :: SDKs :: Java :: Build Tools ......... SUCCESS
[  7.041 s]
2017-06-09\T\18:36:05.898 [INFO] Apache Beam :: SDKs ................................ SUCCESS
[  0.601 s]
2017-06-09\T\18:36:05.898 [INFO] Apache Beam :: SDKs :: Common ...................... SUCCESS
[  0.774 s]
2017-06-09\T\18:36:05.898 [INFO] Apache Beam :: SDKs :: Common :: Runner API ........ SUCCESS
[  8.858 s]
2017-06-09\T\18:36:05.898 [INFO] Apache Beam :: SDKs :: Common :: Fn API ............ SUCCESS
[  6.830 s]
2017-06-09\T\18:36:05.898 [INFO] Apache Beam :: SDKs :: Java ........................ SUCCESS
[  0.591 s]
2017-06-09\T\18:36:05.898 [INFO] Apache Beam :: SDKs :: Java :: Core ................ SUCCESS
[01:48 min]
2017-06-09\T\18:36:05.898 [INFO] Apache Beam :: Runners ............................. SUCCESS
[  0.837 s]
2017-06-09\T\18:36:05.898 [INFO] Apache Beam :: Runners :: Core Construction Java ... SUCCESS
[ 14.541 s]
2017-06-09\T\18:36:05.898 [INFO] Apache Beam :: Runners :: Core Java ................ SUCCESS
[ 30.394 s]
2017-06-09\T\18:36:05.898 [INFO] Apache Beam :: Runners :: Direct Java .............. SUCCESS
[04:05 min]
2017-06-09\T\18:36:05.898 [INFO] Apache Beam :: SDKs :: Java :: IO .................. SUCCESS
[  0.827 s]
2017-06-09\T\18:36:05.898 [INFO] Apache Beam :: SDKs :: Java :: IO :: Common ........ SUCCESS
[  6.265 s]
2017-06-09\T\18:36:05.898 [INFO] Apache Beam :: SDKs :: Java :: IO :: Cassandra ..... SUCCESS
[ 26.368 s]
2017-06-09\T\18:36:05.899 [INFO] Apache Beam :: SDKs :: Java :: IO :: Elasticsearch . SUCCESS
[ 36.652 s]
2017-06-09\T\18:36:05.899 [INFO] Apache Beam :: SDKs :: Java :: Extensions .......... SUCCESS
[  0.693 s]
2017-06-09\T\18:36:05.899 [INFO] Apache Beam :: SDKs :: Java :: Extensions :: Google Cloud
Platform Core SUCCESS [ 36.514 s]
2017-06-09\T\18:36:05.899 [INFO] Apache Beam :: SDKs :: Java :: Extensions :: Protobuf SUCCESS
[ 13.113 s]
2017-06-09\T\18:36:05.899 [INFO] Apache Beam :: SDKs :: Java :: IO :: Google Cloud Platform
SUCCESS [01:25 min]
2017-06-09\T\18:36:05.899 [INFO] Apache Beam :: SDKs :: Java :: IO :: Hadoop Common . SUCCESS
[ 19.125 s]
2017-06-09\T\18:36:05.899 [INFO] Apache Beam :: SDKs :: Java :: IO :: Hadoop File System SUCCESS
[ 44.386 s]
2017-06-09\T\18:36:05.899 [INFO] Apache Beam :: SDKs :: Java :: IO :: Hadoop ........ SUCCESS
[  4.181 s]
2017-06-09\T\18:36:05.899 [INFO] Apache Beam :: SDKs :: Java :: IO :: Hadoop :: input-format
SUCCESS [ 15.985 s]
2017-06-09\T\18:36:05.899 [INFO] Apache Beam :: SDKs :: Java :: IO :: HBase ......... SUCCESS
[01:19 min]
2017-06-09\T\18:36:05.899 [INFO] Apache Beam :: SDKs :: Java :: IO :: HCatalog ...... SUCCESS
[01:02 min]
2017-06-09\T\18:36:05.899 [INFO] Apache Beam :: Runners :: Google Cloud Dataflow .... SUCCESS
[05:42 min]
2017-06-09\T\18:36:05.899 [INFO] Apache Beam :: SDKs :: Java :: IO :: JDBC .......... SUCCESS
[ 21.556 s]
2017-06-09\T\18:36:05.899 [INFO] Apache Beam :: SDKs :: Java :: IO :: JMS ........... SUCCESS
[ 12.136 s]
2017-06-09\T\18:36:05.899 [INFO] Apache Beam :: SDKs :: Java :: IO :: Kafka ......... SUCCESS
[ 30.914 s]
2017-06-09\T\18:36:05.899 [INFO] Apache Beam :: SDKs :: Java :: IO :: Kinesis ....... SUCCESS
[ 14.773 s]
2017-06-09\T\18:36:05.899 [INFO] Apache Beam :: SDKs :: Java :: IO :: MongoDB ....... SUCCESS
[ 28.116 s]
2017-06-09\T\18:36:05.899 [INFO] Apache Beam :: SDKs :: Java :: IO :: MQTT .......... SUCCESS
[ 12.187 s]
2017-06-09\T\18:36:05.899 [INFO] Apache Beam :: SDKs :: Java :: IO :: XML ........... SUCCESS
[ 17.528 s]
2017-06-09\T\18:36:05.899 [INFO] Apache Beam :: SDKs :: Java :: Maven Archetypes .... SUCCESS
[  0.546 s]
2017-06-09\T\18:36:05.899 [INFO] Apache Beam :: SDKs :: Java :: Maven Archetypes :: Starter
SUCCESS [ 14.993 s]
2017-06-09\T\18:36:05.899 [INFO] Apache Beam :: Examples ............................ SUCCESS
[  0.538 s]
2017-06-09\T\18:36:05.899 [INFO] Apache Beam :: Examples :: Java .................... SUCCESS
[09:09 min]
2017-06-09\T\18:36:05.899 [INFO] Apache Beam :: SDKs :: Java :: Maven Archetypes :: Examples
SUCCESS [ 37.387 s]
2017-06-09\T\18:36:05.899 [INFO] Apache Beam :: SDKs :: Java :: Extensions :: Jackson SUCCESS
[  8.186 s]
2017-06-09\T\18:36:05.899 [INFO] Apache Beam :: SDKs :: Java :: Extensions :: Join library
SUCCESS [ 11.800 s]
2017-06-09\T\18:36:05.899 [INFO] Apache Beam :: SDKs :: Java :: Extensions :: Sorter  SUCCESS
[ 31.536 s]
2017-06-09\T\18:36:05.899 [INFO] Apache Beam :: Runners :: Flink .................... FAILURE
[  9.055 s]
2017-06-09\T\18:36:05.899 [INFO] Apache Beam :: Runners :: Spark .................... SKIPPED
2017-06-09\T\18:36:05.899 [INFO] Apache Beam :: SDKs :: Java :: Aggregated Javadoc .. SKIPPED
2017-06-09\T\18:36:05.899 [INFO] ------------------------------------------------------------------------
2017-06-09\T\18:36:05.899 [INFO] BUILD FAILURE
2017-06-09\T\18:36:05.899 [INFO] ------------------------------------------------------------------------
2017-06-09\T\18:36:05.899 [INFO] Total time: 33:43 min
2017-06-09\T\18:36:05.900 [INFO] Finished at: 2017-06-09T18:36:05+00:00
2017-06-09\T\18:36:07.551 [INFO] Final Memory: 511M/1532M
2017-06-09\T\18:36:07.551 [INFO] ------------------------------------------------------------------------
2017-06-09\T\18:36:07.552 [ERROR] Failed to execute goal org.apache.maven.plugins:maven-compiler-plugin:3.6.1:compile
(default-compile) on project beam-runners-flink_2.10: Compilation failure
2017-06-09\T\18:36:07.552 [ERROR] <https://builds.apache.org/job/beam_PostCommit_Java_JDK_Versions_Test/jdk=OpenJDK%207%20(on%20Ubuntu%20only),label=beam/ws/runners/flink/src/main/java/org/apache/beam/runners/flink/FlinkStreamingTransformTranslators.java>:[366,27]
method put in interface java.util.Map<K,V> cannot be applied to given types;
2017-06-09\T\18:36:07.552 [ERROR] required: org.apache.beam.sdk.values.TupleTag<?>,org.apache.flink.util.OutputTag<org.apache.beam.sdk.util.WindowedValue<?>>
2017-06-09\T\18:36:07.552 [ERROR] found: org.apache.beam.sdk.values.TupleTag<capture#1
of ?>,org.apache.flink.util.OutputTag<java.lang.Object>
2017-06-09\T\18:36:07.552 [ERROR] reason: actual argument org.apache.flink.util.OutputTag<java.lang.Object>
cannot be converted to org.apache.flink.util.OutputTag<org.apache.beam.sdk.util.WindowedValue<?>>
by method invocation conversion
2017-06-09\T\18:36:07.552 [ERROR] -> [Help 1]
org.apache.maven.lifecycle.LifecycleExecutionException: Failed to execute goal org.apache.maven.plugins:maven-compiler-plugin:3.6.1:compile
(default-compile) on project beam-runners-flink_2.10: Compilation failure
<https://builds.apache.org/job/beam_PostCommit_Java_JDK_Versions_Test/jdk=OpenJDK%207%20(on%20Ubuntu%20only),label=beam/ws/runners/flink/src/main/java/org/apache/beam/runners/flink/FlinkStreamingTransformTranslators.java>:[366,27]
method put in interface java.util.Map<K,V> cannot be applied to given types;
  required: org.apache.beam.sdk.values.TupleTag<?>,org.apache.flink.util.OutputTag<org.apache.beam.sdk.util.WindowedValue<?>>
  found: org.apache.beam.sdk.values.TupleTag<capture#1 of ?>,org.apache.flink.util.OutputTag<java.lang.Object>
  reason: actual argument org.apache.flink.util.OutputTag<java.lang.Object> cannot be
converted to org.apache.flink.util.OutputTag<org.apache.beam.sdk.util.WindowedValue<?>>
by method invocation conversion

	at org.apache.maven.lifecycle.internal.MojoExecutor.execute(MojoExecutor.java:212)
	at org.apache.maven.lifecycle.internal.MojoExecutor.execute(MojoExecutor.java:153)
	at org.apache.maven.lifecycle.internal.MojoExecutor.execute(MojoExecutor.java:145)
	at org.apache.maven.lifecycle.internal.LifecycleModuleBuilder.buildProject(LifecycleModuleBuilder.java:116)
	at org.apache.maven.lifecycle.internal.LifecycleModuleBuilder.buildProject(LifecycleModuleBuilder.java:80)
	at org.apache.maven.lifecycle.internal.builder.singlethreaded.SingleThreadedBuilder.build(SingleThreadedBuilder.java:51)
	at org.apache.maven.lifecycle.internal.LifecycleStarter.execute(LifecycleStarter.java:128)
	at org.apache.maven.DefaultMaven.doExecute(DefaultMaven.java:307)
	at org.apache.maven.DefaultMaven.doExecute(DefaultMaven.java:193)
	at org.apache.maven.DefaultMaven.execute(DefaultMaven.java:106)
	at org.apache.maven.cli.MavenCli.execute(MavenCli.java:862)
	at org.apache.maven.cli.MavenCli.doMain(MavenCli.java:286)
	at org.apache.maven.cli.MavenCli.main(MavenCli.java:197)
	at sun.reflect.NativeMethodAccessorImpl.invoke0(Native Method)
	at sun.reflect.NativeMethodAccessorImpl.invoke(NativeMethodAccessorImpl.java:57)
	at sun.reflect.DelegatingMethodAccessorImpl.invoke(DelegatingMethodAccessorImpl.java:43)
	at java.lang.reflect.Method.invoke(Method.java:606)
	at org.codehaus.plexus.classworlds.launcher.Launcher.launchEnhanced(Launcher.java:289)
	at org.codehaus.plexus.classworlds.launcher.Launcher.launch(Launcher.java:229)
	at org.codehaus.plexus.classworlds.launcher.Launcher.mainWithExitCode(Launcher.java:415)
	at org.codehaus.plexus.classworlds.launcher.Launcher.main(Launcher.java:356)
Caused by: org.apache.maven.plugin.compiler.CompilationFailureException: Compilation failure
<https://builds.apache.org/job/beam_PostCommit_Java_JDK_Versions_Test/jdk=OpenJDK%207%20(on%20Ubuntu%20only),label=beam/ws/runners/flink/src/main/java/org/apache/beam/runners/flink/FlinkStreamingTransformTranslators.java>:[366,27]
method put in interface java.util.Map<K,V> cannot be applied to given types;
  required: org.apache.beam.sdk.values.TupleTag<?>,org.apache.flink.util.OutputTag<org.apache.beam.sdk.util.WindowedValue<?>>
  found: org.apache.beam.sdk.values.TupleTag<capture#1 of ?>,org.apache.flink.util.OutputTag<java.lang.Object>
  reason: actual argument org.apache.flink.util.OutputTag<java.lang.Object> cannot be
converted to org.apache.flink.util.OutputTag<org.apache.beam.sdk.util.WindowedValue<?>>
by method invocation conversion

	at org.apache.maven.plugin.compiler.AbstractCompilerMojo.execute(AbstractCompilerMojo.java:1029)
	at org.apache.maven.plugin.compiler.CompilerMojo.execute(CompilerMojo.java:137)
	at org.apache.maven.plugin.DefaultBuildPluginManager.executeMojo(DefaultBuildPluginManager.java:134)
	at org.apache.maven.lifecycle.internal.MojoExecutor.execute(MojoExecutor.java:208)
	... 20 more
2017-06-09\T\18:36:07.553 [ERROR] 
2017-06-09\T\18:36:07.553 [ERROR] Re-run Maven using the -X switch to enable full debug logging.
2017-06-09\T\18:36:07.553 [ERROR] 
2017-06-09\T\18:36:07.553 [ERROR] For more information about the errors and possible solutions,
please read the following articles:
2017-06-09\T\18:36:07.554 [ERROR] [Help 1] http://cwiki.apache.org/confluence/display/MAVEN/MojoFailureException
2017-06-09\T\18:36:07.554 [ERROR] 
2017-06-09\T\18:36:07.554 [ERROR] After correcting the problems, you can resume the build
with the command
2017-06-09\T\18:36:07.554 [ERROR]   mvn <goals> -rf :beam-runners-flink_2.10
Build step 'Invoke top-level Maven targets' marked build as failure
Not sending mail to unregistered user kirpichov@google.com
Not sending mail to unregistered user klk@google.com
Not sending mail to unregistered user ccy@google.com

Mime
View raw message