beam-commits mailing list archives

Site index · List index
Message view « Date » · « Thread »
Top « Date » · « Thread »
From Apache Jenkins Server <jenk...@builds.apache.org>
Subject Build failed in Jenkins: beam_PostCommit_Java_MavenInstall_Windows #115
Date Sat, 10 Jun 2017 06:36:14 GMT
See <https://builds.apache.org/job/beam_PostCommit_Java_MavenInstall_Windows/115/display/redirect?page=changes>

Changes:

[klk] Port ViewOverrideFactory to SDK-agnostic APIs

[klk] Port DirectGroupByKey to SDK-agnostic APIs

[klk] Port DirectRunner WriteFiles override to SDK-agnostic APIs

[klk] Port DirectRunner TestStream override to SDK-agnostic APIs

------------------------------------------
[...truncated 2.64 MB...]
2017-06-10T06:34:35.252 [INFO] Downloading: https://repo.maven.apache.org/maven2/org/sonatype/gossip/gossip/1.8/gossip-1.8.pom
2017-06-10T06:34:35.263 [INFO] Downloaded: https://repo.maven.apache.org/maven2/org/sonatype/gossip/gossip/1.8/gossip-1.8.pom
(12 KB at 1023.3 KB/sec)
2017-06-10T06:34:35.267 [INFO] Downloading: https://repo.maven.apache.org/maven2/org/sonatype/forge/forge-parent/9/forge-parent-9.pom
2017-06-10T06:34:35.279 [INFO] Downloaded: https://repo.maven.apache.org/maven2/org/sonatype/forge/forge-parent/9/forge-parent-9.pom
(13 KB at 1069.5 KB/sec)
2017-06-10T06:34:35.285 [INFO] Downloading: https://repo.maven.apache.org/maven2/org/sonatype/gossip/gossip-core/1.8/gossip-core-1.8.pom
2017-06-10T06:34:35.293 [INFO] Downloaded: https://repo.maven.apache.org/maven2/org/sonatype/gossip/gossip-core/1.8/gossip-core-1.8.pom
(3 KB at 271.6 KB/sec)
2017-06-10T06:34:35.297 [INFO] Downloading: https://repo.maven.apache.org/maven2/org/sonatype/gossip/gossip-bootstrap/1.8/gossip-bootstrap-1.8.pom
2017-06-10T06:34:35.306 [INFO] Downloaded: https://repo.maven.apache.org/maven2/org/sonatype/gossip/gossip-bootstrap/1.8/gossip-bootstrap-1.8.pom
(2 KB at 174.8 KB/sec)
2017-06-10T06:34:35.310 [INFO] Downloading: https://repo.maven.apache.org/maven2/com/google/guava/guava/14.0.1/guava-14.0.1.pom
2017-06-10T06:34:35.321 [INFO] Downloaded: https://repo.maven.apache.org/maven2/com/google/guava/guava/14.0.1/guava-14.0.1.pom
(6 KB at 477.3 KB/sec)
2017-06-10T06:34:35.325 [INFO] Downloading: https://repo.maven.apache.org/maven2/com/google/guava/guava-parent/14.0.1/guava-parent-14.0.1.pom
2017-06-10T06:34:35.334 [INFO] Downloaded: https://repo.maven.apache.org/maven2/com/google/guava/guava-parent/14.0.1/guava-parent-14.0.1.pom
(3 KB at 277.2 KB/sec)
2017-06-10T06:34:35.339 [INFO] Downloading: https://repo.maven.apache.org/maven2/org/codehaus/plexus/plexus-classworlds/2.4.2/plexus-classworlds-2.4.2.pom
2017-06-10T06:34:35.348 [INFO] Downloaded: https://repo.maven.apache.org/maven2/org/codehaus/plexus/plexus-classworlds/2.4.2/plexus-classworlds-2.4.2.pom
(4 KB at 380.8 KB/sec)
2017-06-10T06:34:35.354 [INFO] Downloading: https://repo.maven.apache.org/maven2/org/codehaus/plexus/plexus-interpolation/1.16/plexus-interpolation-1.16.pom
2017-06-10T06:34:35.364 [INFO] Downloaded: https://repo.maven.apache.org/maven2/org/codehaus/plexus/plexus-interpolation/1.16/plexus-interpolation-1.16.pom
(2 KB at 100.3 KB/sec)
2017-06-10T06:34:35.369 [INFO] Downloading: https://repo.maven.apache.org/maven2/org/eclipse/aether/aether-api/0.9.0.M2/aether-api-0.9.0.M2.pom
2017-06-10T06:34:35.382 [INFO] Downloaded: https://repo.maven.apache.org/maven2/org/eclipse/aether/aether-api/0.9.0.M2/aether-api-0.9.0.M2.pom
(2 KB at 141.4 KB/sec)
2017-06-10T06:34:35.388 [INFO] Downloading: https://repo.maven.apache.org/maven2/org/codehaus/gmaven/gmaven-adapter-api/2.0/gmaven-adapter-api-2.0.pom
2017-06-10T06:34:35.399 [INFO] Downloaded: https://repo.maven.apache.org/maven2/org/codehaus/gmaven/gmaven-adapter-api/2.0/gmaven-adapter-api-2.0.pom
(2 KB at 160.3 KB/sec)
2017-06-10T06:34:35.407 [INFO] Downloading: https://repo.maven.apache.org/maven2/org/codehaus/gmaven/gmaven-adapter-impl/2.0/gmaven-adapter-impl-2.0.pom
2017-06-10T06:34:35.418 [INFO] Downloaded: https://repo.maven.apache.org/maven2/org/codehaus/gmaven/gmaven-adapter-impl/2.0/gmaven-adapter-impl-2.0.pom
(3 KB at 241.3 KB/sec)
2017-06-10T06:34:35.425 [INFO] Downloading: https://repo.maven.apache.org/maven2/org/codehaus/groovy/groovy-all/2.1.5/groovy-all-2.1.5.pom
2017-06-10T06:34:35.437 [INFO] Downloaded: https://repo.maven.apache.org/maven2/org/codehaus/groovy/groovy-all/2.1.5/groovy-all-2.1.5.pom
(18 KB at 1468.0 KB/sec)
2017-06-10T06:34:35.443 [INFO] Downloading: https://repo.maven.apache.org/maven2/org/apache/ant/ant/1.8.4/ant-1.8.4.pom
2017-06-10T06:34:35.455 [INFO] Downloaded: https://repo.maven.apache.org/maven2/org/apache/ant/ant/1.8.4/ant-1.8.4.pom
(10 KB at 785.6 KB/sec)
2017-06-10T06:34:35.460 [INFO] Downloading: https://repo.maven.apache.org/maven2/org/apache/ant/ant-parent/1.8.4/ant-parent-1.8.4.pom
2017-06-10T06:34:35.471 [INFO] Downloaded: https://repo.maven.apache.org/maven2/org/apache/ant/ant-parent/1.8.4/ant-parent-1.8.4.pom
(5 KB at 404.9 KB/sec)
2017-06-10T06:34:35.475 [INFO] Downloading: https://repo.maven.apache.org/maven2/org/apache/ant/ant-launcher/1.8.4/ant-launcher-1.8.4.pom
2017-06-10T06:34:35.485 [INFO] Downloaded: https://repo.maven.apache.org/maven2/org/apache/ant/ant-launcher/1.8.4/ant-launcher-1.8.4.pom
(3 KB at 230.6 KB/sec)
2017-06-10T06:34:35.490 [INFO] Downloading: https://repo.maven.apache.org/maven2/org/fusesource/jansi/jansi/1.11/jansi-1.11.pom
2017-06-10T06:34:35.499 [INFO] Downloaded: https://repo.maven.apache.org/maven2/org/fusesource/jansi/jansi/1.11/jansi-1.11.pom
(4 KB at 390.7 KB/sec)
2017-06-10T06:34:35.503 [INFO] Downloading: https://repo.maven.apache.org/maven2/org/fusesource/jansi/jansi-project/1.11/jansi-project-1.11.pom
2017-06-10T06:34:35.518 [INFO] Downloaded: https://repo.maven.apache.org/maven2/org/fusesource/jansi/jansi-project/1.11/jansi-project-1.11.pom
(12 KB at 745.2 KB/sec)
2017-06-10T06:34:35.522 [INFO] Downloading: https://repo.maven.apache.org/maven2/org/fusesource/fusesource-pom/1.8/fusesource-pom-1.8.pom
2017-06-10T06:34:35.534 [INFO] Downloaded: https://repo.maven.apache.org/maven2/org/fusesource/fusesource-pom/1.8/fusesource-pom-1.8.pom
(15 KB at 1192.6 KB/sec)
2017-06-10T06:34:35.549 [INFO] Downloading: https://repo.maven.apache.org/maven2/org/sonatype/gossip/gossip-slf4j/1.8/gossip-slf4j-1.8.jar
2017-06-10T06:34:35.549 [INFO] Downloading: https://repo.maven.apache.org/maven2/org/sonatype/gossip/gossip-bootstrap/1.8/gossip-bootstrap-1.8.jar
2017-06-10T06:34:35.552 [INFO] Downloading: https://repo.maven.apache.org/maven2/org/codehaus/plexus/plexus-classworlds/2.4.2/plexus-classworlds-2.4.2.jar
2017-06-10T06:34:35.552 [INFO] Downloading: https://repo.maven.apache.org/maven2/org/sonatype/gossip/gossip-core/1.8/gossip-core-1.8.jar
2017-06-10T06:34:35.553 [INFO] Downloading: https://repo.maven.apache.org/maven2/com/google/guava/guava/14.0.1/guava-14.0.1.jar
2017-06-10T06:34:35.568 [INFO] Downloaded: https://repo.maven.apache.org/maven2/org/sonatype/gossip/gossip-bootstrap/1.8/gossip-bootstrap-1.8.jar
(20 KB at 964.7 KB/sec)
2017-06-10T06:34:35.568 [INFO] Downloading: https://repo.maven.apache.org/maven2/org/codehaus/plexus/plexus-interpolation/1.16/plexus-interpolation-1.16.jar
2017-06-10T06:34:35.570 [INFO] Downloaded: https://repo.maven.apache.org/maven2/org/codehaus/plexus/plexus-classworlds/2.4.2/plexus-classworlds-2.4.2.jar
(46 KB at 2184.2 KB/sec)
2017-06-10T06:34:35.570 [INFO] Downloading: https://repo.maven.apache.org/maven2/org/eclipse/aether/aether-api/0.9.0.M2/aether-api-0.9.0.M2.jar
2017-06-10T06:34:35.571 [INFO] Downloaded: https://repo.maven.apache.org/maven2/org/sonatype/gossip/gossip-slf4j/1.8/gossip-slf4j-1.8.jar
(5 KB at 187.6 KB/sec)
2017-06-10T06:34:35.571 [INFO] Downloading: https://repo.maven.apache.org/maven2/org/codehaus/gmaven/gmaven-adapter-api/2.0/gmaven-adapter-api-2.0.jar
2017-06-10T06:34:35.573 [INFO] Downloaded: https://repo.maven.apache.org/maven2/org/sonatype/gossip/gossip-core/1.8/gossip-core-1.8.jar
(57 KB at 2352.5 KB/sec)
2017-06-10T06:34:35.573 [INFO] Downloading: https://repo.maven.apache.org/maven2/org/codehaus/gmaven/gmaven-adapter-impl/2.0/gmaven-adapter-impl-2.0.jar
2017-06-10T06:34:35.588 [INFO] Downloaded: https://repo.maven.apache.org/maven2/org/codehaus/gmaven/gmaven-adapter-impl/2.0/gmaven-adapter-impl-2.0.jar
(16 KB at 404.9 KB/sec)
2017-06-10T06:34:35.588 [INFO] Downloading: https://repo.maven.apache.org/maven2/org/codehaus/groovy/groovy-all/2.1.5/groovy-all-2.1.5.jar
2017-06-10T06:34:35.590 [INFO] Downloaded: https://repo.maven.apache.org/maven2/org/codehaus/plexus/plexus-interpolation/1.16/plexus-interpolation-1.16.jar
(60 KB at 1496.8 KB/sec)
2017-06-10T06:34:35.590 [INFO] Downloading: https://repo.maven.apache.org/maven2/org/apache/ant/ant/1.8.4/ant-1.8.4.jar
2017-06-10T06:34:35.594 [INFO] Downloaded: https://repo.maven.apache.org/maven2/org/codehaus/gmaven/gmaven-adapter-api/2.0/gmaven-adapter-api-2.0.jar
(7 KB at 153.6 KB/sec)
2017-06-10T06:34:35.594 [INFO] Downloading: https://repo.maven.apache.org/maven2/org/apache/ant/ant-launcher/1.8.4/ant-launcher-1.8.4.jar
2017-06-10T06:34:35.614 [INFO] Downloaded: https://repo.maven.apache.org/maven2/org/eclipse/aether/aether-api/0.9.0.M2/aether-api-0.9.0.M2.jar
(131 KB at 2012.6 KB/sec)
2017-06-10T06:34:35.615 [INFO] Downloading: https://repo.maven.apache.org/maven2/org/fusesource/jansi/jansi/1.11/jansi-1.11.jar
2017-06-10T06:34:35.616 [INFO] Downloaded: https://repo.maven.apache.org/maven2/org/apache/ant/ant-launcher/1.8.4/ant-launcher-1.8.4.jar
(18 KB at 268.6 KB/sec)
2017-06-10T06:34:35.639 [INFO] Downloaded: https://repo.maven.apache.org/maven2/org/fusesource/jansi/jansi/1.11/jansi-1.11.jar
(112 KB at 1241.5 KB/sec)
2017-06-10T06:34:35.786 [INFO] Downloaded: https://repo.maven.apache.org/maven2/org/apache/ant/ant/1.8.4/ant-1.8.4.jar
(1897 KB at 8000.9 KB/sec)
2017-06-10T06:34:35.810 [INFO] Downloaded: https://repo.maven.apache.org/maven2/com/google/guava/guava/14.0.1/guava-14.0.1.jar
(2138 KB at 8159.6 KB/sec)
2017-06-10T06:34:36.238 [INFO] Downloaded: https://repo.maven.apache.org/maven2/org/codehaus/groovy/groovy-all/2.1.5/groovy-all-2.1.5.jar
(6219 KB at 9025.1 KB/sec)
[JENKINS] Archiving disabled
2017-06-10T06:34:39.747 [INFO]                                                           
             
2017-06-10T06:34:39.747 [INFO] ------------------------------------------------------------------------
2017-06-10T06:34:39.747 [INFO] Skipping Apache Beam :: Parent
2017-06-10T06:34:39.747 [INFO] This project has been banned from the build due to previous
failures.
2017-06-10T06:34:39.747 [INFO] ------------------------------------------------------------------------
[JENKINS] Archiving disabled
[JENKINS] Archiving disabled
[JENKINS] Archiving disabled
[JENKINS] Archiving disabled
[JENKINS] Archiving disabled
[JENKINS] Archiving disabled
[JENKINS] Archiving disabled
[JENKINS] Archiving disabled
[JENKINS] Archiving disabled
[JENKINS] Archiving disabled
[JENKINS] Archiving disabled
[JENKINS] Archiving disabled
[JENKINS] Archiving disabled
[JENKINS] Archiving disabled
[JENKINS] Archiving disabled
[JENKINS] Archiving disabled
[JENKINS] Archiving disabled
[JENKINS] Archiving disabled
[JENKINS] Archiving disabled
[JENKINS] Archiving disabled
[JENKINS] Archiving disabled
[JENKINS] Archiving disabled
[JENKINS] Archiving disabled
[JENKINS] Archiving disabled
[JENKINS] Archiving disabled
[JENKINS] Archiving disabled
[JENKINS] Archiving disabled
[JENKINS] Archiving disabled
[JENKINS] Archiving disabled
[JENKINS] Archiving disabled
[JENKINS] Archiving disabled
[JENKINS] Archiving disabled
[JENKINS] Archiving disabled
[JENKINS] Archiving disabled
[JENKINS] Archiving disabled
[JENKINS] Archiving disabled
[JENKINS] Archiving disabled
[JENKINS] Archiving disabled
[JENKINS] Archiving disabled
[JENKINS] Archiving disabled
[JENKINS] Archiving disabled
[JENKINS] Archiving disabled
[JENKINS] Archiving disabled
[JENKINS] Archiving disabled
[JENKINS] Archiving disabled
[JENKINS] Archiving disabled
[JENKINS] Archiving disabled
[JENKINS] Archiving disabled
[JENKINS] Archiving disabled
[JENKINS] Archiving disabled
2017-06-10T06:35:49.050 [INFO] ------------------------------------------------------------------------
2017-06-10T06:35:49.050 [INFO] Reactor Summary:
2017-06-10T06:35:49.050 [INFO] 
2017-06-10T06:35:49.051 [INFO] Apache Beam :: Parent .............................. SUCCESS
[ 25.581 s]
2017-06-10T06:35:49.051 [INFO] Apache Beam :: SDKs :: Java :: Build Tools ......... SUCCESS
[ 18.397 s]
2017-06-10T06:35:49.051 [INFO] Apache Beam :: SDKs ................................ SUCCESS
[  9.332 s]
2017-06-10T06:35:49.051 [INFO] Apache Beam :: SDKs :: Common ...................... SUCCESS
[  5.523 s]
2017-06-10T06:35:49.051 [INFO] Apache Beam :: SDKs :: Common :: Runner API ........ SUCCESS
[ 24.222 s]
2017-06-10T06:35:49.051 [INFO] Apache Beam :: SDKs :: Common :: Fn API ............ SUCCESS
[ 26.683 s]
2017-06-10T06:35:49.051 [INFO] Apache Beam :: SDKs :: Java ........................ SUCCESS
[  5.902 s]
2017-06-10T06:35:49.051 [INFO] Apache Beam :: SDKs :: Java :: Core ................ SUCCESS
[04:21 min]
2017-06-10T06:35:49.051 [INFO] Apache Beam :: Runners ............................. SUCCESS
[  5.801 s]
2017-06-10T06:35:49.051 [INFO] Apache Beam :: Runners :: Core Construction Java ... SUCCESS
[ 48.714 s]
2017-06-10T06:35:49.051 [INFO] Apache Beam :: Runners :: Core Java ................ SUCCESS
[01:12 min]
2017-06-10T06:35:49.051 [INFO] Apache Beam :: Runners :: Direct Java .............. SUCCESS
[03:47 min]
2017-06-10T06:35:49.051 [INFO] Apache Beam :: SDKs :: Java :: IO .................. SUCCESS
[ 10.626 s]
2017-06-10T06:35:49.051 [INFO] Apache Beam :: SDKs :: Java :: IO :: Common ........ SUCCESS
[ 14.460 s]
2017-06-10T06:35:49.051 [INFO] Apache Beam :: SDKs :: Java :: IO :: Cassandra ..... SUCCESS
[ 38.606 s]
2017-06-10T06:35:49.051 [INFO] Apache Beam :: SDKs :: Java :: IO :: Elasticsearch . SUCCESS
[ 52.799 s]
2017-06-10T06:35:49.051 [INFO] Apache Beam :: SDKs :: Java :: Extensions .......... SUCCESS
[  7.085 s]
2017-06-10T06:35:49.052 [INFO] Apache Beam :: SDKs :: Java :: Extensions :: Google Cloud Platform
Core SUCCESS [ 57.084 s]
2017-06-10T06:35:49.052 [INFO] Apache Beam :: SDKs :: Java :: Extensions :: Protobuf SUCCESS
[ 30.431 s]
2017-06-10T06:35:49.052 [INFO] Apache Beam :: SDKs :: Java :: IO :: Google Cloud Platform
SUCCESS [01:29 min]
2017-06-10T06:35:49.052 [INFO] Apache Beam :: SDKs :: Java :: IO :: Hadoop Common . SUCCESS
[ 31.335 s]
2017-06-10T06:35:49.052 [INFO] Apache Beam :: SDKs :: Java :: IO :: Hadoop File System SUCCESS
[ 47.595 s]
2017-06-10T06:35:49.052 [INFO] Apache Beam :: SDKs :: Java :: IO :: Hadoop ........ SUCCESS
[  9.812 s]
2017-06-10T06:35:49.052 [INFO] Apache Beam :: SDKs :: Java :: IO :: Hadoop :: input-format
SUCCESS [ 37.725 s]
2017-06-10T06:35:49.052 [INFO] Apache Beam :: SDKs :: Java :: IO :: Hadoop :: jdk1.8-tests
SUCCESS [01:50 min]
2017-06-10T06:35:49.052 [INFO] Apache Beam :: SDKs :: Java :: IO :: HBase ......... SUCCESS
[ 46.563 s]
2017-06-10T06:35:49.052 [INFO] Apache Beam :: SDKs :: Java :: IO :: HCatalog ...... SUCCESS
[01:01 min]
2017-06-10T06:35:49.052 [INFO] Apache Beam :: SDKs :: Java :: IO :: JDBC .......... SUCCESS
[ 37.153 s]
2017-06-10T06:35:49.052 [INFO] Apache Beam :: SDKs :: Java :: IO :: JMS ........... SUCCESS
[ 31.761 s]
2017-06-10T06:35:49.052 [INFO] Apache Beam :: SDKs :: Java :: IO :: Kafka ......... SUCCESS
[ 41.305 s]
2017-06-10T06:35:49.052 [INFO] Apache Beam :: SDKs :: Java :: IO :: Kinesis ....... SUCCESS
[ 37.054 s]
2017-06-10T06:35:49.052 [INFO] Apache Beam :: SDKs :: Java :: IO :: MongoDB ....... SUCCESS
[ 46.803 s]
2017-06-10T06:35:49.052 [INFO] Apache Beam :: SDKs :: Java :: IO :: MQTT .......... SUCCESS
[ 32.023 s]
2017-06-10T06:35:49.052 [INFO] Apache Beam :: SDKs :: Java :: IO :: XML ........... SUCCESS
[ 31.312 s]
2017-06-10T06:35:49.052 [INFO] Apache Beam :: SDKs :: Java :: Maven Archetypes .... SUCCESS
[  4.844 s]
2017-06-10T06:35:49.052 [INFO] Apache Beam :: SDKs :: Java :: Maven Archetypes :: Starter
SUCCESS [ 27.780 s]
2017-06-10T06:35:49.052 [INFO] Apache Beam :: SDKs :: Java :: Extensions :: Jackson SUCCESS
[ 26.984 s]
2017-06-10T06:35:49.053 [INFO] Apache Beam :: SDKs :: Java :: Extensions :: Join library SUCCESS
[ 29.784 s]
2017-06-10T06:35:49.053 [INFO] Apache Beam :: SDKs :: Java :: Extensions :: Sorter  SUCCESS
[ 40.083 s]
2017-06-10T06:35:49.053 [INFO] Apache Beam :: Runners :: Google Cloud Dataflow .... SUCCESS
[ 55.915 s]
2017-06-10T06:35:49.053 [INFO] Apache Beam :: SDKs :: Java :: Harness ............. SUCCESS
[ 59.842 s]
2017-06-10T06:35:49.053 [INFO] Apache Beam :: SDKs :: Java :: Java 8 Tests ........ SUCCESS
[ 30.166 s]
2017-06-10T06:35:49.053 [INFO] Apache Beam :: SDKs :: Python ...................... FAILURE
[  3.777 s]
2017-06-10T06:35:49.053 [INFO] Apache Beam :: Runners :: Flink .................... SKIPPED
2017-06-10T06:35:49.053 [INFO] Apache Beam :: Runners :: Spark .................... SKIPPED
2017-06-10T06:35:49.053 [INFO] Apache Beam :: Runners :: Apex ..................... SKIPPED
2017-06-10T06:35:49.053 [INFO] Apache Beam :: Examples ............................ SKIPPED
2017-06-10T06:35:49.053 [INFO] Apache Beam :: Examples :: Java .................... SKIPPED
2017-06-10T06:35:49.053 [INFO] Apache Beam :: Examples :: Java 8 .................. SKIPPED
2017-06-10T06:35:49.053 [INFO] Apache Beam :: SDKs :: Java :: Aggregated Javadoc .. SKIPPED
2017-06-10T06:35:49.053 [INFO] ------------------------------------------------------------------------
2017-06-10T06:35:49.053 [INFO] BUILD FAILURE
2017-06-10T06:35:49.053 [INFO] ------------------------------------------------------------------------
2017-06-10T06:35:49.053 [INFO] Total time: 34:59 min
2017-06-10T06:35:49.054 [INFO] Finished at: 2017-06-10T06:35:49+00:00
2017-06-10T06:35:50.600 [INFO] Final Memory: 409M/3010M
2017-06-10T06:35:50.600 [INFO] ------------------------------------------------------------------------
2017-06-10T06:35:50.612 [ERROR] Failed to execute goal org.codehaus.gmaven:groovy-maven-plugin:2.0:execute
(find-supported-python-for-clean) on project beam-sdks-python: Unable to find Python 2.7 in
path -> [Help 1]
org.apache.maven.lifecycle.LifecycleExecutionException: Failed to execute goal org.codehaus.gmaven:groovy-maven-plugin:2.0:execute
(find-supported-python-for-clean) on project beam-sdks-python: Unable to find Python 2.7 in
path
	at org.apache.maven.lifecycle.internal.MojoExecutor.execute(MojoExecutor.java:212)
	at org.apache.maven.lifecycle.internal.MojoExecutor.execute(MojoExecutor.java:153)
	at org.apache.maven.lifecycle.internal.MojoExecutor.execute(MojoExecutor.java:145)
	at org.apache.maven.lifecycle.internal.LifecycleModuleBuilder.buildProject(LifecycleModuleBuilder.java:116)
	at org.apache.maven.lifecycle.internal.LifecycleModuleBuilder.buildProject(LifecycleModuleBuilder.java:80)
	at org.apache.maven.lifecycle.internal.builder.singlethreaded.SingleThreadedBuilder.build(SingleThreadedBuilder.java:51)
	at org.apache.maven.lifecycle.internal.LifecycleStarter.execute(LifecycleStarter.java:128)
	at org.apache.maven.DefaultMaven.doExecute(DefaultMaven.java:307)
	at org.apache.maven.DefaultMaven.doExecute(DefaultMaven.java:193)
	at org.apache.maven.DefaultMaven.execute(DefaultMaven.java:106)
	at org.jvnet.hudson.maven3.launcher.Maven33Launcher.main(Maven33Launcher.java:129)
	at sun.reflect.NativeMethodAccessorImpl.invoke0(Native Method)
	at sun.reflect.NativeMethodAccessorImpl.invoke(NativeMethodAccessorImpl.java:62)
	at sun.reflect.DelegatingMethodAccessorImpl.invoke(DelegatingMethodAccessorImpl.java:43)
	at java.lang.reflect.Method.invoke(Method.java:498)
	at org.codehaus.plexus.classworlds.launcher.Launcher.launchStandard(Launcher.java:330)
	at org.codehaus.plexus.classworlds.launcher.Launcher.launch(Launcher.java:238)
	at jenkins.maven3.agent.Maven33Main.launch(Maven33Main.java:176)
	at sun.reflect.NativeMethodAccessorImpl.invoke0(Native Method)
	at sun.reflect.NativeMethodAccessorImpl.invoke(NativeMethodAccessorImpl.java:62)
	at sun.reflect.DelegatingMethodAccessorImpl.invoke(DelegatingMethodAccessorImpl.java:43)
	at java.lang.reflect.Method.invoke(Method.java:498)
	at hudson.maven.Maven3Builder.call(Maven3Builder.java:139)
	at hudson.maven.Maven3Builder.call(Maven3Builder.java:70)
	at hudson.remoting.UserRequest.perform(UserRequest.java:120)
	at hudson.remoting.UserRequest.perform(UserRequest.java:48)
	at hudson.remoting.Request$2.run(Request.java:326)
	at hudson.remoting.InterceptingExecutorService$1.call(InterceptingExecutorService.java:68)
	at java.util.concurrent.FutureTask.run(FutureTask.java:266)
	at java.util.concurrent.ThreadPoolExecutor.runWorker(ThreadPoolExecutor.java:1142)
	at java.util.concurrent.ThreadPoolExecutor$Worker.run(ThreadPoolExecutor.java:617)
	at java.lang.Thread.run(Thread.java:745)
Caused by: org.apache.maven.plugin.MojoFailureException: Unable to find Python 2.7 in path
	at sun.reflect.NativeConstructorAccessorImpl.newInstance0(Native Method)
	at sun.reflect.NativeConstructorAccessorImpl.newInstance(NativeConstructorAccessorImpl.java:62)
	at sun.reflect.DelegatingConstructorAccessorImpl.newInstance(DelegatingConstructorAccessorImpl.java:45)
	at java.lang.reflect.Constructor.newInstance(Constructor.java:423)
	at org.codehaus.groovy.reflection.CachedConstructor.invoke(CachedConstructor.java:77)
	at org.codehaus.groovy.runtime.callsite.ConstructorSite$ConstructorSiteNoUnwrapNoCoerce.callConstructor(ConstructorSite.java:102)
	at org.codehaus.groovy.runtime.callsite.CallSiteArray.defaultCallConstructor(CallSiteArray.java:57)
	at org.codehaus.groovy.runtime.callsite.AbstractCallSite.callConstructor(AbstractCallSite.java:182)
	at org.codehaus.groovy.runtime.callsite.AbstractCallSite.callConstructor(AbstractCallSite.java:190)
	at findSupportedPython.run(findSupportedPython.groovy:70)
	at groovy.lang.GroovyShell.evaluate(GroovyShell.java:518)
	at org.codehaus.gmaven.adapter.impl.ScriptExecutorImpl.execute(ScriptExecutorImpl.java:80)
	at org.codehaus.gmaven.plugin.ExecuteMojo$1.run(ExecuteMojo.java:100)
	at org.codehaus.gmaven.plugin.util.SystemNoExitGuard.run(SystemNoExitGuard.java:45)
	at org.codehaus.gmaven.plugin.ExecuteMojo.run(ExecuteMojo.java:96)
	at org.codehaus.gmaven.plugin.MojoSupport.execute(MojoSupport.java:45)
	at org.apache.maven.plugin.DefaultBuildPluginManager.executeMojo(DefaultBuildPluginManager.java:134)
	at org.apache.maven.lifecycle.internal.MojoExecutor.execute(MojoExecutor.java:208)
	... 31 more
2017-06-10T06:35:50.615 [ERROR] 
2017-06-10T06:35:50.615 [ERROR] Re-run Maven using the -X switch to enable full debug logging.
2017-06-10T06:35:50.615 [ERROR] 
2017-06-10T06:35:50.615 [ERROR] For more information about the errors and possible solutions,
please read the following articles:
2017-06-10T06:35:50.615 [ERROR] [Help 1] http://cwiki.apache.org/confluence/display/MAVEN/MojoFailureException
2017-06-10T06:35:50.615 [ERROR] 
2017-06-10T06:35:50.615 [ERROR] After correcting the problems, you can resume the build with
the command
2017-06-10T06:35:50.615 [ERROR]   mvn <goals> -rf :beam-sdks-python
channel stopped
Not sending mail to unregistered user github@nakomis.com
Not sending mail to unregistered user ccy@google.com
Not sending mail to unregistered user mingmxu@ebay.com
Not sending mail to unregistered user kirpichov@google.com
Not sending mail to unregistered user aljoscha.krettek@gmail.com
Not sending mail to unregistered user klk@google.com
Not sending mail to unregistered user sourabhbajaj@google.com
Not sending mail to unregistered user hepei.hp@alibaba-inc.com

Mime
View raw message