beam-commits mailing list archives

Site index · List index
Message view « Date » · « Thread »
Top « Date » · « Thread »
From Apache Jenkins Server <jenk...@builds.apache.org>
Subject Build failed in Jenkins: beam_PostCommit_Java_MavenInstall_Windows #159
Date Wed, 21 Jun 2017 06:34:49 GMT
See <https://builds.apache.org/job/beam_PostCommit_Java_MavenInstall_Windows/159/display/redirect?page=changes>

Changes:

[kirpichov] BEAM-1438 Auto shard streaming sinks

[robertwb] None should be a valid return element

------------------------------------------
[...truncated 2.65 MB...]
2017-06-21T06:33:13.377 [INFO] Downloaded: https://repo.maven.apache.org/maven2/org/sonatype/gossip/gossip/1.8/gossip-1.8.pom
(12 KB at 416.9 KB/sec)
2017-06-21T06:33:13.380 [INFO] Downloading: https://repo.maven.apache.org/maven2/org/sonatype/forge/forge-parent/9/forge-parent-9.pom
2017-06-21T06:33:13.410 [INFO] Downloaded: https://repo.maven.apache.org/maven2/org/sonatype/forge/forge-parent/9/forge-parent-9.pom
(13 KB at 427.8 KB/sec)
2017-06-21T06:33:13.414 [INFO] Downloading: https://repo.maven.apache.org/maven2/org/sonatype/gossip/gossip-core/1.8/gossip-core-1.8.pom
2017-06-21T06:33:13.441 [INFO] Downloaded: https://repo.maven.apache.org/maven2/org/sonatype/gossip/gossip-core/1.8/gossip-core-1.8.pom
(3 KB at 80.5 KB/sec)
2017-06-21T06:33:13.445 [INFO] Downloading: https://repo.maven.apache.org/maven2/org/sonatype/gossip/gossip-bootstrap/1.8/gossip-bootstrap-1.8.pom
2017-06-21T06:33:13.473 [INFO] Downloaded: https://repo.maven.apache.org/maven2/org/sonatype/gossip/gossip-bootstrap/1.8/gossip-bootstrap-1.8.pom
(2 KB at 56.2 KB/sec)
2017-06-21T06:33:13.476 [INFO] Downloading: https://repo.maven.apache.org/maven2/com/google/guava/guava/14.0.1/guava-14.0.1.pom
2017-06-21T06:33:13.504 [INFO] Downloaded: https://repo.maven.apache.org/maven2/com/google/guava/guava/14.0.1/guava-14.0.1.pom
(6 KB at 187.5 KB/sec)
2017-06-21T06:33:13.507 [INFO] Downloading: https://repo.maven.apache.org/maven2/com/google/guava/guava-parent/14.0.1/guava-parent-14.0.1.pom
2017-06-21T06:33:13.535 [INFO] Downloaded: https://repo.maven.apache.org/maven2/com/google/guava/guava-parent/14.0.1/guava-parent-14.0.1.pom
(3 KB at 89.1 KB/sec)
2017-06-21T06:33:13.539 [INFO] Downloading: https://repo.maven.apache.org/maven2/org/codehaus/plexus/plexus-classworlds/2.4.2/plexus-classworlds-2.4.2.pom
2017-06-21T06:33:13.567 [INFO] Downloaded: https://repo.maven.apache.org/maven2/org/codehaus/plexus/plexus-classworlds/2.4.2/plexus-classworlds-2.4.2.pom
(4 KB at 122.4 KB/sec)
2017-06-21T06:33:13.572 [INFO] Downloading: https://repo.maven.apache.org/maven2/org/codehaus/plexus/plexus-interpolation/1.16/plexus-interpolation-1.16.pom
2017-06-21T06:33:13.597 [INFO] Downloaded: https://repo.maven.apache.org/maven2/org/codehaus/plexus/plexus-interpolation/1.16/plexus-interpolation-1.16.pom
(2 KB at 38.6 KB/sec)
2017-06-21T06:33:13.602 [INFO] Downloading: https://repo.maven.apache.org/maven2/org/eclipse/aether/aether-api/0.9.0.M2/aether-api-0.9.0.M2.pom
2017-06-21T06:33:13.640 [INFO] Downloaded: https://repo.maven.apache.org/maven2/org/eclipse/aether/aether-api/0.9.0.M2/aether-api-0.9.0.M2.pom
(2 KB at 44.6 KB/sec)
2017-06-21T06:33:13.645 [INFO] Downloading: https://repo.maven.apache.org/maven2/org/codehaus/gmaven/gmaven-adapter-api/2.0/gmaven-adapter-api-2.0.pom
2017-06-21T06:33:13.755 [INFO] Downloaded: https://repo.maven.apache.org/maven2/org/codehaus/gmaven/gmaven-adapter-api/2.0/gmaven-adapter-api-2.0.pom
(2 KB at 16.0 KB/sec)
2017-06-21T06:33:13.760 [INFO] Downloading: https://repo.maven.apache.org/maven2/org/codehaus/gmaven/gmaven-adapter-impl/2.0/gmaven-adapter-impl-2.0.pom
2017-06-21T06:33:13.869 [INFO] Downloaded: https://repo.maven.apache.org/maven2/org/codehaus/gmaven/gmaven-adapter-impl/2.0/gmaven-adapter-impl-2.0.pom
(3 KB at 24.4 KB/sec)
2017-06-21T06:33:13.874 [INFO] Downloading: https://repo.maven.apache.org/maven2/org/codehaus/groovy/groovy-all/2.1.5/groovy-all-2.1.5.pom
2017-06-21T06:33:13.988 [INFO] Downloaded: https://repo.maven.apache.org/maven2/org/codehaus/groovy/groovy-all/2.1.5/groovy-all-2.1.5.pom
(18 KB at 154.5 KB/sec)
2017-06-21T06:33:13.992 [INFO] Downloading: https://repo.maven.apache.org/maven2/org/apache/ant/ant/1.8.4/ant-1.8.4.pom
2017-06-21T06:33:14.022 [INFO] Downloaded: https://repo.maven.apache.org/maven2/org/apache/ant/ant/1.8.4/ant-1.8.4.pom
(10 KB at 314.3 KB/sec)
2017-06-21T06:33:14.025 [INFO] Downloading: https://repo.maven.apache.org/maven2/org/apache/ant/ant-parent/1.8.4/ant-parent-1.8.4.pom
2017-06-21T06:33:14.054 [INFO] Downloaded: https://repo.maven.apache.org/maven2/org/apache/ant/ant-parent/1.8.4/ant-parent-1.8.4.pom
(5 KB at 153.6 KB/sec)
2017-06-21T06:33:14.057 [INFO] Downloading: https://repo.maven.apache.org/maven2/org/apache/ant/ant-launcher/1.8.4/ant-launcher-1.8.4.pom
2017-06-21T06:33:14.085 [INFO] Downloaded: https://repo.maven.apache.org/maven2/org/apache/ant/ant-launcher/1.8.4/ant-launcher-1.8.4.pom
(3 KB at 82.3 KB/sec)
2017-06-21T06:33:14.088 [INFO] Downloading: https://repo.maven.apache.org/maven2/org/fusesource/jansi/jansi/1.11/jansi-1.11.pom
2017-06-21T06:33:14.119 [INFO] Downloaded: https://repo.maven.apache.org/maven2/org/fusesource/jansi/jansi/1.11/jansi-1.11.pom
(4 KB at 113.4 KB/sec)
2017-06-21T06:33:14.122 [INFO] Downloading: https://repo.maven.apache.org/maven2/org/fusesource/jansi/jansi-project/1.11/jansi-project-1.11.pom
2017-06-21T06:33:14.150 [INFO] Downloaded: https://repo.maven.apache.org/maven2/org/fusesource/jansi/jansi-project/1.11/jansi-project-1.11.pom
(12 KB at 399.2 KB/sec)
2017-06-21T06:33:14.154 [INFO] Downloading: https://repo.maven.apache.org/maven2/org/fusesource/fusesource-pom/1.8/fusesource-pom-1.8.pom
2017-06-21T06:33:14.182 [INFO] Downloaded: https://repo.maven.apache.org/maven2/org/fusesource/fusesource-pom/1.8/fusesource-pom-1.8.pom
(15 KB at 530.1 KB/sec)
2017-06-21T06:33:14.197 [INFO] Downloading: https://repo.maven.apache.org/maven2/org/sonatype/gossip/gossip-core/1.8/gossip-core-1.8.jar
2017-06-21T06:33:14.197 [INFO] Downloading: https://repo.maven.apache.org/maven2/org/sonatype/gossip/gossip-bootstrap/1.8/gossip-bootstrap-1.8.jar
2017-06-21T06:33:14.197 [INFO] Downloading: https://repo.maven.apache.org/maven2/org/sonatype/gossip/gossip-slf4j/1.8/gossip-slf4j-1.8.jar
2017-06-21T06:33:14.199 [INFO] Downloading: https://repo.maven.apache.org/maven2/org/codehaus/plexus/plexus-classworlds/2.4.2/plexus-classworlds-2.4.2.jar
2017-06-21T06:33:14.199 [INFO] Downloading: https://repo.maven.apache.org/maven2/com/google/guava/guava/14.0.1/guava-14.0.1.jar
2017-06-21T06:33:14.231 [INFO] Downloaded: https://repo.maven.apache.org/maven2/org/codehaus/plexus/plexus-classworlds/2.4.2/plexus-classworlds-2.4.2.jar
(46 KB at 1349.1 KB/sec)
2017-06-21T06:33:14.231 [INFO] Downloading: https://repo.maven.apache.org/maven2/org/codehaus/plexus/plexus-interpolation/1.16/plexus-interpolation-1.16.jar
2017-06-21T06:33:14.236 [INFO] Downloaded: https://repo.maven.apache.org/maven2/org/sonatype/gossip/gossip-core/1.8/gossip-core-1.8.jar
(57 KB at 1411.5 KB/sec)
2017-06-21T06:33:14.236 [INFO] Downloading: https://repo.maven.apache.org/maven2/org/eclipse/aether/aether-api/0.9.0.M2/aether-api-0.9.0.M2.jar
2017-06-21T06:33:14.262 [INFO] Downloaded: https://repo.maven.apache.org/maven2/org/codehaus/plexus/plexus-interpolation/1.16/plexus-interpolation-1.16.jar
(60 KB at 921.1 KB/sec)
2017-06-21T06:33:14.262 [INFO] Downloading: https://repo.maven.apache.org/maven2/org/codehaus/gmaven/gmaven-adapter-api/2.0/gmaven-adapter-api-2.0.jar
2017-06-21T06:33:14.277 [INFO] Downloaded: https://repo.maven.apache.org/maven2/org/eclipse/aether/aether-api/0.9.0.M2/aether-api-0.9.0.M2.jar
(131 KB at 1635.2 KB/sec)
2017-06-21T06:33:14.277 [INFO] Downloading: https://repo.maven.apache.org/maven2/org/codehaus/gmaven/gmaven-adapter-impl/2.0/gmaven-adapter-impl-2.0.jar
2017-06-21T06:33:14.304 [INFO] Downloaded: https://repo.maven.apache.org/maven2/org/sonatype/gossip/gossip-slf4j/1.8/gossip-slf4j-1.8.jar
(5 KB at 38.2 KB/sec)
2017-06-21T06:33:14.304 [INFO] Downloading: https://repo.maven.apache.org/maven2/org/codehaus/groovy/groovy-all/2.1.5/groovy-all-2.1.5.jar
2017-06-21T06:33:14.383 [INFO] Downloaded: https://repo.maven.apache.org/maven2/org/codehaus/gmaven/gmaven-adapter-api/2.0/gmaven-adapter-api-2.0.jar
(7 KB at 37.4 KB/sec)
2017-06-21T06:33:14.383 [INFO] Downloading: https://repo.maven.apache.org/maven2/org/apache/ant/ant/1.8.4/ant-1.8.4.jar
2017-06-21T06:33:14.390 [INFO] Downloaded: https://repo.maven.apache.org/maven2/org/sonatype/gossip/gossip-bootstrap/1.8/gossip-bootstrap-1.8.jar
(20 KB at 99.5 KB/sec)
2017-06-21T06:33:14.390 [INFO] Downloading: https://repo.maven.apache.org/maven2/org/apache/ant/ant-launcher/1.8.4/ant-launcher-1.8.4.jar
2017-06-21T06:33:14.398 [INFO] Downloaded: https://repo.maven.apache.org/maven2/org/codehaus/gmaven/gmaven-adapter-impl/2.0/gmaven-adapter-impl-2.0.jar
(16 KB at 79.0 KB/sec)
2017-06-21T06:33:14.398 [INFO] Downloading: https://repo.maven.apache.org/maven2/org/fusesource/jansi/jansi/1.11/jansi-1.11.jar
2017-06-21T06:33:14.428 [INFO] Downloaded: https://repo.maven.apache.org/maven2/org/apache/ant/ant-launcher/1.8.4/ant-launcher-1.8.4.jar
(18 KB at 78.2 KB/sec)
2017-06-21T06:33:14.448 [INFO] Downloaded: https://repo.maven.apache.org/maven2/org/fusesource/jansi/jansi/1.11/jansi-1.11.jar
(112 KB at 446.9 KB/sec)
2017-06-21T06:33:14.449 [INFO] Downloaded: https://repo.maven.apache.org/maven2/com/google/guava/guava/14.0.1/guava-14.0.1.jar
(2138 KB at 8449.8 KB/sec)
2017-06-21T06:33:14.606 [INFO] Downloaded: https://repo.maven.apache.org/maven2/org/apache/ant/ant/1.8.4/ant-1.8.4.jar
(1897 KB at 4647.6 KB/sec)
2017-06-21T06:33:15.011 [INFO] Downloaded: https://repo.maven.apache.org/maven2/org/codehaus/groovy/groovy-all/2.1.5/groovy-all-2.1.5.jar
(6219 KB at 7658.0 KB/sec)
[JENKINS] Archiving disabled
2017-06-21T06:33:18.225 [INFO]                                                           
             
2017-06-21T06:33:18.225 [INFO] ------------------------------------------------------------------------
2017-06-21T06:33:18.225 [INFO] Skipping Apache Beam :: Parent
2017-06-21T06:33:18.225 [INFO] This project has been banned from the build due to previous
failures.
2017-06-21T06:33:18.225 [INFO] ------------------------------------------------------------------------
[JENKINS] Archiving disabled
[JENKINS] Archiving disabled
[JENKINS] Archiving disabled
[JENKINS] Archiving disabled
[JENKINS] Archiving disabled
[JENKINS] Archiving disabled
[JENKINS] Archiving disabled
[JENKINS] Archiving disabled
[JENKINS] Archiving disabled
[JENKINS] Archiving disabled
[JENKINS] Archiving disabled
[JENKINS] Archiving disabled
[JENKINS] Archiving disabled
[JENKINS] Archiving disabled
[JENKINS] Archiving disabled
[JENKINS] Archiving disabled
[JENKINS] Archiving disabled
[JENKINS] Archiving disabled
[JENKINS] Archiving disabled
[JENKINS] Archiving disabled
[JENKINS] Archiving disabled
[JENKINS] Archiving disabled
[JENKINS] Archiving disabled
[JENKINS] Archiving disabled
[JENKINS] Archiving disabled
[JENKINS] Archiving disabled
[JENKINS] Archiving disabled
[JENKINS] Archiving disabled
[JENKINS] Archiving disabled
[JENKINS] Archiving disabled
[JENKINS] Archiving disabled
[JENKINS] Archiving disabled
[JENKINS] Archiving disabled
[JENKINS] Archiving disabled
[JENKINS] Archiving disabled
[JENKINS] Archiving disabled
[JENKINS] Archiving disabled
[JENKINS] Archiving disabled
[JENKINS] Archiving disabled
[JENKINS] Archiving disabled
[JENKINS] Archiving disabled
[JENKINS] Archiving disabled
[JENKINS] Archiving disabled
[JENKINS] Archiving disabled
[JENKINS] Archiving disabled
[JENKINS] Archiving disabled
[JENKINS] Archiving disabled
[JENKINS] Archiving disabled
[JENKINS] Archiving disabled
[JENKINS] Archiving disabled
2017-06-21T06:34:16.705 [INFO] ------------------------------------------------------------------------
2017-06-21T06:34:16.705 [INFO] Reactor Summary:
2017-06-21T06:34:16.705 [INFO] 
2017-06-21T06:34:16.706 [INFO] Apache Beam :: Parent .............................. SUCCESS
[ 25.756 s]
2017-06-21T06:34:16.706 [INFO] Apache Beam :: SDKs :: Java :: Build Tools ......... SUCCESS
[ 18.657 s]
2017-06-21T06:34:16.706 [INFO] Apache Beam :: SDKs ................................ SUCCESS
[  8.728 s]
2017-06-21T06:34:16.706 [INFO] Apache Beam :: SDKs :: Common ...................... SUCCESS
[  5.539 s]
2017-06-21T06:34:16.706 [INFO] Apache Beam :: SDKs :: Common :: Runner API ........ SUCCESS
[ 23.187 s]
2017-06-21T06:34:16.706 [INFO] Apache Beam :: SDKs :: Common :: Fn API ............ SUCCESS
[ 23.223 s]
2017-06-21T06:34:16.706 [INFO] Apache Beam :: SDKs :: Java ........................ SUCCESS
[  5.969 s]
2017-06-21T06:34:16.706 [INFO] Apache Beam :: SDKs :: Java :: Core ................ SUCCESS
[04:13 min]
2017-06-21T06:34:16.706 [INFO] Apache Beam :: Runners ............................. SUCCESS
[  5.393 s]
2017-06-21T06:34:16.706 [INFO] Apache Beam :: Runners :: Core Construction Java ... SUCCESS
[ 48.687 s]
2017-06-21T06:34:16.706 [INFO] Apache Beam :: Runners :: Core Java ................ SUCCESS
[01:10 min]
2017-06-21T06:34:16.706 [INFO] Apache Beam :: Runners :: Direct Java .............. SUCCESS
[03:41 min]
2017-06-21T06:34:16.706 [INFO] Apache Beam :: SDKs :: Java :: IO .................. SUCCESS
[  5.577 s]
2017-06-21T06:34:16.706 [INFO] Apache Beam :: SDKs :: Java :: IO :: Common ........ SUCCESS
[ 10.291 s]
2017-06-21T06:34:16.706 [INFO] Apache Beam :: SDKs :: Java :: IO :: Cassandra ..... SUCCESS
[ 37.560 s]
2017-06-21T06:34:16.706 [INFO] Apache Beam :: SDKs :: Java :: IO :: Elasticsearch . SUCCESS
[ 53.042 s]
2017-06-21T06:34:16.707 [INFO] Apache Beam :: SDKs :: Java :: Extensions .......... SUCCESS
[  5.335 s]
2017-06-21T06:34:16.707 [INFO] Apache Beam :: SDKs :: Java :: Extensions :: Google Cloud Platform
Core SUCCESS [ 54.601 s]
2017-06-21T06:34:16.707 [INFO] Apache Beam :: SDKs :: Java :: Extensions :: Protobuf SUCCESS
[ 29.446 s]
2017-06-21T06:34:16.707 [INFO] Apache Beam :: SDKs :: Java :: IO :: Google Cloud Platform
SUCCESS [01:33 min]
2017-06-21T06:34:16.707 [INFO] Apache Beam :: SDKs :: Java :: IO :: Hadoop Common . SUCCESS
[ 29.722 s]
2017-06-21T06:34:16.707 [INFO] Apache Beam :: SDKs :: Java :: IO :: Hadoop File System SUCCESS
[ 40.757 s]
2017-06-21T06:34:16.707 [INFO] Apache Beam :: SDKs :: Java :: IO :: Hadoop ........ SUCCESS
[  8.565 s]
2017-06-21T06:34:16.707 [INFO] Apache Beam :: SDKs :: Java :: IO :: Hadoop :: input-format
SUCCESS [ 32.297 s]
2017-06-21T06:34:16.707 [INFO] Apache Beam :: SDKs :: Java :: IO :: Hadoop :: jdk1.8-tests
SUCCESS [01:49 min]
2017-06-21T06:34:16.707 [INFO] Apache Beam :: SDKs :: Java :: IO :: HBase ......... SUCCESS
[ 45.245 s]
2017-06-21T06:34:16.707 [INFO] Apache Beam :: SDKs :: Java :: IO :: HCatalog ...... SUCCESS
[01:06 min]
2017-06-21T06:34:16.707 [INFO] Apache Beam :: SDKs :: Java :: IO :: JDBC .......... SUCCESS
[ 35.992 s]
2017-06-21T06:34:16.707 [INFO] Apache Beam :: SDKs :: Java :: IO :: JMS ........... SUCCESS
[ 32.720 s]
2017-06-21T06:34:16.707 [INFO] Apache Beam :: SDKs :: Java :: IO :: Kafka ......... SUCCESS
[ 42.254 s]
2017-06-21T06:34:16.707 [INFO] Apache Beam :: SDKs :: Java :: IO :: Kinesis ....... SUCCESS
[ 35.640 s]
2017-06-21T06:34:16.707 [INFO] Apache Beam :: SDKs :: Java :: IO :: MongoDB ....... SUCCESS
[ 50.539 s]
2017-06-21T06:34:16.707 [INFO] Apache Beam :: SDKs :: Java :: IO :: MQTT .......... SUCCESS
[ 32.261 s]
2017-06-21T06:34:16.707 [INFO] Apache Beam :: SDKs :: Java :: IO :: XML ........... SUCCESS
[ 29.269 s]
2017-06-21T06:34:16.707 [INFO] Apache Beam :: SDKs :: Java :: Maven Archetypes .... SUCCESS
[  4.473 s]
2017-06-21T06:34:16.707 [INFO] Apache Beam :: SDKs :: Java :: Maven Archetypes :: Starter
SUCCESS [ 27.016 s]
2017-06-21T06:34:16.707 [INFO] Apache Beam :: SDKs :: Java :: Extensions :: Jackson SUCCESS
[ 26.564 s]
2017-06-21T06:34:16.708 [INFO] Apache Beam :: SDKs :: Java :: Extensions :: Join library SUCCESS
[ 29.329 s]
2017-06-21T06:34:16.708 [INFO] Apache Beam :: SDKs :: Java :: Extensions :: Sorter  SUCCESS
[ 35.650 s]
2017-06-21T06:34:16.708 [INFO] Apache Beam :: Runners :: Google Cloud Dataflow .... SUCCESS
[ 51.316 s]
2017-06-21T06:34:16.708 [INFO] Apache Beam :: SDKs :: Java :: Harness ............. SUCCESS
[ 56.573 s]
2017-06-21T06:34:16.708 [INFO] Apache Beam :: SDKs :: Java :: Java 8 Tests ........ SUCCESS
[ 23.461 s]
2017-06-21T06:34:16.708 [INFO] Apache Beam :: SDKs :: Python ...................... FAILURE
[  4.476 s]
2017-06-21T06:34:16.708 [INFO] Apache Beam :: Runners :: Flink .................... SKIPPED
2017-06-21T06:34:16.708 [INFO] Apache Beam :: Runners :: Spark .................... SKIPPED
2017-06-21T06:34:16.708 [INFO] Apache Beam :: Runners :: Apex ..................... SKIPPED
2017-06-21T06:34:16.708 [INFO] Apache Beam :: Examples ............................ SKIPPED
2017-06-21T06:34:16.708 [INFO] Apache Beam :: Examples :: Java .................... SKIPPED
2017-06-21T06:34:16.708 [INFO] Apache Beam :: Examples :: Java 8 .................. SKIPPED
2017-06-21T06:34:16.708 [INFO] Apache Beam :: SDKs :: Java :: Aggregated Javadoc .. SKIPPED
2017-06-21T06:34:16.708 [INFO] ------------------------------------------------------------------------
2017-06-21T06:34:16.708 [INFO] BUILD FAILURE
2017-06-21T06:34:16.708 [INFO] ------------------------------------------------------------------------
2017-06-21T06:34:16.708 [INFO] Total time: 33:37 min
2017-06-21T06:34:16.709 [INFO] Finished at: 2017-06-21T06:34:16+00:00
2017-06-21T06:34:18.106 [INFO] Final Memory: 323M/2904M
2017-06-21T06:34:18.107 [INFO] ------------------------------------------------------------------------
Waiting for Jenkins to finish collecting data
2017-06-21T06:34:19.033 [ERROR] Failed to execute goal org.codehaus.gmaven:groovy-maven-plugin:2.0:execute
(find-supported-python-for-clean) on project beam-sdks-python: Unable to find Python 2.7 in
path -> [Help 1]
org.apache.maven.lifecycle.LifecycleExecutionException: Failed to execute goal org.codehaus.gmaven:groovy-maven-plugin:2.0:execute
(find-supported-python-for-clean) on project beam-sdks-python: Unable to find Python 2.7 in
path
	at org.apache.maven.lifecycle.internal.MojoExecutor.execute(MojoExecutor.java:212)
	at org.apache.maven.lifecycle.internal.MojoExecutor.execute(MojoExecutor.java:153)
	at org.apache.maven.lifecycle.internal.MojoExecutor.execute(MojoExecutor.java:145)
	at org.apache.maven.lifecycle.internal.LifecycleModuleBuilder.buildProject(LifecycleModuleBuilder.java:116)
	at org.apache.maven.lifecycle.internal.LifecycleModuleBuilder.buildProject(LifecycleModuleBuilder.java:80)
	at org.apache.maven.lifecycle.internal.builder.singlethreaded.SingleThreadedBuilder.build(SingleThreadedBuilder.java:51)
	at org.apache.maven.lifecycle.internal.LifecycleStarter.execute(LifecycleStarter.java:128)
	at org.apache.maven.DefaultMaven.doExecute(DefaultMaven.java:307)
	at org.apache.maven.DefaultMaven.doExecute(DefaultMaven.java:193)
	at org.apache.maven.DefaultMaven.execute(DefaultMaven.java:106)
	at org.jvnet.hudson.maven3.launcher.Maven33Launcher.main(Maven33Launcher.java:129)
	at sun.reflect.NativeMethodAccessorImpl.invoke0(Native Method)
	at sun.reflect.NativeMethodAccessorImpl.invoke(NativeMethodAccessorImpl.java:62)
	at sun.reflect.DelegatingMethodAccessorImpl.invoke(DelegatingMethodAccessorImpl.java:43)
	at java.lang.reflect.Method.invoke(Method.java:498)
	at org.codehaus.plexus.classworlds.launcher.Launcher.launchStandard(Launcher.java:330)
	at org.codehaus.plexus.classworlds.launcher.Launcher.launch(Launcher.java:238)
	at jenkins.maven3.agent.Maven33Main.launch(Maven33Main.java:176)
	at sun.reflect.NativeMethodAccessorImpl.invoke0(Native Method)
	at sun.reflect.NativeMethodAccessorImpl.invoke(NativeMethodAccessorImpl.java:62)
	at sun.reflect.DelegatingMethodAccessorImpl.invoke(DelegatingMethodAccessorImpl.java:43)
	at java.lang.reflect.Method.invoke(Method.java:498)
	at hudson.maven.Maven3Builder.call(Maven3Builder.java:139)
	at hudson.maven.Maven3Builder.call(Maven3Builder.java:70)
	at hudson.remoting.UserRequest.perform(UserRequest.java:120)
	at hudson.remoting.UserRequest.perform(UserRequest.java:48)
	at hudson.remoting.Request$2.run(Request.java:326)
	at hudson.remoting.InterceptingExecutorService$1.call(InterceptingExecutorService.java:68)
	at java.util.concurrent.FutureTask.run(FutureTask.java:266)
	at java.util.concurrent.ThreadPoolExecutor.runWorker(ThreadPoolExecutor.java:1142)
	at java.util.concurrent.ThreadPoolExecutor$Worker.run(ThreadPoolExecutor.java:617)
	at java.lang.Thread.run(Thread.java:745)
Caused by: org.apache.maven.plugin.MojoFailureException: Unable to find Python 2.7 in path
	at sun.reflect.NativeConstructorAccessorImpl.newInstance0(Native Method)
	at sun.reflect.NativeConstructorAccessorImpl.newInstance(NativeConstructorAccessorImpl.java:62)
	at sun.reflect.DelegatingConstructorAccessorImpl.newInstance(DelegatingConstructorAccessorImpl.java:45)
	at java.lang.reflect.Constructor.newInstance(Constructor.java:423)
	at org.codehaus.groovy.reflection.CachedConstructor.invoke(CachedConstructor.java:77)
	at org.codehaus.groovy.runtime.callsite.ConstructorSite$ConstructorSiteNoUnwrapNoCoerce.callConstructor(ConstructorSite.java:102)
	at org.codehaus.groovy.runtime.callsite.CallSiteArray.defaultCallConstructor(CallSiteArray.java:57)
	at org.codehaus.groovy.runtime.callsite.AbstractCallSite.callConstructor(AbstractCallSite.java:182)
	at org.codehaus.groovy.runtime.callsite.AbstractCallSite.callConstructor(AbstractCallSite.java:190)
	at findSupportedPython.run(findSupportedPython.groovy:70)
	at groovy.lang.GroovyShell.evaluate(GroovyShell.java:518)
	at org.codehaus.gmaven.adapter.impl.ScriptExecutorImpl.execute(ScriptExecutorImpl.java:80)
	at org.codehaus.gmaven.plugin.ExecuteMojo$1.run(ExecuteMojo.java:100)
	at org.codehaus.gmaven.plugin.util.SystemNoExitGuard.run(SystemNoExitGuard.java:45)
	at org.codehaus.gmaven.plugin.ExecuteMojo.run(ExecuteMojo.java:96)
	at org.codehaus.gmaven.plugin.MojoSupport.execute(MojoSupport.java:45)
	at org.apache.maven.plugin.DefaultBuildPluginManager.executeMojo(DefaultBuildPluginManager.java:134)
	at org.apache.maven.lifecycle.internal.MojoExecutor.execute(MojoExecutor.java:208)
	... 31 more
2017-06-21T06:34:19.036 [ERROR] 
2017-06-21T06:34:19.036 [ERROR] Re-run Maven using the -X switch to enable full debug logging.
2017-06-21T06:34:19.036 [ERROR] 
2017-06-21T06:34:19.036 [ERROR] For more information about the errors and possible solutions,
please read the following articles:
2017-06-21T06:34:19.036 [ERROR] [Help 1] http://cwiki.apache.org/confluence/display/MAVEN/MojoFailureException
2017-06-21T06:34:19.037 [ERROR] 
2017-06-21T06:34:19.037 [ERROR] After correcting the problems, you can resume the build with
the command
2017-06-21T06:34:19.037 [ERROR]   mvn <goals> -rf :beam-sdks-python
channel stopped
Not sending mail to unregistered user aljoscha.krettek@gmail.com
Not sending mail to unregistered user github@nakomis.com
Not sending mail to unregistered user hepei.hp@alibaba-inc.com
Not sending mail to unregistered user sourabhbajaj@google.com
Not sending mail to unregistered user klk@google.com
Not sending mail to unregistered user ccy@google.com
Not sending mail to unregistered user kirpichov@google.com
Not sending mail to unregistered user mingmxu@ebay.com

Mime
View raw message