beam-commits mailing list archives

Site index · List index
Message view « Date » · « Thread »
Top « Date » · « Thread »
From Apache Jenkins Server <jenk...@builds.apache.org>
Subject Build failed in Jenkins: beam_PostCommit_Java_MavenInstall_Windows #104
Date Wed, 07 Jun 2017 12:40:47 GMT
See <https://builds.apache.org/job/beam_PostCommit_Java_MavenInstall_Windows/104/display/redirect?page=changes>

Changes:

[jbonofre] [BEAM-245] Add CassandraIO

------------------------------------------
[...truncated 2.55 MB...]
2017-06-07T12:37:26.084 [INFO] Downloading: https://repo.maven.apache.org/maven2/org/sonatype/gossip/gossip-slf4j/1.8/gossip-slf4j-1.8.pom
2017-06-07T12:37:26.117 [INFO] Downloaded: https://repo.maven.apache.org/maven2/org/sonatype/gossip/gossip-slf4j/1.8/gossip-slf4j-1.8.pom
(2 KB at 43.9 KB/sec)
2017-06-07T12:37:26.121 [INFO] Downloading: https://repo.maven.apache.org/maven2/org/sonatype/gossip/gossip/1.8/gossip-1.8.pom
2017-06-07T12:37:26.153 [INFO] Downloaded: https://repo.maven.apache.org/maven2/org/sonatype/gossip/gossip/1.8/gossip-1.8.pom
(12 KB at 351.7 KB/sec)
2017-06-07T12:37:26.157 [INFO] Downloading: https://repo.maven.apache.org/maven2/org/sonatype/forge/forge-parent/9/forge-parent-9.pom
2017-06-07T12:37:26.190 [INFO] Downloaded: https://repo.maven.apache.org/maven2/org/sonatype/forge/forge-parent/9/forge-parent-9.pom
(13 KB at 388.9 KB/sec)
2017-06-07T12:37:26.194 [INFO] Downloading: https://repo.maven.apache.org/maven2/org/sonatype/gossip/gossip-core/1.8/gossip-core-1.8.pom
2017-06-07T12:37:26.225 [INFO] Downloaded: https://repo.maven.apache.org/maven2/org/sonatype/gossip/gossip-core/1.8/gossip-core-1.8.pom
(3 KB at 70.1 KB/sec)
2017-06-07T12:37:26.230 [INFO] Downloading: https://repo.maven.apache.org/maven2/org/sonatype/gossip/gossip-bootstrap/1.8/gossip-bootstrap-1.8.pom
2017-06-07T12:37:26.259 [INFO] Downloaded: https://repo.maven.apache.org/maven2/org/sonatype/gossip/gossip-bootstrap/1.8/gossip-bootstrap-1.8.pom
(2 KB at 54.2 KB/sec)
2017-06-07T12:37:26.265 [INFO] Downloading: https://repo.maven.apache.org/maven2/com/google/guava/guava/14.0.1/guava-14.0.1.pom
2017-06-07T12:37:26.296 [INFO] Downloaded: https://repo.maven.apache.org/maven2/com/google/guava/guava/14.0.1/guava-14.0.1.pom
(6 KB at 175.0 KB/sec)
2017-06-07T12:37:26.300 [INFO] Downloading: https://repo.maven.apache.org/maven2/com/google/guava/guava-parent/14.0.1/guava-parent-14.0.1.pom
2017-06-07T12:37:26.330 [INFO] Downloaded: https://repo.maven.apache.org/maven2/com/google/guava/guava-parent/14.0.1/guava-parent-14.0.1.pom
(3 KB at 83.2 KB/sec)
2017-06-07T12:37:26.336 [INFO] Downloading: https://repo.maven.apache.org/maven2/org/codehaus/plexus/plexus-classworlds/2.4.2/plexus-classworlds-2.4.2.pom
2017-06-07T12:37:26.364 [INFO] Downloaded: https://repo.maven.apache.org/maven2/org/codehaus/plexus/plexus-classworlds/2.4.2/plexus-classworlds-2.4.2.pom
(4 KB at 122.4 KB/sec)
2017-06-07T12:37:26.370 [INFO] Downloading: https://repo.maven.apache.org/maven2/org/codehaus/plexus/plexus-interpolation/1.16/plexus-interpolation-1.16.pom
2017-06-07T12:37:26.396 [INFO] Downloaded: https://repo.maven.apache.org/maven2/org/codehaus/plexus/plexus-interpolation/1.16/plexus-interpolation-1.16.pom
(2 KB at 38.6 KB/sec)
2017-06-07T12:37:26.402 [INFO] Downloading: https://repo.maven.apache.org/maven2/org/eclipse/aether/aether-api/0.9.0.M2/aether-api-0.9.0.M2.pom
2017-06-07T12:37:26.430 [INFO] Downloaded: https://repo.maven.apache.org/maven2/org/eclipse/aether/aether-api/0.9.0.M2/aether-api-0.9.0.M2.pom
(2 KB at 60.6 KB/sec)
2017-06-07T12:37:26.435 [INFO] Downloading: https://repo.maven.apache.org/maven2/org/codehaus/gmaven/gmaven-adapter-api/2.0/gmaven-adapter-api-2.0.pom
2017-06-07T12:37:26.465 [INFO] Downloaded: https://repo.maven.apache.org/maven2/org/codehaus/gmaven/gmaven-adapter-api/2.0/gmaven-adapter-api-2.0.pom
(2 KB at 58.8 KB/sec)
2017-06-07T12:37:26.470 [INFO] Downloading: https://repo.maven.apache.org/maven2/org/codehaus/gmaven/gmaven-adapter-impl/2.0/gmaven-adapter-impl-2.0.pom
2017-06-07T12:37:26.498 [INFO] Downloaded: https://repo.maven.apache.org/maven2/org/codehaus/gmaven/gmaven-adapter-impl/2.0/gmaven-adapter-impl-2.0.pom
(3 KB at 94.8 KB/sec)
2017-06-07T12:37:26.504 [INFO] Downloading: https://repo.maven.apache.org/maven2/org/codehaus/groovy/groovy-all/2.1.5/groovy-all-2.1.5.pom
2017-06-07T12:37:26.533 [INFO] Downloaded: https://repo.maven.apache.org/maven2/org/codehaus/groovy/groovy-all/2.1.5/groovy-all-2.1.5.pom
(18 KB at 607.5 KB/sec)
2017-06-07T12:37:26.538 [INFO] Downloading: https://repo.maven.apache.org/maven2/org/apache/ant/ant/1.8.4/ant-1.8.4.pom
2017-06-07T12:37:26.569 [INFO] Downloaded: https://repo.maven.apache.org/maven2/org/apache/ant/ant/1.8.4/ant-1.8.4.pom
(10 KB at 304.1 KB/sec)
2017-06-07T12:37:26.573 [INFO] Downloading: https://repo.maven.apache.org/maven2/org/apache/ant/ant-parent/1.8.4/ant-parent-1.8.4.pom
2017-06-07T12:37:26.603 [INFO] Downloaded: https://repo.maven.apache.org/maven2/org/apache/ant/ant-parent/1.8.4/ant-parent-1.8.4.pom
(5 KB at 148.5 KB/sec)
2017-06-07T12:37:26.607 [INFO] Downloading: https://repo.maven.apache.org/maven2/org/apache/ant/ant-launcher/1.8.4/ant-launcher-1.8.4.pom
2017-06-07T12:37:26.637 [INFO] Downloaded: https://repo.maven.apache.org/maven2/org/apache/ant/ant-launcher/1.8.4/ant-launcher-1.8.4.pom
(3 KB at 76.9 KB/sec)
2017-06-07T12:37:26.640 [INFO] Downloading: https://repo.maven.apache.org/maven2/org/fusesource/jansi/jansi/1.11/jansi-1.11.pom
2017-06-07T12:37:26.676 [INFO] Downloaded: https://repo.maven.apache.org/maven2/org/fusesource/jansi/jansi/1.11/jansi-1.11.pom
(4 KB at 97.7 KB/sec)
2017-06-07T12:37:26.680 [INFO] Downloading: https://repo.maven.apache.org/maven2/org/fusesource/jansi/jansi-project/1.11/jansi-project-1.11.pom
2017-06-07T12:37:26.714 [INFO] Downloaded: https://repo.maven.apache.org/maven2/org/fusesource/jansi/jansi-project/1.11/jansi-project-1.11.pom
(12 KB at 328.8 KB/sec)
2017-06-07T12:37:26.719 [INFO] Downloading: https://repo.maven.apache.org/maven2/org/fusesource/fusesource-pom/1.8/fusesource-pom-1.8.pom
2017-06-07T12:37:26.750 [INFO] Downloaded: https://repo.maven.apache.org/maven2/org/fusesource/fusesource-pom/1.8/fusesource-pom-1.8.pom
(15 KB at 461.7 KB/sec)
2017-06-07T12:37:26.765 [INFO] Downloading: https://repo.maven.apache.org/maven2/org/sonatype/gossip/gossip-slf4j/1.8/gossip-slf4j-1.8.jar
2017-06-07T12:37:26.765 [INFO] Downloading: https://repo.maven.apache.org/maven2/org/sonatype/gossip/gossip-core/1.8/gossip-core-1.8.jar
2017-06-07T12:37:26.766 [INFO] Downloading: https://repo.maven.apache.org/maven2/org/sonatype/gossip/gossip-bootstrap/1.8/gossip-bootstrap-1.8.jar
2017-06-07T12:37:26.766 [INFO] Downloading: https://repo.maven.apache.org/maven2/org/codehaus/plexus/plexus-classworlds/2.4.2/plexus-classworlds-2.4.2.jar
2017-06-07T12:37:26.766 [INFO] Downloading: https://repo.maven.apache.org/maven2/com/google/guava/guava/14.0.1/guava-14.0.1.jar
2017-06-07T12:37:26.797 [INFO] Downloaded: https://repo.maven.apache.org/maven2/org/sonatype/gossip/gossip-bootstrap/1.8/gossip-bootstrap-1.8.jar
(20 KB at 584.7 KB/sec)
2017-06-07T12:37:26.797 [INFO] Downloading: https://repo.maven.apache.org/maven2/org/codehaus/plexus/plexus-interpolation/1.16/plexus-interpolation-1.16.jar
2017-06-07T12:37:26.797 [INFO] Downloaded: https://repo.maven.apache.org/maven2/org/sonatype/gossip/gossip-slf4j/1.8/gossip-slf4j-1.8.jar
(5 KB at 125.1 KB/sec)
2017-06-07T12:37:26.799 [INFO] Downloading: https://repo.maven.apache.org/maven2/org/eclipse/aether/aether-api/0.9.0.M2/aether-api-0.9.0.M2.jar
2017-06-07T12:37:26.804 [INFO] Downloaded: https://repo.maven.apache.org/maven2/org/codehaus/plexus/plexus-classworlds/2.4.2/plexus-classworlds-2.4.2.jar
(46 KB at 1176.1 KB/sec)
2017-06-07T12:37:26.804 [INFO] Downloading: https://repo.maven.apache.org/maven2/org/codehaus/gmaven/gmaven-adapter-api/2.0/gmaven-adapter-api-2.0.jar
2017-06-07T12:37:26.806 [INFO] Downloaded: https://repo.maven.apache.org/maven2/org/sonatype/gossip/gossip-core/1.8/gossip-core-1.8.jar
(57 KB at 1344.3 KB/sec)
2017-06-07T12:37:26.807 [INFO] Downloading: https://repo.maven.apache.org/maven2/org/codehaus/gmaven/gmaven-adapter-impl/2.0/gmaven-adapter-impl-2.0.jar
2017-06-07T12:37:26.831 [INFO] Downloaded: https://repo.maven.apache.org/maven2/org/codehaus/plexus/plexus-interpolation/1.16/plexus-interpolation-1.16.jar
(60 KB at 921.1 KB/sec)
2017-06-07T12:37:26.831 [INFO] Downloading: https://repo.maven.apache.org/maven2/org/codehaus/groovy/groovy-all/2.1.5/groovy-all-2.1.5.jar
2017-06-07T12:37:26.837 [INFO] Downloaded: https://repo.maven.apache.org/maven2/org/codehaus/gmaven/gmaven-adapter-api/2.0/gmaven-adapter-api-2.0.jar
(7 KB at 97.4 KB/sec)
2017-06-07T12:37:26.837 [INFO] Downloading: https://repo.maven.apache.org/maven2/org/apache/ant/ant/1.8.4/ant-1.8.4.jar
2017-06-07T12:37:26.842 [INFO] Downloaded: https://repo.maven.apache.org/maven2/org/eclipse/aether/aether-api/0.9.0.M2/aether-api-0.9.0.M2.jar
(131 KB at 1721.3 KB/sec)
2017-06-07T12:37:26.842 [INFO] Downloading: https://repo.maven.apache.org/maven2/org/apache/ant/ant-launcher/1.8.4/ant-launcher-1.8.4.jar
2017-06-07T12:37:26.853 [INFO] Downloaded: https://repo.maven.apache.org/maven2/org/codehaus/gmaven/gmaven-adapter-impl/2.0/gmaven-adapter-impl-2.0.jar
(16 KB at 181.5 KB/sec)
2017-06-07T12:37:26.853 [INFO] Downloading: https://repo.maven.apache.org/maven2/org/fusesource/jansi/jansi/1.11/jansi-1.11.jar
2017-06-07T12:37:26.887 [INFO] Downloaded: https://repo.maven.apache.org/maven2/org/apache/ant/ant-launcher/1.8.4/ant-launcher-1.8.4.jar
(18 KB at 148.7 KB/sec)
2017-06-07T12:37:26.899 [INFO] Downloaded: https://repo.maven.apache.org/maven2/org/fusesource/jansi/jansi/1.11/jansi-1.11.jar
(112 KB at 840.1 KB/sec)
2017-06-07T12:37:27.036 [INFO] Downloaded: https://repo.maven.apache.org/maven2/com/google/guava/guava/14.0.1/guava-14.0.1.jar
(2138 KB at 7888.6 KB/sec)
2017-06-07T12:37:27.074 [INFO] Downloaded: https://repo.maven.apache.org/maven2/org/apache/ant/ant/1.8.4/ant-1.8.4.jar
(1897 KB at 6156.6 KB/sec)
2017-06-07T12:37:27.436 [INFO] Downloaded: https://repo.maven.apache.org/maven2/org/codehaus/groovy/groovy-all/2.1.5/groovy-all-2.1.5.jar
(6219 KB at 9281.0 KB/sec)
[JENKINS] Archiving disabled
2017-06-07T12:37:34.147 [INFO]                                                           
             
2017-06-07T12:37:34.147 [INFO] ------------------------------------------------------------------------
2017-06-07T12:37:34.147 [INFO] Skipping Apache Beam :: Parent
2017-06-07T12:37:34.147 [INFO] This project has been banned from the build due to previous
failures.
2017-06-07T12:37:34.147 [INFO] ------------------------------------------------------------------------
[JENKINS] Archiving disabled
[JENKINS] Archiving disabled
[JENKINS] Archiving disabled
[JENKINS] Archiving disabled
[JENKINS] Archiving disabled
[JENKINS] Archiving disabled
[JENKINS] Archiving disabled
[JENKINS] Archiving disabled
[JENKINS] Archiving disabled
[JENKINS] Archiving disabled
[JENKINS] Archiving disabled
[JENKINS] Archiving disabled
[JENKINS] Archiving disabled
[JENKINS] Archiving disabled
[JENKINS] Archiving disabled
[JENKINS] Archiving disabled
[JENKINS] Archiving disabled
[JENKINS] Archiving disabled
[JENKINS] Archiving disabled
[JENKINS] Archiving disabled
[JENKINS] Archiving disabled
[JENKINS] Archiving disabled
[JENKINS] Archiving disabled
[JENKINS] Archiving disabled
[JENKINS] Archiving disabled
[JENKINS] Archiving disabled
[JENKINS] Archiving disabled
[JENKINS] Archiving disabled
[JENKINS] Archiving disabled
[JENKINS] Archiving disabled
[JENKINS] Archiving disabled
[JENKINS] Archiving disabled
[JENKINS] Archiving disabled
[JENKINS] Archiving disabled
[JENKINS] Archiving disabled
[JENKINS] Archiving disabled
[JENKINS] Archiving disabled
[JENKINS] Archiving disabled
[JENKINS] Archiving disabled
[JENKINS] Archiving disabled
[JENKINS] Archiving disabled
[JENKINS] Archiving disabled
[JENKINS] Archiving disabled
[JENKINS] Archiving disabled
[JENKINS] Archiving disabled
[JENKINS] Archiving disabled
[JENKINS] Archiving disabled
[JENKINS] Archiving disabled
[JENKINS] Archiving disabled
2017-06-07T12:38:42.719 [INFO] ------------------------------------------------------------------------
2017-06-07T12:38:42.720 [INFO] Reactor Summary:
2017-06-07T12:38:42.720 [INFO] 
2017-06-07T12:38:42.720 [INFO] Apache Beam :: Parent .............................. SUCCESS
[ 34.196 s]
2017-06-07T12:38:42.720 [INFO] Apache Beam :: SDKs :: Java :: Build Tools ......... SUCCESS
[ 19.517 s]
2017-06-07T12:38:42.720 [INFO] Apache Beam :: SDKs ................................ SUCCESS
[ 12.983 s]
2017-06-07T12:38:42.720 [INFO] Apache Beam :: SDKs :: Common ...................... SUCCESS
[  5.746 s]
2017-06-07T12:38:42.720 [INFO] Apache Beam :: SDKs :: Common :: Runner API ........ SUCCESS
[ 25.843 s]
2017-06-07T12:38:42.721 [INFO] Apache Beam :: SDKs :: Common :: Fn API ............ SUCCESS
[ 25.051 s]
2017-06-07T12:38:42.721 [INFO] Apache Beam :: SDKs :: Java ........................ SUCCESS
[  5.977 s]
2017-06-07T12:38:42.721 [INFO] Apache Beam :: SDKs :: Java :: Core ................ SUCCESS
[04:25 min]
2017-06-07T12:38:42.721 [INFO] Apache Beam :: SDKs :: Java :: IO .................. SUCCESS
[  8.613 s]
2017-06-07T12:38:42.721 [INFO] Apache Beam :: SDKs :: Java :: IO :: Common ........ SUCCESS
[ 14.757 s]
2017-06-07T12:38:42.721 [INFO] Apache Beam :: Runners ............................. SUCCESS
[  8.353 s]
2017-06-07T12:38:42.721 [INFO] Apache Beam :: Runners :: Core Construction Java ... SUCCESS
[ 57.571 s]
2017-06-07T12:38:42.721 [INFO] Apache Beam :: Runners :: Core Java ................ SUCCESS
[01:18 min]
2017-06-07T12:38:42.721 [INFO] Apache Beam :: Runners :: Direct Java .............. SUCCESS
[03:32 min]
2017-06-07T12:38:42.721 [INFO] Apache Beam :: SDKs :: Java :: IO :: Elasticsearch . SUCCESS
[01:02 min]
2017-06-07T12:38:42.721 [INFO] Apache Beam :: SDKs :: Java :: Extensions .......... SUCCESS
[  7.553 s]
2017-06-07T12:38:42.721 [INFO] Apache Beam :: SDKs :: Java :: Extensions :: Google Cloud Platform
Core SUCCESS [01:04 min]
2017-06-07T12:38:42.721 [INFO] Apache Beam :: SDKs :: Java :: Extensions :: Protobuf SUCCESS
[ 40.084 s]
2017-06-07T12:38:42.721 [INFO] Apache Beam :: SDKs :: Java :: IO :: Google Cloud Platform
SUCCESS [01:42 min]
2017-06-07T12:38:42.721 [INFO] Apache Beam :: SDKs :: Java :: IO :: Hadoop Common . SUCCESS
[ 33.844 s]
2017-06-07T12:38:42.721 [INFO] Apache Beam :: SDKs :: Java :: IO :: Hadoop File System SUCCESS
[ 46.511 s]
2017-06-07T12:38:42.721 [INFO] Apache Beam :: SDKs :: Java :: IO :: Hadoop ........ SUCCESS
[  9.428 s]
2017-06-07T12:38:42.721 [INFO] Apache Beam :: SDKs :: Java :: IO :: Hadoop :: input-format
SUCCESS [ 35.045 s]
2017-06-07T12:38:42.722 [INFO] Apache Beam :: SDKs :: Java :: IO :: Hadoop :: jdk1.8-tests
SUCCESS [01:48 min]
2017-06-07T12:38:42.722 [INFO] Apache Beam :: SDKs :: Java :: IO :: HBase ......... SUCCESS
[ 47.247 s]
2017-06-07T12:38:42.722 [INFO] Apache Beam :: SDKs :: Java :: IO :: JDBC .......... SUCCESS
[ 38.967 s]
2017-06-07T12:38:42.722 [INFO] Apache Beam :: SDKs :: Java :: IO :: JMS ........... SUCCESS
[ 33.295 s]
2017-06-07T12:38:42.722 [INFO] Apache Beam :: SDKs :: Java :: IO :: Kafka ......... SUCCESS
[ 43.760 s]
2017-06-07T12:38:42.722 [INFO] Apache Beam :: SDKs :: Java :: IO :: Kinesis ....... SUCCESS
[ 39.787 s]
2017-06-07T12:38:42.722 [INFO] Apache Beam :: SDKs :: Java :: IO :: MongoDB ....... SUCCESS
[ 52.394 s]
2017-06-07T12:38:42.722 [INFO] Apache Beam :: SDKs :: Java :: IO :: MQTT .......... SUCCESS
[ 32.768 s]
2017-06-07T12:38:42.722 [INFO] Apache Beam :: SDKs :: Java :: IO :: XML ........... SUCCESS
[ 31.634 s]
2017-06-07T12:38:42.722 [INFO] Apache Beam :: SDKs :: Java :: IO :: Cassandra ..... SUCCESS
[ 38.382 s]
2017-06-07T12:38:42.722 [INFO] Apache Beam :: SDKs :: Java :: Maven Archetypes .... SUCCESS
[  5.296 s]
2017-06-07T12:38:42.722 [INFO] Apache Beam :: SDKs :: Java :: Maven Archetypes :: Starter
SUCCESS [ 27.261 s]
2017-06-07T12:38:42.723 [INFO] Apache Beam :: SDKs :: Java :: Extensions :: Jackson SUCCESS
[ 29.170 s]
2017-06-07T12:38:42.723 [INFO] Apache Beam :: SDKs :: Java :: Extensions :: Join library SUCCESS
[ 31.859 s]
2017-06-07T12:38:42.723 [INFO] Apache Beam :: SDKs :: Java :: Extensions :: Sorter  SUCCESS
[ 41.381 s]
2017-06-07T12:38:42.723 [INFO] Apache Beam :: Runners :: Google Cloud Dataflow .... SUCCESS
[ 55.157 s]
2017-06-07T12:38:42.723 [INFO] Apache Beam :: SDKs :: Java :: Harness ............. SUCCESS
[ 59.455 s]
2017-06-07T12:38:42.723 [INFO] Apache Beam :: SDKs :: Java :: Java 8 Tests ........ SUCCESS
[ 25.898 s]
2017-06-07T12:38:42.723 [INFO] Apache Beam :: SDKs :: Python ...................... FAILURE
[  7.093 s]
2017-06-07T12:38:42.723 [INFO] Apache Beam :: Runners :: Flink .................... SKIPPED
2017-06-07T12:38:42.723 [INFO] Apache Beam :: Runners :: Spark .................... SKIPPED
2017-06-07T12:38:42.723 [INFO] Apache Beam :: Runners :: Apex ..................... SKIPPED
2017-06-07T12:38:42.723 [INFO] Apache Beam :: Examples ............................ SKIPPED
2017-06-07T12:38:42.723 [INFO] Apache Beam :: Examples :: Java .................... SKIPPED
2017-06-07T12:38:42.723 [INFO] Apache Beam :: Examples :: Java 8 .................. SKIPPED
2017-06-07T12:38:42.723 [INFO] Apache Beam :: SDKs :: Java :: Aggregated Javadoc .. SKIPPED
2017-06-07T12:38:42.723 [INFO] ------------------------------------------------------------------------
2017-06-07T12:38:42.723 [INFO] BUILD FAILURE
2017-06-07T12:38:42.723 [INFO] ------------------------------------------------------------------------
2017-06-07T12:38:42.724 [INFO] Total time: 36:56 min
2017-06-07T12:38:42.724 [INFO] Finished at: 2017-06-07T12:38:42+00:00
2017-06-07T12:38:44.027 [INFO] Final Memory: 295M/3283M
2017-06-07T12:38:44.027 [INFO] ------------------------------------------------------------------------
Waiting for Jenkins to finish collecting data
2017-06-07T12:39:55.340 [ERROR] Failed to execute goal org.codehaus.gmaven:groovy-maven-plugin:2.0:execute
(find-supported-python-for-clean) on project beam-sdks-python: Unable to find Python 2.7 in
path -> [Help 1]
org.apache.maven.lifecycle.LifecycleExecutionException: Failed to execute goal org.codehaus.gmaven:groovy-maven-plugin:2.0:execute
(find-supported-python-for-clean) on project beam-sdks-python: Unable to find Python 2.7 in
path
	at org.apache.maven.lifecycle.internal.MojoExecutor.execute(MojoExecutor.java:212)
	at org.apache.maven.lifecycle.internal.MojoExecutor.execute(MojoExecutor.java:153)
	at org.apache.maven.lifecycle.internal.MojoExecutor.execute(MojoExecutor.java:145)
	at org.apache.maven.lifecycle.internal.LifecycleModuleBuilder.buildProject(LifecycleModuleBuilder.java:116)
	at org.apache.maven.lifecycle.internal.LifecycleModuleBuilder.buildProject(LifecycleModuleBuilder.java:80)
	at org.apache.maven.lifecycle.internal.builder.singlethreaded.SingleThreadedBuilder.build(SingleThreadedBuilder.java:51)
	at org.apache.maven.lifecycle.internal.LifecycleStarter.execute(LifecycleStarter.java:128)
	at org.apache.maven.DefaultMaven.doExecute(DefaultMaven.java:307)
	at org.apache.maven.DefaultMaven.doExecute(DefaultMaven.java:193)
	at org.apache.maven.DefaultMaven.execute(DefaultMaven.java:106)
	at org.jvnet.hudson.maven3.launcher.Maven33Launcher.main(Maven33Launcher.java:129)
	at sun.reflect.NativeMethodAccessorImpl.invoke0(Native Method)
	at sun.reflect.NativeMethodAccessorImpl.invoke(NativeMethodAccessorImpl.java:62)
	at sun.reflect.DelegatingMethodAccessorImpl.invoke(DelegatingMethodAccessorImpl.java:43)
	at java.lang.reflect.Method.invoke(Method.java:498)
	at org.codehaus.plexus.classworlds.launcher.Launcher.launchStandard(Launcher.java:330)
	at org.codehaus.plexus.classworlds.launcher.Launcher.launch(Launcher.java:238)
	at jenkins.maven3.agent.Maven33Main.launch(Maven33Main.java:176)
	at sun.reflect.NativeMethodAccessorImpl.invoke0(Native Method)
	at sun.reflect.NativeMethodAccessorImpl.invoke(NativeMethodAccessorImpl.java:62)
	at sun.reflect.DelegatingMethodAccessorImpl.invoke(DelegatingMethodAccessorImpl.java:43)
	at java.lang.reflect.Method.invoke(Method.java:498)
	at hudson.maven.Maven3Builder.call(Maven3Builder.java:139)
	at hudson.maven.Maven3Builder.call(Maven3Builder.java:70)
	at hudson.remoting.UserRequest.perform(UserRequest.java:120)
	at hudson.remoting.UserRequest.perform(UserRequest.java:48)
	at hudson.remoting.Request$2.run(Request.java:326)
	at hudson.remoting.InterceptingExecutorService$1.call(InterceptingExecutorService.java:68)
	at java.util.concurrent.FutureTask.run(FutureTask.java:266)
	at java.util.concurrent.ThreadPoolExecutor.runWorker(ThreadPoolExecutor.java:1142)
	at java.util.concurrent.ThreadPoolExecutor$Worker.run(ThreadPoolExecutor.java:617)
	at java.lang.Thread.run(Thread.java:745)
Caused by: org.apache.maven.plugin.MojoFailureException: Unable to find Python 2.7 in path
	at sun.reflect.NativeConstructorAccessorImpl.newInstance0(Native Method)
	at sun.reflect.NativeConstructorAccessorImpl.newInstance(NativeConstructorAccessorImpl.java:62)
	at sun.reflect.DelegatingConstructorAccessorImpl.newInstance(DelegatingConstructorAccessorImpl.java:45)
	at java.lang.reflect.Constructor.newInstance(Constructor.java:423)
	at org.codehaus.groovy.reflection.CachedConstructor.invoke(CachedConstructor.java:77)
	at org.codehaus.groovy.runtime.callsite.ConstructorSite$ConstructorSiteNoUnwrapNoCoerce.callConstructor(ConstructorSite.java:102)
	at org.codehaus.groovy.runtime.callsite.CallSiteArray.defaultCallConstructor(CallSiteArray.java:57)
	at org.codehaus.groovy.runtime.callsite.AbstractCallSite.callConstructor(AbstractCallSite.java:182)
	at org.codehaus.groovy.runtime.callsite.AbstractCallSite.callConstructor(AbstractCallSite.java:190)
	at findSupportedPython.run(findSupportedPython.groovy:70)
	at groovy.lang.GroovyShell.evaluate(GroovyShell.java:518)
	at org.codehaus.gmaven.adapter.impl.ScriptExecutorImpl.execute(ScriptExecutorImpl.java:80)
	at org.codehaus.gmaven.plugin.ExecuteMojo$1.run(ExecuteMojo.java:100)
	at org.codehaus.gmaven.plugin.util.SystemNoExitGuard.run(SystemNoExitGuard.java:45)
	at org.codehaus.gmaven.plugin.ExecuteMojo.run(ExecuteMojo.java:96)
	at org.codehaus.gmaven.plugin.MojoSupport.execute(MojoSupport.java:45)
	at org.apache.maven.plugin.DefaultBuildPluginManager.executeMojo(DefaultBuildPluginManager.java:134)
	at org.apache.maven.lifecycle.internal.MojoExecutor.execute(MojoExecutor.java:208)
	... 31 more
2017-06-07T12:39:55.345 [ERROR] 
2017-06-07T12:39:55.345 [ERROR] Re-run Maven using the -X switch to enable full debug logging.
2017-06-07T12:39:55.345 [ERROR] 
2017-06-07T12:39:55.345 [ERROR] For more information about the errors and possible solutions,
please read the following articles:
2017-06-07T12:39:55.345 [ERROR] [Help 1] http://cwiki.apache.org/confluence/display/MAVEN/MojoFailureException
2017-06-07T12:39:55.345 [ERROR] 
2017-06-07T12:39:55.345 [ERROR] After correcting the problems, you can resume the build with
the command
2017-06-07T12:39:55.345 [ERROR]   mvn <goals> -rf :beam-sdks-python
channel stopped
Not sending mail to unregistered user github@nakomis.com
Not sending mail to unregistered user mingmxu@ebay.com
Not sending mail to unregistered user kirpichov@google.com
Not sending mail to unregistered user aljoscha.krettek@gmail.com
Not sending mail to unregistered user klk@google.com
Not sending mail to unregistered user sourabhbajaj@google.com
Not sending mail to unregistered user hepei.hp@alibaba-inc.com

Mime
View raw message