beam-commits mailing list archives

Site index · List index
Message view « Date » · « Thread »
Top « Date » · « Thread »
From Apache Jenkins Server <jenk...@builds.apache.org>
Subject Build failed in Jenkins: beam_PostCommit_Java_ValidatesRunner_Flink #3227
Date Fri, 23 Jun 2017 13:05:19 GMT
See <https://builds.apache.org/job/beam_PostCommit_Java_ValidatesRunner_Flink/3227/display/redirect?page=changes>

Changes:

[jbonofre] [BEAM-2489] Use dynamic ES port in HIFIOWithElasticTest

------------------------------------------
[...truncated 218.57 KB...]
2017-06-23T13:05:04.631 [INFO] Downloading: https://repo.maven.apache.org/maven2/org/apache/maven/plugins/maven-checkstyle-plugin/2.17/maven-checkstyle-plugin-2.17.pom
2017-06-23T13:05:04.665 [INFO] Downloaded: https://repo.maven.apache.org/maven2/org/apache/maven/plugins/maven-checkstyle-plugin/2.17/maven-checkstyle-plugin-2.17.pom
(14 KB at 383.4 KB/sec)
2017-06-23T13:05:04.669 [INFO] Downloading: https://repo.maven.apache.org/maven2/org/apache/maven/plugins/maven-checkstyle-plugin/2.17/maven-checkstyle-plugin-2.17.jar
2017-06-23T13:05:04.711 [INFO] Downloaded: https://repo.maven.apache.org/maven2/org/apache/maven/plugins/maven-checkstyle-plugin/2.17/maven-checkstyle-plugin-2.17.jar
(107 KB at 2524.5 KB/sec)
2017-06-23T13:05:04.720 [INFO] Downloading: https://repo.maven.apache.org/maven2/org/apache/maven/plugins/maven-surefire-plugin/2.20/maven-surefire-plugin-2.20.pom
2017-06-23T13:05:04.749 [INFO] Downloaded: https://repo.maven.apache.org/maven2/org/apache/maven/plugins/maven-surefire-plugin/2.20/maven-surefire-plugin-2.20.pom
(7 KB at 218.1 KB/sec)
2017-06-23T13:05:04.751 [INFO] Downloading: https://repo.maven.apache.org/maven2/org/apache/maven/surefire/surefire/2.20/surefire-2.20.pom
2017-06-23T13:05:04.780 [INFO] Downloaded: https://repo.maven.apache.org/maven2/org/apache/maven/surefire/surefire/2.20/surefire-2.20.pom
(21 KB at 700.5 KB/sec)
2017-06-23T13:05:04.785 [INFO] Downloading: https://repo.maven.apache.org/maven2/org/apache/maven/plugins/maven-surefire-plugin/2.20/maven-surefire-plugin-2.20.jar
2017-06-23T13:05:04.821 [INFO] Downloaded: https://repo.maven.apache.org/maven2/org/apache/maven/plugins/maven-surefire-plugin/2.20/maven-surefire-plugin-2.20.jar
(52 KB at 1443.8 KB/sec)
2017-06-23T13:05:04.828 [INFO] 
2017-06-23T13:05:04.828 [INFO] --- maven-clean-plugin:3.0.0:clean (default-clean) @ beam-sdks-java-build-tools
---
2017-06-23T13:05:04.831 [INFO] Deleting <https://builds.apache.org/job/beam_PostCommit_Java_ValidatesRunner_Flink/ws/sdks/java/build-tools>
(includes = [**/*.pyc, **/*.egg-info/, **/sdks/python/LICENSE, **/sdks/python/NOTICE, **/sdks/python/README.md],
excludes = [])
2017-06-23T13:05:04.882 [INFO] 
2017-06-23T13:05:04.882 [INFO] --- maven-enforcer-plugin:1.4.1:enforce (enforce) @ beam-sdks-java-build-tools
---
2017-06-23T13:05:04.934 [INFO] 
2017-06-23T13:05:04.935 [INFO] --- maven-enforcer-plugin:1.4.1:enforce (enforce-banned-dependencies)
@ beam-sdks-java-build-tools ---
2017-06-23T13:05:04.989 [INFO] 
2017-06-23T13:05:04.989 [INFO] --- maven-remote-resources-plugin:1.5:process (process-resource-bundles)
@ beam-sdks-java-build-tools ---
2017-06-23T13:05:05.060 [INFO] 
2017-06-23T13:05:05.061 [INFO] --- maven-resources-plugin:3.0.2:resources (default-resources)
@ beam-sdks-java-build-tools ---
2017-06-23T13:05:05.063 [INFO] Using 'UTF-8' encoding to copy filtered resources.
2017-06-23T13:05:05.064 [INFO] Copying 4 resources
2017-06-23T13:05:05.066 [INFO] Copying 3 resources
2017-06-23T13:05:05.119 [INFO] 
2017-06-23T13:05:05.119 [INFO] --- maven-compiler-plugin:3.6.1:compile (default-compile) @
beam-sdks-java-build-tools ---
2017-06-23T13:05:05.124 [INFO] Downloading: https://repo.maven.apache.org/maven2/org/apache/maven/shared/maven-shared-incremental/1.1/maven-shared-incremental-1.1.pom
2017-06-23T13:05:05.152 [INFO] Downloaded: https://repo.maven.apache.org/maven2/org/apache/maven/shared/maven-shared-incremental/1.1/maven-shared-incremental-1.1.pom
(5 KB at 165.4 KB/sec)
2017-06-23T13:05:05.157 [INFO] Downloading: https://repo.maven.apache.org/maven2/org/apache/maven/shared/maven-shared-utils/0.1/maven-shared-utils-0.1.pom
2017-06-23T13:05:05.185 [INFO] Downloaded: https://repo.maven.apache.org/maven2/org/apache/maven/shared/maven-shared-utils/0.1/maven-shared-utils-0.1.pom
(4 KB at 141.1 KB/sec)
2017-06-23T13:05:05.189 [INFO] Downloading: https://repo.maven.apache.org/maven2/org/ow2/asm/asm/6.0_ALPHA/asm-6.0_ALPHA.pom
2017-06-23T13:05:05.219 [INFO] Downloaded: https://repo.maven.apache.org/maven2/org/ow2/asm/asm/6.0_ALPHA/asm-6.0_ALPHA.pom
(2 KB at 63.1 KB/sec)
2017-06-23T13:05:05.220 [INFO] Downloading: https://repo.maven.apache.org/maven2/org/ow2/asm/asm-parent/6.0_ALPHA/asm-parent-6.0_ALPHA.pom
2017-06-23T13:05:05.249 [INFO] Downloaded: https://repo.maven.apache.org/maven2/org/ow2/asm/asm-parent/6.0_ALPHA/asm-parent-6.0_ALPHA.pom
(6 KB at 185.2 KB/sec)
2017-06-23T13:05:05.252 [INFO] Downloading: https://repo.maven.apache.org/maven2/com/thoughtworks/qdox/qdox/2.0-M5/qdox-2.0-M5.pom
2017-06-23T13:05:05.288 [INFO] Downloaded: https://repo.maven.apache.org/maven2/com/thoughtworks/qdox/qdox/2.0-M5/qdox-2.0-M5.pom
(16 KB at 422.9 KB/sec)
2017-06-23T13:05:05.293 [INFO] Downloading: https://repo.maven.apache.org/maven2/org/codehaus/plexus/plexus-compiler-api/2.8.1/plexus-compiler-api-2.8.1.pom
2017-06-23T13:05:05.330 [INFO] Downloaded: https://repo.maven.apache.org/maven2/org/codehaus/plexus/plexus-compiler-api/2.8.1/plexus-compiler-api-2.8.1.pom
(893 B at 23.6 KB/sec)
2017-06-23T13:05:05.332 [INFO] Downloading: https://repo.maven.apache.org/maven2/org/codehaus/plexus/plexus-compiler/2.8.1/plexus-compiler-2.8.1.pom
2017-06-23T13:05:05.361 [INFO] Downloaded: https://repo.maven.apache.org/maven2/org/codehaus/plexus/plexus-compiler/2.8.1/plexus-compiler-2.8.1.pom
(5 KB at 168.5 KB/sec)
2017-06-23T13:05:05.365 [INFO] Downloading: https://repo.maven.apache.org/maven2/org/codehaus/plexus/plexus-compiler-manager/2.8.1/plexus-compiler-manager-2.8.1.pom
2017-06-23T13:05:05.393 [INFO] Downloaded: https://repo.maven.apache.org/maven2/org/codehaus/plexus/plexus-compiler-manager/2.8.1/plexus-compiler-manager-2.8.1.pom
(713 B at 24.9 KB/sec)
2017-06-23T13:05:05.397 [INFO] Downloading: https://repo.maven.apache.org/maven2/org/codehaus/plexus/plexus-compiler-javac/2.8.1/plexus-compiler-javac-2.8.1.pom
2017-06-23T13:05:05.425 [INFO] Downloaded: https://repo.maven.apache.org/maven2/org/codehaus/plexus/plexus-compiler-javac/2.8.1/plexus-compiler-javac-2.8.1.pom
(794 B at 27.7 KB/sec)
2017-06-23T13:05:05.427 [INFO] Downloading: https://repo.maven.apache.org/maven2/org/codehaus/plexus/plexus-compilers/2.8.1/plexus-compilers-2.8.1.pom
2017-06-23T13:05:05.456 [INFO] Downloaded: https://repo.maven.apache.org/maven2/org/codehaus/plexus/plexus-compilers/2.8.1/plexus-compilers-2.8.1.pom
(2 KB at 46.6 KB/sec)
2017-06-23T13:05:05.482 [INFO] Downloading: https://repo.maven.apache.org/maven2/org/apache/maven/shared/maven-shared-utils/3.1.0/maven-shared-utils-3.1.0.jar
2017-06-23T13:05:05.482 [INFO] Downloading: https://repo.maven.apache.org/maven2/org/apache/maven/shared/maven-shared-incremental/1.1/maven-shared-incremental-1.1.jar
2017-06-23T13:05:05.483 [INFO] Downloading: https://repo.maven.apache.org/maven2/org/ow2/asm/asm/6.0_ALPHA/asm-6.0_ALPHA.jar
2017-06-23T13:05:05.485 [INFO] Downloading: https://repo.maven.apache.org/maven2/com/thoughtworks/qdox/qdox/2.0-M5/qdox-2.0-M5.jar
2017-06-23T13:05:05.486 [INFO] Downloading: https://repo.maven.apache.org/maven2/org/codehaus/plexus/plexus-compiler-api/2.8.1/plexus-compiler-api-2.8.1.jar
2017-06-23T13:05:05.544 [INFO] Downloaded: https://repo.maven.apache.org/maven2/org/apache/maven/shared/maven-shared-incremental/1.1/maven-shared-incremental-1.1.jar
(14 KB at 181.1 KB/sec)
2017-06-23T13:05:05.544 [INFO] Downloading: https://repo.maven.apache.org/maven2/org/codehaus/plexus/plexus-compiler-manager/2.8.1/plexus-compiler-manager-2.8.1.jar
2017-06-23T13:05:05.569 [INFO] Downloaded: https://repo.maven.apache.org/maven2/org/codehaus/plexus/plexus-compiler-api/2.8.1/plexus-compiler-api-2.8.1.jar
(26 KB at 302.6 KB/sec)
2017-06-23T13:05:05.569 [INFO] Downloading: https://repo.maven.apache.org/maven2/org/codehaus/plexus/plexus-compiler-javac/2.8.1/plexus-compiler-javac-2.8.1.jar
2017-06-23T13:05:05.570 [INFO] Downloaded: https://repo.maven.apache.org/maven2/org/ow2/asm/asm/6.0_ALPHA/asm-6.0_ALPHA.jar
(55 KB at 612.5 KB/sec)
2017-06-23T13:05:05.577 [INFO] Downloaded: https://repo.maven.apache.org/maven2/org/codehaus/plexus/plexus-compiler-manager/2.8.1/plexus-compiler-manager-2.8.1.jar
(5 KB at 49.8 KB/sec)
2017-06-23T13:05:05.606 [INFO] Downloaded: https://repo.maven.apache.org/maven2/org/codehaus/plexus/plexus-compiler-javac/2.8.1/plexus-compiler-javac-2.8.1.jar
(20 KB at 160.9 KB/sec)
2017-06-23T13:05:05.635 [INFO] Downloaded: https://repo.maven.apache.org/maven2/org/apache/maven/shared/maven-shared-utils/3.1.0/maven-shared-utils-3.1.0.jar
(160 KB at 940.3 KB/sec)
2017-06-23T13:05:05.649 [INFO] Downloaded: https://repo.maven.apache.org/maven2/com/thoughtworks/qdox/qdox/2.0-M5/qdox-2.0-M5.jar
(307 KB at 1843.9 KB/sec)
2017-06-23T13:05:05.718 [INFO] No sources to compile
2017-06-23T13:05:05.770 [INFO] 
2017-06-23T13:05:05.770 [INFO] --- formatter-maven-plugin:2.0.1:format (test-code-style) @
beam-sdks-java-build-tools ---
2017-06-23T13:05:05.775 [INFO] Downloading: https://repo.maven.apache.org/maven2/com/google/guava/guava/20.0/guava-20.0.pom
2017-06-23T13:05:05.802 [INFO] Downloaded: https://repo.maven.apache.org/maven2/com/google/guava/guava/20.0/guava-20.0.pom
(7 KB at 247.3 KB/sec)
2017-06-23T13:05:05.805 [INFO] Downloading: https://repo.maven.apache.org/maven2/com/google/guava/guava-parent/20.0/guava-parent-20.0.pom
2017-06-23T13:05:05.832 [INFO] Downloaded: https://repo.maven.apache.org/maven2/com/google/guava/guava-parent/20.0/guava-parent-20.0.pom
(10 KB at 357.9 KB/sec)
2017-06-23T13:05:05.836 [INFO] Downloading: https://repo.maven.apache.org/maven2/net/revelc/code/formatter/jdt-core/2.0.1/jdt-core-2.0.1.pom
2017-06-23T13:05:05.865 [INFO] Downloaded: https://repo.maven.apache.org/maven2/net/revelc/code/formatter/jdt-core/2.0.1/jdt-core-2.0.1.pom
(2 KB at 42.0 KB/sec)
2017-06-23T13:05:05.867 [INFO] Downloading: https://repo.maven.apache.org/maven2/net/revelc/code/formatter/formatters/2.0.1/formatters-2.0.1.pom
2017-06-23T13:05:05.894 [INFO] Downloaded: https://repo.maven.apache.org/maven2/net/revelc/code/formatter/formatters/2.0.1/formatters-2.0.1.pom
(4 KB at 138.1 KB/sec)
2017-06-23T13:05:05.899 [INFO] Downloading: https://repo.maven.apache.org/maven2/net/revelc/code/formatter/jsdt-core/2.0.1/jsdt-core-2.0.1.pom
2017-06-23T13:05:05.926 [INFO] Downloaded: https://repo.maven.apache.org/maven2/net/revelc/code/formatter/jsdt-core/2.0.1/jsdt-core-2.0.1.pom
(2 KB at 45.1 KB/sec)
2017-06-23T13:05:05.930 [INFO] Downloading: https://repo.maven.apache.org/maven2/org/apache/commons/commons-digester3/3.2/commons-digester3-3.2.pom
2017-06-23T13:05:05.961 [INFO] Downloaded: https://repo.maven.apache.org/maven2/org/apache/commons/commons-digester3/3.2/commons-digester3-3.2.pom
(18 KB at 554.1 KB/sec)
2017-06-23T13:05:05.967 [INFO] Downloading: https://repo.maven.apache.org/maven2/cglib/cglib/2.2.2/cglib-2.2.2.pom
2017-06-23T13:05:05.994 [INFO] Downloaded: https://repo.maven.apache.org/maven2/cglib/cglib/2.2.2/cglib-2.2.2.pom
(2 KB at 53.3 KB/sec)
2017-06-23T13:05:05.997 [INFO] Downloading: https://repo.maven.apache.org/maven2/asm/asm/3.3.1/asm-3.3.1.pom
2017-06-23T13:05:06.022 [INFO] Downloaded: https://repo.maven.apache.org/maven2/asm/asm/3.3.1/asm-3.3.1.pom
(266 B at 10.4 KB/sec)
2017-06-23T13:05:06.025 [INFO] Downloading: https://repo.maven.apache.org/maven2/asm/asm-parent/3.3.1/asm-parent-3.3.1.pom
2017-06-23T13:05:06.052 [INFO] Downloaded: https://repo.maven.apache.org/maven2/asm/asm-parent/3.3.1/asm-parent-3.3.1.pom
(5 KB at 156.7 KB/sec)
2017-06-23T13:05:06.055 [INFO] Downloading: https://repo.maven.apache.org/maven2/commons-beanutils/commons-beanutils/1.8.3/commons-beanutils-1.8.3.pom
2017-06-23T13:05:06.083 [INFO] Downloaded: https://repo.maven.apache.org/maven2/commons-beanutils/commons-beanutils/1.8.3/commons-beanutils-1.8.3.pom
(11 KB at 390.6 KB/sec)
2017-06-23T13:05:06.085 [INFO] Downloading: https://repo.maven.apache.org/maven2/org/apache/commons/commons-parent/14/commons-parent-14.pom
2017-06-23T13:05:06.118 [INFO] Downloaded: https://repo.maven.apache.org/maven2/org/apache/commons/commons-parent/14/commons-parent-14.pom
(31 KB at 928.9 KB/sec)
2017-06-23T13:05:06.123 [INFO] Downloading: https://repo.maven.apache.org/maven2/org/apache/maven/plugin-tools/maven-plugin-annotations/3.5/maven-plugin-annotations-3.5.pom
2017-06-23T13:05:06.151 [INFO] Downloaded: https://repo.maven.apache.org/maven2/org/apache/maven/plugin-tools/maven-plugin-annotations/3.5/maven-plugin-annotations-3.5.pom
(2 KB at 58.2 KB/sec)
2017-06-23T13:05:06.153 [INFO] Downloading: https://repo.maven.apache.org/maven2/org/apache/maven/plugin-tools/maven-plugin-tools/3.5/maven-plugin-tools-3.5.pom
2017-06-23T13:05:06.182 [INFO] Downloaded: https://repo.maven.apache.org/maven2/org/apache/maven/plugin-tools/maven-plugin-tools/3.5/maven-plugin-tools-3.5.pom
(16 KB at 545.2 KB/sec)
2017-06-23T13:05:06.188 [INFO] Downloading: https://repo.maven.apache.org/maven2/org/codehaus/plexus/plexus-resources/1.0.1/plexus-resources-1.0.1.pom
2017-06-23T13:05:06.215 [INFO] Downloaded: https://repo.maven.apache.org/maven2/org/codehaus/plexus/plexus-resources/1.0.1/plexus-resources-1.0.1.pom
(2 KB at 47.7 KB/sec)
2017-06-23T13:05:06.219 [INFO] Downloading: https://repo.maven.apache.org/maven2/org/codehaus/plexus/plexus-utils/3.0.8/plexus-utils-3.0.8.pom
2017-06-23T13:05:06.245 [INFO] Downloaded: https://repo.maven.apache.org/maven2/org/codehaus/plexus/plexus-utils/3.0.8/plexus-utils-3.0.8.pom
(4 KB at 118.0 KB/sec)
2017-06-23T13:05:06.252 [INFO] Downloading: https://repo.maven.apache.org/maven2/com/google/guava/guava/20.0/guava-20.0.jar
2017-06-23T13:05:06.253 [INFO] Downloading: https://repo.maven.apache.org/maven2/net/revelc/code/formatter/jdt-core/2.0.1/jdt-core-2.0.1.jar
2017-06-23T13:05:06.253 [INFO] Downloading: https://repo.maven.apache.org/maven2/cglib/cglib/2.2.2/cglib-2.2.2.jar
2017-06-23T13:05:06.253 [INFO] Downloading: https://repo.maven.apache.org/maven2/org/apache/commons/commons-digester3/3.2/commons-digester3-3.2.jar
2017-06-23T13:05:06.253 [INFO] Downloading: https://repo.maven.apache.org/maven2/net/revelc/code/formatter/jsdt-core/2.0.1/jsdt-core-2.0.1.jar
[INFO] I/O exception (java.net.SocketException) caught when processing request to {s}->https://repo.maven.apache.org:443:
Connection reset
[INFO] Retrying request to {s}->https://repo.maven.apache.org:443
2017-06-23T13:05:06.408 [INFO] Downloading: https://repo.maven.apache.org/maven2/asm/asm/3.3.1/asm-3.3.1.jar
2017-06-23T13:05:06.575 [INFO] Downloaded: https://repo.maven.apache.org/maven2/cglib/cglib/2.2.2/cglib-2.2.2.jar
(281 KB at 871.0 KB/sec)
2017-06-23T13:05:06.575 [INFO] Downloading: https://repo.maven.apache.org/maven2/commons-beanutils/commons-beanutils/1.8.3/commons-beanutils-1.8.3.jar
2017-06-23T13:05:06.588 [INFO] Downloaded: https://repo.maven.apache.org/maven2/asm/asm/3.3.1/asm-3.3.1.jar
(43 KB at 127.0 KB/sec)
2017-06-23T13:05:06.588 [INFO] Downloading: https://repo.maven.apache.org/maven2/commons-logging/commons-logging/1.1.1/commons-logging-1.1.1.jar
2017-06-23T13:05:06.633 [INFO] Downloaded: https://repo.maven.apache.org/maven2/commons-logging/commons-logging/1.1.1/commons-logging-1.1.1.jar
(60 KB at 156.0 KB/sec)
2017-06-23T13:05:06.633 [INFO] Downloading: https://repo.maven.apache.org/maven2/org/apache/maven/plugin-tools/maven-plugin-annotations/3.5/maven-plugin-annotations-3.5.jar
2017-06-23T13:05:06.639 [INFO] Downloaded: https://repo.maven.apache.org/maven2/commons-beanutils/commons-beanutils/1.8.3/commons-beanutils-1.8.3.jar
(227 KB at 587.0 KB/sec)
2017-06-23T13:05:06.639 [INFO] Downloading: https://repo.maven.apache.org/maven2/commons-io/commons-io/2.2/commons-io-2.2.jar
2017-06-23T13:05:06.664 [INFO] Downloaded: https://repo.maven.apache.org/maven2/org/apache/maven/plugin-tools/maven-plugin-annotations/3.5/maven-plugin-annotations-3.5.jar
(14 KB at 34.0 KB/sec)
2017-06-23T13:05:06.664 [INFO] Downloading: https://repo.maven.apache.org/maven2/org/codehaus/plexus/plexus-resources/1.0.1/plexus-resources-1.0.1.jar
2017-06-23T13:05:06.693 [INFO] Downloaded: https://repo.maven.apache.org/maven2/org/codehaus/plexus/plexus-resources/1.0.1/plexus-resources-1.0.1.jar
(22 KB at 48.6 KB/sec)
2017-06-23T13:05:06.693 [INFO] Downloading: https://repo.maven.apache.org/maven2/classworlds/classworlds/1.1-alpha-2/classworlds-1.1-alpha-2.jar
2017-06-23T13:05:06.715 [INFO] Downloaded: https://repo.maven.apache.org/maven2/commons-io/commons-io/2.2/commons-io-2.2.jar
(170 KB at 366.9 KB/sec)
2017-06-23T13:05:06.750 [INFO] Downloaded: https://repo.maven.apache.org/maven2/classworlds/classworlds/1.1-alpha-2/classworlds-1.1-alpha-2.jar
(37 KB at 73.9 KB/sec)
2017-06-23T13:05:07.076 [INFO] Downloaded: https://repo.maven.apache.org/maven2/com/google/guava/guava/20.0/guava-20.0.jar
(2386 KB at 2894.9 KB/sec)
2017-06-23T13:05:09.213 [INFO] Downloaded: https://repo.maven.apache.org/maven2/net/revelc/code/formatter/jsdt-core/2.0.1/jsdt-core-2.0.1.jar
(17934 KB at 6056.7 KB/sec)
2017-06-23T13:05:09.391 [INFO] Downloaded: https://repo.maven.apache.org/maven2/net/revelc/code/formatter/jdt-core/2.0.1/jdt-core-2.0.1.jar
(19470 KB at 6202.5 KB/sec)
[WARNING] Failed to getClass for net.revelc.code.formatter.FormatterMojo
[JENKINS] Archiving disabled
[JENKINS] Archiving disabled
[JENKINS] Archiving disabled
[JENKINS] Archiving disabled
[JENKINS] Archiving disabled
[JENKINS] Archiving disabled
[JENKINS] Archiving disabled
[JENKINS] Archiving disabled
[JENKINS] Archiving disabled
[JENKINS] Archiving disabled
[JENKINS] Archiving disabled
[JENKINS] Archiving disabled
[JENKINS] Archiving disabled2017-06-23T13:05:13.390 [INFO] ------------------------------------------------------------------------
2017-06-23T13:05:13.391 [INFO] Reactor Summary:
2017-06-23T13:05:13.391 [INFO] 
2017-06-23T13:05:13.391 [INFO] Apache Beam :: Parent .............................. SUCCESS
[ 31.392 s]
2017-06-23T13:05:13.391 [INFO] Apache Beam :: SDKs :: Java :: Build Tools ......... FAILURE
[  5.271 s]
2017-06-23T13:05:13.391 [INFO] Apache Beam :: SDKs ................................ SKIPPED
2017-06-23T13:05:13.391 [INFO] Apache Beam :: SDKs :: Common ...................... SKIPPED
2017-06-23T13:05:13.391 [INFO] Apache Beam :: SDKs :: Common :: Runner API ........ SKIPPED
2017-06-23T13:05:13.391 [INFO] Apache Beam :: SDKs :: Common :: Fn API ............ SKIPPED
2017-06-23T13:05:13.391 [INFO] Apache Beam :: SDKs :: Java ........................ SKIPPED
2017-06-23T13:05:13.392 [INFO] Apache Beam :: SDKs :: Java :: Core ................ SKIPPED
2017-06-23T13:05:13.392 [INFO] Apache Beam :: Runners ............................. SKIPPED
2017-06-23T13:05:13.392 [INFO] Apache Beam :: Runners :: Core Construction Java ... SKIPPED
2017-06-23T13:05:13.392 [INFO] Apache Beam :: Runners :: Core Java ................ SKIPPED
2017-06-23T13:05:13.392 [INFO] Apache Beam :: Runners :: Flink .................... SKIPPED
2017-06-23T13:05:13.392 [INFO] ------------------------------------------------------------------------
2017-06-23T13:05:13.392 [INFO] BUILD FAILURE
2017-06-23T13:05:13.392 [INFO] ------------------------------------------------------------------------
2017-06-23T13:05:13.392 [INFO] Total time: 01:40 min
2017-06-23T13:05:13.392 [INFO] Finished at: 2017-06-23T13:05:13+00:00

2017-06-23T13:05:13.666 [INFO] Final Memory: 56M/788M
2017-06-23T13:05:13.666 [INFO] ------------------------------------------------------------------------
2017-06-23T13:05:13.667 [WARNING] The requested profile "validates-runner-tests" could not
be activated because it does not exist.
2017-06-23T13:05:13.679 [ERROR] Failed to execute goal net.revelc.code.formatter:formatter-maven-plugin:2.0.1:format
(test-code-style) on project beam-sdks-java-build-tools: Execution test-code-style of goal
net.revelc.code.formatter:formatter-maven-plugin:2.0.1:format failed: Plugin net.revelc.code.formatter:formatter-maven-plugin:2.0.1
or one of its dependencies could not be resolved: Could not transfer artifact org.apache.commons:commons-digester3:jar:3.2
from/to central (https://repo.maven.apache.org/maven2): GET request of: org/apache/commons/commons-digester3/3.2/commons-digester3-3.2.jar
from central failed: Connection reset -> [Help 1]
org.apache.maven.lifecycle.LifecycleExecutionException: Failed to execute goal net.revelc.code.formatter:formatter-maven-plugin:2.0.1:format
(test-code-style) on project beam-sdks-java-build-tools: Execution test-code-style of goal
net.revelc.code.formatter:formatter-maven-plugin:2.0.1:format failed: Plugin net.revelc.code.formatter:formatter-maven-plugin:2.0.1
or one of its dependencies could not be resolved: Could not transfer artifact org.apache.commons:commons-digester3:jar:3.2
from/to central (https://repo.maven.apache.org/maven2): GET request of: org/apache/commons/commons-digester3/3.2/commons-digester3-3.2.jar
from central failed
	at org.apache.maven.lifecycle.internal.MojoExecutor.execute(MojoExecutor.java:224)
	at org.apache.maven.lifecycle.internal.MojoExecutor.execute(MojoExecutor.java:153)
	at org.apache.maven.lifecycle.internal.MojoExecutor.execute(MojoExecutor.java:145)
	at org.apache.maven.lifecycle.internal.LifecycleModuleBuilder.buildProject(LifecycleModuleBuilder.java:116)
	at org.apache.maven.lifecycle.internal.LifecycleModuleBuilder.buildProject(LifecycleModuleBuilder.java:80)
	at org.apache.maven.lifecycle.internal.builder.singlethreaded.SingleThreadedBuilder.build(SingleThreadedBuilder.java:51)
	at org.apache.maven.lifecycle.internal.LifecycleStarter.execute(LifecycleStarter.java:128)
	at org.apache.maven.DefaultMaven.doExecute(DefaultMaven.java:307)
	at org.apache.maven.DefaultMaven.doExecute(DefaultMaven.java:193)
	at org.apache.maven.DefaultMaven.execute(DefaultMaven.java:106)
	at org.jvnet.hudson.maven3.launcher.Maven33Launcher.main(Maven33Launcher.java:129)
	at sun.reflect.NativeMethodAccessorImpl.invoke0(Native Method)
	at sun.reflect.NativeMethodAccessorImpl.invoke(NativeMethodAccessorImpl.java:62)
	at sun.reflect.DelegatingMethodAccessorImpl.invoke(DelegatingMethodAccessorImpl.java:43)
	at java.lang.reflect.Method.invoke(Method.java:498)
	at org.codehaus.plexus.classworlds.launcher.Launcher.launchStandard(Launcher.java:330)
	at org.codehaus.plexus.classworlds.launcher.Launcher.launch(Launcher.java:238)
	at jenkins.maven3.agent.Maven33Main.launch(Maven33Main.java:176)
	at sun.reflect.NativeMethodAccessorImpl.invoke0(Native Method)
	at sun.reflect.NativeMethodAccessorImpl.invoke(NativeMethodAccessorImpl.java:62)
	at sun.reflect.DelegatingMethodAccessorImpl.invoke(DelegatingMethodAccessorImpl.java:43)
	at java.lang.reflect.Method.invoke(Method.java:498)
	at hudson.maven.Maven3Builder.call(Maven3Builder.java:139)
	at hudson.maven.Maven3Builder.call(Maven3Builder.java:70)
	at hudson.remoting.UserRequest.perform(UserRequest.java:153)
	at hudson.remoting.UserRequest.perform(UserRequest.java:50)
	at hudson.remoting.Request$2.run(Request.java:336)
	at hudson.remoting.InterceptingExecutorService$1.call(InterceptingExecutorService.java:68)
	at java.util.concurrent.FutureTask.run(FutureTask.java:266)
	at java.util.concurrent.ThreadPoolExecutor.runWorker(ThreadPoolExecutor.java:1142)
	at java.util.concurrent.ThreadPoolExecutor$Worker.run(ThreadPoolExecutor.java:617)
	at java.lang.Thread.run(Thread.java:748)
Caused by: org.apache.maven.plugin.PluginExecutionException: Execution test-code-style of
goal net.revelc.code.formatter:formatter-maven-plugin:2.0.1:format failed: Plugin net.revelc.code.formatter:formatter-maven-plugin:2.0.1
or one of its dependencies could not be resolved: Could not transfer artifact org.apache.commons:commons-digester3:jar:3.2
from/to central (https://repo.maven.apache.org/maven2): GET request of: org/apache/commons/commons-digester3/3.2/commons-digester3-3.2.jar
from central failed
	at org.apache.maven.plugin.DefaultBuildPluginManager.executeMojo(DefaultBuildPluginManager.java:106)
	at org.apache.maven.lifecycle.internal.MojoExecutor.execute(MojoExecutor.java:208)
	... 31 more
Caused by: org.apache.maven.plugin.PluginResolutionException: Plugin net.revelc.code.formatter:formatter-maven-plugin:2.0.1
or one of its dependencies could not be resolved: Could not transfer artifact org.apache.commons:commons-digester3:jar:3.2
from/to central (https://repo.maven.apache.org/maven2): GET request of: org/apache/commons/commons-digester3/3.2/commons-digester3-3.2.jar
from central failed
	at org.apache.maven.plugin.internal.DefaultPluginDependenciesResolver.resolveInternal(DefaultPluginDependenciesResolver.java:218)
	at org.apache.maven.plugin.internal.DefaultPluginDependenciesResolver.resolve(DefaultPluginDependenciesResolver.java:149)
	at org.apache.maven.plugin.internal.DefaultMavenPluginManager.createPluginRealm(DefaultMavenPluginManager.java:422)
	at org.apache.maven.plugin.internal.DefaultMavenPluginManager.setupPluginRealm(DefaultMavenPluginManager.java:385)
	at org.apache.maven.plugin.DefaultBuildPluginManager.getPluginRealm(DefaultBuildPluginManager.java:231)
	at org.apache.maven.plugin.DefaultBuildPluginManager.executeMojo(DefaultBuildPluginManager.java:102)
	... 32 more
Caused by: org.eclipse.aether.resolution.ArtifactResolutionException: Could not transfer artifact
org.apache.commons:commons-digester3:jar:3.2 from/to central (https://repo.maven.apache.org/maven2):
GET request of: org/apache/commons/commons-digester3/3.2/commons-digester3-3.2.jar from central
failed
	at org.eclipse.aether.internal.impl.DefaultArtifactResolver.resolve(DefaultArtifactResolver.java:444)
	at org.eclipse.aether.internal.impl.DefaultArtifactResolver.resolveArtifacts(DefaultArtifactResolver.java:246)
	at org.eclipse.aether.internal.impl.DefaultRepositorySystem.resolveDependencies(DefaultRepositorySystem.java:367)
	at org.apache.maven.plugin.internal.DefaultPluginDependenciesResolver.resolveInternal(DefaultPluginDependenciesResolver.java:210)
	... 37 more
Caused by: org.eclipse.aether.transfer.ArtifactTransferException: Could not transfer artifact
org.apache.commons:commons-digester3:jar:3.2 from/to central (https://repo.maven.apache.org/maven2):
GET request of: org/apache/commons/commons-digester3/3.2/commons-digester3-3.2.jar from central
failed
	at org.eclipse.aether.connector.basic.ArtifactTransportListener.transferFailed(ArtifactTransportListener.java:43)
	at org.eclipse.aether.connector.basic.BasicRepositoryConnector$TaskRunner.run(BasicRepositoryConnector.java:355)
	at org.eclipse.aether.util.concurrency.RunnableErrorForwarder$1.run(RunnableErrorForwarder.java:67)
	... 3 more
Caused by: org.apache.maven.wagon.TransferFailedException: GET request of: org/apache/commons/commons-digester3/3.2/commons-digester3-3.2.jar
from central failed
	at org.apache.maven.wagon.AbstractWagon.getTransfer(AbstractWagon.java:363)
	at org.apache.maven.wagon.AbstractWagon.getTransfer(AbstractWagon.java:316)
	at org.apache.maven.wagon.AbstractWagon.getTransfer(AbstractWagon.java:285)
	at org.apache.maven.wagon.StreamWagon.getIfNewer(StreamWagon.java:97)
	at org.apache.maven.wagon.StreamWagon.get(StreamWagon.java:61)
	at org.eclipse.aether.transport.wagon.WagonTransporter$GetTaskRunner.run(WagonTransporter.java:560)
	at org.eclipse.aether.transport.wagon.WagonTransporter.execute(WagonTransporter.java:427)
	at org.eclipse.aether.transport.wagon.WagonTransporter.get(WagonTransporter.java:404)
	at org.eclipse.aether.connector.basic.BasicRepositoryConnector$GetTaskRunner.runTask(BasicRepositoryConnector.java:447)
	at org.eclipse.aether.connector.basic.BasicRepositoryConnector$TaskRunner.run(BasicRepositoryConnector.java:350)
	... 4 more
Caused by: java.net.SocketException: Connection reset
	at java.net.SocketInputStream.read(SocketInputStream.java:210)
	at java.net.SocketInputStream.read(SocketInputStream.java:141)
	at sun.security.ssl.InputRecord.readFully(InputRecord.java:465)
	at sun.security.ssl.InputRecord.readV3Record(InputRecord.java:593)
	at sun.security.ssl.InputRecord.read(InputRecord.java:532)
	at sun.security.ssl.SSLSocketImpl.readRecord(SSLSocketImpl.java:973)
	at sun.security.ssl.SSLSocketImpl.readDataRecord(SSLSocketImpl.java:930)
	at sun.security.ssl.AppInputStream.read(AppInputStream.java:105)
	at org.apache.maven.wagon.providers.http.httpclient.impl.io.SessionInputBufferImpl.streamRead(SessionInputBufferImpl.java:136)
	at org.apache.maven.wagon.providers.http.httpclient.impl.io.SessionInputBufferImpl.read(SessionInputBufferImpl.java:195)
	at org.apache.maven.wagon.providers.http.httpclient.impl.io.ContentLengthInputStream.read(ContentLengthInputStream.java:178)
	at org.apache.maven.wagon.providers.http.httpclient.conn.EofSensorInputStream.read(EofSensorInputStream.java:137)
	at org.apache.maven.wagon.AbstractWagon.transfer(AbstractWagon.java:531)
	at org.apache.maven.wagon.AbstractWagon.getTransfer(AbstractWagon.java:353)
	... 13 more
2017-06-23T13:05:13.683 [ERROR] 
2017-06-23T13:05:13.683 [ERROR] Re-run Maven using the -X switch to enable full debug logging.
2017-06-23T13:05:13.683 [ERROR] 
2017-06-23T13:05:13.683 [ERROR] For more information about the errors and possible solutions,
please read the following articles:
2017-06-23T13:05:13.683 [ERROR] [Help 1] http://cwiki.apache.org/confluence/display/MAVEN/PluginResolutionException
2017-06-23T13:05:13.683 [ERROR] 
2017-06-23T13:05:13.683 [ERROR] After correcting the problems, you can resume the build with
the command
2017-06-23T13:05:13.683 [ERROR]   mvn <goals> -rf :beam-sdks-java-build-tools
channel stopped

Mime
View raw message