beam-commits mailing list archives

Site index · List index
Message view « Date » · « Thread »
Top « Date » · « Thread »
From Apache Jenkins Server <jenk...@builds.apache.org>
Subject Build failed in Jenkins: beam_PostCommit_Java_JDK_Versions_Test » JDK 1.7 (latest),beam #64
Date Fri, 09 Jun 2017 12:27:55 GMT
See <https://builds.apache.org/job/beam_PostCommit_Java_JDK_Versions_Test/jdk=JDK%201.7%20(latest),label=beam/64/display/redirect>

------------------------------------------
[...truncated 1.36 MB...]
2017-06-09\T\12:27:36.419 [INFO] Downloaded: https://repo.maven.apache.org/maven2/com/github/scopt/scopt_2.10/3.5.0/scopt_2.10-3.5.0.pom
(2 KB at 60.6 KB/sec)
2017-06-09\T\12:27:36.421 [INFO] Downloading: https://repo.maven.apache.org/maven2/com/twitter/chill_2.10/0.7.4/chill_2.10-0.7.4.pom
2017-06-09\T\12:27:36.448 [INFO] Downloaded: https://repo.maven.apache.org/maven2/com/twitter/chill_2.10/0.7.4/chill_2.10-0.7.4.pom
(3 KB at 85.8 KB/sec)
2017-06-09\T\12:27:36.450 [INFO] Downloading: https://repo.maven.apache.org/maven2/org/scala-lang/scala-library/2.10.5/scala-library-2.10.5.pom
2017-06-09\T\12:27:36.476 [INFO] Downloaded: https://repo.maven.apache.org/maven2/org/scala-lang/scala-library/2.10.5/scala-library-2.10.5.pom
(2 KB at 76.8 KB/sec)
2017-06-09\T\12:27:36.478 [INFO] Downloading: https://repo.maven.apache.org/maven2/com/twitter/chill-java/0.7.4/chill-java-0.7.4.pom
2017-06-09\T\12:27:36.504 [INFO] Downloaded: https://repo.maven.apache.org/maven2/com/twitter/chill-java/0.7.4/chill-java-0.7.4.pom
(2 KB at 76.4 KB/sec)
2017-06-09\T\12:27:36.506 [INFO] Downloading: https://repo.maven.apache.org/maven2/org/apache/flink/flink-optimizer_2.10/1.3.0/flink-optimizer_2.10-1.3.0.pom
2017-06-09\T\12:27:36.533 [INFO] Downloaded: https://repo.maven.apache.org/maven2/org/apache/flink/flink-optimizer_2.10/1.3.0/flink-optimizer_2.10-1.3.0.pom
(5 KB at 156.2 KB/sec)
2017-06-09\T\12:27:36.540 [INFO] Downloading: https://repo.maven.apache.org/maven2/org/apache/flink/flink-streaming-java_2.10/1.3.0/flink-streaming-java_2.10-1.3.0.pom
2017-06-09\T\12:27:36.567 [INFO] Downloaded: https://repo.maven.apache.org/maven2/org/apache/flink/flink-streaming-java_2.10/1.3.0/flink-streaming-java_2.10-1.3.0.pom
(7 KB at 223.3 KB/sec)
2017-06-09\T\12:27:36.572 [INFO] Downloading: https://repo.maven.apache.org/maven2/org/apache/sling/org.apache.sling.commons.json/2.0.6/org.apache.sling.commons.json-2.0.6.pom
2017-06-09\T\12:27:36.599 [INFO] Downloaded: https://repo.maven.apache.org/maven2/org/apache/sling/org.apache.sling.commons.json/2.0.6/org.apache.sling.commons.json-2.0.6.pom
(4 KB at 117.2 KB/sec)
2017-06-09\T\12:27:36.601 [INFO] Downloading: https://repo.maven.apache.org/maven2/org/apache/sling/sling/10/sling-10.pom
2017-06-09\T\12:27:36.628 [INFO] Downloaded: https://repo.maven.apache.org/maven2/org/apache/sling/sling/10/sling-10.pom
(26 KB at 928.3 KB/sec)
2017-06-09\T\12:27:36.630 [INFO] Downloading: https://repo.maven.apache.org/maven2/org/apache/apache/8/apache-8.pom
2017-06-09\T\12:27:36.657 [INFO] Downloaded: https://repo.maven.apache.org/maven2/org/apache/apache/8/apache-8.pom
(14 KB at 508.3 KB/sec)
2017-06-09\T\12:27:36.676 [INFO] Downloading: https://repo.maven.apache.org/maven2/org/apache/flink/flink-test-utils_2.10/1.3.0/flink-test-utils_2.10-1.3.0.pom
2017-06-09\T\12:27:36.703 [INFO] Downloaded: https://repo.maven.apache.org/maven2/org/apache/flink/flink-test-utils_2.10/1.3.0/flink-test-utils_2.10-1.3.0.pom
(5 KB at 171.5 KB/sec)
2017-06-09\T\12:27:36.704 [INFO] Downloading: https://repo.maven.apache.org/maven2/org/apache/flink/flink-test-utils-parent/1.3.0/flink-test-utils-parent-1.3.0.pom
2017-06-09\T\12:27:36.730 [INFO] Downloaded: https://repo.maven.apache.org/maven2/org/apache/flink/flink-test-utils-parent/1.3.0/flink-test-utils-parent-1.3.0.pom
(2 KB at 54.1 KB/sec)
2017-06-09\T\12:27:36.735 [INFO] Downloading: https://repo.maven.apache.org/maven2/org/apache/flink/flink-test-utils-junit/1.3.0/flink-test-utils-junit-1.3.0.pom
2017-06-09\T\12:27:36.762 [INFO] Downloaded: https://repo.maven.apache.org/maven2/org/apache/flink/flink-test-utils-junit/1.3.0/flink-test-utils-junit-1.3.0.pom
(4 KB at 118.9 KB/sec)
2017-06-09\T\12:27:36.769 [INFO] Downloading: https://repo.maven.apache.org/maven2/org/apache/curator/curator-test/2.12.0/curator-test-2.12.0.pom
2017-06-09\T\12:27:36.796 [INFO] Downloaded: https://repo.maven.apache.org/maven2/org/apache/curator/curator-test/2.12.0/curator-test-2.12.0.pom
(5 KB at 150.0 KB/sec)
2017-06-09\T\12:27:36.798 [INFO] Downloading: https://repo.maven.apache.org/maven2/org/apache/curator/apache-curator/2.12.0/apache-curator-2.12.0.pom
2017-06-09\T\12:27:36.826 [INFO] Downloaded: https://repo.maven.apache.org/maven2/org/apache/curator/apache-curator/2.12.0/apache-curator-2.12.0.pom
(32 KB at 1127.5 KB/sec)
2017-06-09\T\12:27:36.831 [INFO] Downloading: https://repo.maven.apache.org/maven2/org/apache/zookeeper/zookeeper/3.4.8/zookeeper-3.4.8.pom
2017-06-09\T\12:27:36.858 [INFO] Downloaded: https://repo.maven.apache.org/maven2/org/apache/zookeeper/zookeeper/3.4.8/zookeeper-3.4.8.pom
(4 KB at 145.6 KB/sec)
2017-06-09\T\12:27:36.861 [INFO] Downloading: https://repo.maven.apache.org/maven2/org/javassist/javassist/3.18.1-GA/javassist-3.18.1-GA.pom
2017-06-09\T\12:27:36.888 [INFO] Downloaded: https://repo.maven.apache.org/maven2/org/javassist/javassist/3.18.1-GA/javassist-3.18.1-GA.pom
(10 KB at 332.1 KB/sec)
2017-06-09\T\12:27:36.905 [INFO] Downloading: https://repo.maven.apache.org/maven2/org/apache/flink/flink-clients_2.10/1.3.0/flink-clients_2.10-1.3.0.jar
2017-06-09\T\12:27:36.906 [INFO] Downloading: https://repo.maven.apache.org/maven2/org/apache/flink/flink-optimizer_2.10/1.3.0/flink-optimizer_2.10-1.3.0.jar
2017-06-09\T\12:27:36.906 [INFO] Downloading: https://repo.maven.apache.org/maven2/org/apache/flink/force-shading/1.3.0/force-shading-1.3.0.jar
2017-06-09\T\12:27:36.912 [INFO] Downloading: https://repo.maven.apache.org/maven2/org/apache/flink/flink-core/1.3.0/flink-core-1.3.0.jar
2017-06-09\T\12:27:36.913 [INFO] Downloading: https://repo.maven.apache.org/maven2/org/apache/flink/flink-annotations/1.3.0/flink-annotations-1.3.0.jar
2017-06-09\T\12:27:36.939 [INFO] Downloaded: https://repo.maven.apache.org/maven2/org/apache/flink/force-shading/1.3.0/force-shading-1.3.0.jar
(8 KB at 209.1 KB/sec)
2017-06-09\T\12:27:36.939 [INFO] Downloaded: https://repo.maven.apache.org/maven2/org/apache/flink/flink-annotations/1.3.0/flink-annotations-1.3.0.jar
(8 KB at 218.5 KB/sec)
2017-06-09\T\12:27:36.939 [INFO] Downloading: https://repo.maven.apache.org/maven2/com/esotericsoftware/kryo/kryo/2.24.0/kryo-2.24.0.jar
2017-06-09\T\12:27:36.939 [INFO] Downloading: https://repo.maven.apache.org/maven2/org/objenesis/objenesis/2.1/objenesis-2.1.jar
2017-06-09\T\12:27:36.945 [INFO] Downloaded: https://repo.maven.apache.org/maven2/org/apache/flink/flink-clients_2.10/1.3.0/flink-clients_2.10-1.3.0.jar
(89 KB at 2163.6 KB/sec)
2017-06-09\T\12:27:36.945 [INFO] Downloading: https://repo.maven.apache.org/maven2/org/apache/flink/flink-metrics-core/1.3.0/flink-metrics-core-1.3.0.jar
2017-06-09\T\12:27:36.968 [INFO] Downloaded: https://repo.maven.apache.org/maven2/org/objenesis/objenesis/2.1/objenesis-2.1.jar
(41 KB at 741.4 KB/sec)
2017-06-09\T\12:27:36.968 [INFO] Downloading: https://repo.maven.apache.org/maven2/org/apache/flink/flink-java/1.3.0/flink-java-1.3.0.jar
2017-06-09\T\12:27:36.972 [INFO] Downloaded: https://repo.maven.apache.org/maven2/org/apache/flink/flink-metrics-core/1.3.0/flink-metrics-core-1.3.0.jar
(16 KB at 264.7 KB/sec)
2017-06-09\T\12:27:36.973 [INFO] Downloading: https://repo.maven.apache.org/maven2/org/apache/flink/flink-shaded-hadoop2/1.3.0/flink-shaded-hadoop2-1.3.0.jar
2017-06-09\T\12:27:36.992 [INFO] Downloaded: https://repo.maven.apache.org/maven2/com/esotericsoftware/kryo/kryo/2.24.0/kryo-2.24.0.jar
(332 KB at 4194.1 KB/sec)
2017-06-09\T\12:27:36.992 [INFO] Downloading: https://repo.maven.apache.org/maven2/commons-configuration/commons-configuration/1.7/commons-configuration-1.7.jar
2017-06-09\T\12:27:37.050 [INFO] Downloaded: https://repo.maven.apache.org/maven2/org/apache/flink/flink-core/1.3.0/flink-core-1.3.0.jar
(1362 KB at 9454.9 KB/sec)
2017-06-09\T\12:27:37.050 [INFO] Downloading: https://repo.maven.apache.org/maven2/commons-digester/commons-digester/1.8.1/commons-digester-1.8.1.jar
2017-06-09\T\12:27:37.051 [INFO] Downloaded: https://repo.maven.apache.org/maven2/org/apache/flink/flink-java/1.3.0/flink-java-1.3.0.jar
(752 KB at 5448.4 KB/sec)
2017-06-09\T\12:27:37.051 [INFO] Downloading: https://repo.maven.apache.org/maven2/commons-beanutils/commons-beanutils-bean-collections/1.8.3/commons-beanutils-bean-collections-1.8.3.jar
2017-06-09\T\12:27:37.056 [INFO] Downloaded: https://repo.maven.apache.org/maven2/commons-configuration/commons-configuration/1.7/commons-configuration-1.7.jar
(343 KB at 2392.5 KB/sec)
2017-06-09\T\12:27:37.056 [INFO] Downloading: https://repo.maven.apache.org/maven2/org/apache/commons/commons-math3/3.5/commons-math3-3.5.jar
2017-06-09\T\12:27:37.080 [INFO] Downloaded: https://repo.maven.apache.org/maven2/commons-beanutils/commons-beanutils-bean-collections/1.8.3/commons-beanutils-bean-collections-1.8.3.jar
(26 KB at 155.4 KB/sec)
2017-06-09\T\12:27:37.080 [INFO] Downloading: https://repo.maven.apache.org/maven2/org/apache/flink/flink-runtime_2.10/1.3.0/flink-runtime_2.10-1.3.0.jar
2017-06-09\T\12:27:37.088 [INFO] Downloaded: https://repo.maven.apache.org/maven2/commons-digester/commons-digester/1.8.1/commons-digester-1.8.1.jar
(143 KB at 815.3 KB/sec)
2017-06-09\T\12:27:37.088 [INFO] Downloading: https://repo.maven.apache.org/maven2/io/netty/netty-all/4.0.27.Final/netty-all-4.0.27.Final.jar
2017-06-09\T\12:27:37.170 [INFO] Downloaded: https://repo.maven.apache.org/maven2/org/apache/flink/flink-optimizer_2.10/1.3.0/flink-optimizer_2.10-1.3.0.jar
(2679 KB at 10109.2 KB/sec)
2017-06-09\T\12:27:37.170 [INFO] Downloading: https://repo.maven.apache.org/maven2/org/javassist/javassist/3.18.2-GA/javassist-3.18.2-GA.jar
2017-06-09\T\12:27:37.278 [INFO] Downloaded: https://repo.maven.apache.org/maven2/io/netty/netty-all/4.0.27.Final/netty-all-4.0.27.Final.jar
(1894 KB at 5189.0 KB/sec)
2017-06-09\T\12:27:37.278 [INFO] Downloading: https://repo.maven.apache.org/maven2/org/scala-lang/scala-library/2.10.4/scala-library-2.10.4.jar
2017-06-09\T\12:27:37.288 [INFO] Downloaded: https://repo.maven.apache.org/maven2/org/javassist/javassist/3.18.2-GA/javassist-3.18.2-GA.jar
(698 KB at 1860.7 KB/sec)
2017-06-09\T\12:27:37.289 [INFO] Downloading: https://repo.maven.apache.org/maven2/com/data-artisans/flakka-actor_2.10/2.3-custom/flakka-actor_2.10-2.3-custom.jar
2017-06-09\T\12:27:37.292 [INFO] Downloaded: https://repo.maven.apache.org/maven2/org/apache/commons/commons-math3/3.5/commons-math3-3.5.jar
(1991 KB at 5252.5 KB/sec)
2017-06-09\T\12:27:37.292 [INFO] Downloading: https://repo.maven.apache.org/maven2/com/typesafe/config/1.2.1/config-1.2.1.jar
2017-06-09\T\12:27:37.361 [INFO] Downloaded: https://repo.maven.apache.org/maven2/com/typesafe/config/1.2.1/config-1.2.1.jar
(215 KB at 478.6 KB/sec)
2017-06-09\T\12:27:37.361 [INFO] Downloading: https://repo.maven.apache.org/maven2/com/data-artisans/flakka-remote_2.10/2.3-custom/flakka-remote_2.10-2.3-custom.jar
2017-06-09\T\12:27:37.596 [INFO] Downloaded: https://repo.maven.apache.org/maven2/com/data-artisans/flakka-remote_2.10/2.3-custom/flakka-remote_2.10-2.3-custom.jar
(1347 KB at 1972.1 KB/sec)
2017-06-09\T\12:27:37.596 [INFO] Downloading: https://repo.maven.apache.org/maven2/io/netty/netty/3.8.0.Final/netty-3.8.0.Final.jar
2017-06-09\T\12:27:37.668 [INFO] Downloaded: https://repo.maven.apache.org/maven2/com/data-artisans/flakka-actor_2.10/2.3-custom/flakka-actor_2.10-2.3-custom.jar
(2754 KB at 3646.9 KB/sec)
2017-06-09\T\12:27:37.668 [INFO] Downloading: https://repo.maven.apache.org/maven2/org/uncommons/maths/uncommons-maths/1.2.2a/uncommons-maths-1.2.2a.jar
2017-06-09\T\12:27:37.699 [INFO] Downloaded: https://repo.maven.apache.org/maven2/org/uncommons/maths/uncommons-maths/1.2.2a/uncommons-maths-1.2.2a.jar
(48 KB at 60.9 KB/sec)
2017-06-09\T\12:27:37.699 [INFO] Downloading: https://repo.maven.apache.org/maven2/com/data-artisans/flakka-slf4j_2.10/2.3-custom/flakka-slf4j_2.10-2.3-custom.jar
2017-06-09\T\12:27:37.727 [INFO] Downloaded: https://repo.maven.apache.org/maven2/com/data-artisans/flakka-slf4j_2.10/2.3-custom/flakka-slf4j_2.10-2.3-custom.jar
(16 KB at 18.6 KB/sec)
2017-06-09\T\12:27:37.727 [INFO] Downloading: https://repo.maven.apache.org/maven2/org/clapper/grizzled-slf4j_2.10/1.0.2/grizzled-slf4j_2.10-1.0.2.jar
2017-06-09\T\12:27:37.747 [INFO] Downloaded: https://repo.maven.apache.org/maven2/io/netty/netty/3.8.0.Final/netty-3.8.0.Final.jar
(1202 KB at 1440.5 KB/sec)
2017-06-09\T\12:27:37.747 [INFO] Downloading: https://repo.maven.apache.org/maven2/com/github/scopt/scopt_2.10/3.5.0/scopt_2.10-3.5.0.jar
2017-06-09\T\12:27:37.761 [INFO] Downloaded: https://repo.maven.apache.org/maven2/org/clapper/grizzled-slf4j_2.10/1.0.2/grizzled-slf4j_2.10-1.0.2.jar
(7 KB at 7.4 KB/sec)
2017-06-09\T\12:27:37.761 [INFO] Downloading: https://repo.maven.apache.org/maven2/jline/jline/0.9.94/jline-0.9.94.jar
2017-06-09\T\12:27:37.795 [INFO] Downloaded: https://repo.maven.apache.org/maven2/com/github/scopt/scopt_2.10/3.5.0/scopt_2.10-3.5.0.jar
(140 KB at 158.4 KB/sec)
2017-06-09\T\12:27:37.796 [INFO] Downloaded: https://repo.maven.apache.org/maven2/jline/jline/0.9.94/jline-0.9.94.jar
(86 KB at 96.6 KB/sec)
2017-06-09\T\12:27:37.796 [INFO] Downloading: https://repo.maven.apache.org/maven2/com/twitter/chill_2.10/0.7.4/chill_2.10-0.7.4.jar
2017-06-09\T\12:27:37.797 [INFO] Downloading: https://repo.maven.apache.org/maven2/com/twitter/chill-java/0.7.4/chill-java-0.7.4.jar
2017-06-09\T\12:27:37.816 [INFO] Downloaded: https://repo.maven.apache.org/maven2/org/apache/flink/flink-runtime_2.10/1.3.0/flink-runtime_2.10-1.3.0.jar
(9005 KB at 9971.3 KB/sec)
2017-06-09\T\12:27:37.816 [INFO] Downloading: https://repo.maven.apache.org/maven2/org/apache/flink/flink-streaming-java_2.10/1.3.0/flink-streaming-java_2.10-1.3.0.jar
2017-06-09\T\12:27:37.827 [INFO] Downloaded: https://repo.maven.apache.org/maven2/com/twitter/chill-java/0.7.4/chill-java-0.7.4.jar
(50 KB at 53.8 KB/sec)
2017-06-09\T\12:27:37.827 [INFO] Downloading: https://repo.maven.apache.org/maven2/org/apache/sling/org.apache.sling.commons.json/2.0.6/org.apache.sling.commons.json-2.0.6.jar
2017-06-09\T\12:27:37.841 [INFO] Downloaded: https://repo.maven.apache.org/maven2/com/twitter/chill_2.10/0.7.4/chill_2.10-0.7.4.jar
(217 KB at 232.8 KB/sec)
2017-06-09\T\12:27:37.842 [INFO] Downloading: https://repo.maven.apache.org/maven2/org/apache/flink/flink-core/1.3.0/flink-core-1.3.0-tests.jar
2017-06-09\T\12:27:37.844 [INFO] Downloaded: https://repo.maven.apache.org/maven2/org/scala-lang/scala-library/2.10.4/scala-library-2.10.4.jar
(6960 KB at 7475.1 KB/sec)
2017-06-09\T\12:27:37.844 [INFO] Downloading: https://repo.maven.apache.org/maven2/org/apache/flink/flink-runtime_2.10/1.3.0/flink-runtime_2.10-1.3.0-tests.jar
2017-06-09\T\12:27:37.873 [INFO] Downloaded: https://repo.maven.apache.org/maven2/org/apache/sling/org.apache.sling.commons.json/2.0.6/org.apache.sling.commons.json-2.0.6.jar
(47 KB at 48.7 KB/sec)
2017-06-09\T\12:27:37.873 [INFO] Downloading: https://repo.maven.apache.org/maven2/org/apache/flink/flink-streaming-java_2.10/1.3.0/flink-streaming-java_2.10-1.3.0-tests.jar
2017-06-09\T\12:27:37.884 [INFO] Downloaded: https://repo.maven.apache.org/maven2/org/apache/flink/flink-shaded-hadoop2/1.3.0/flink-shaded-hadoop2-1.3.0.jar
(16586 KB at 17080.7 KB/sec)
2017-06-09\T\12:27:37.884 [INFO] Downloading: https://repo.maven.apache.org/maven2/org/apache/flink/flink-test-utils_2.10/1.3.0/flink-test-utils_2.10-1.3.0.jar
2017-06-09\T\12:27:37.960 [INFO] Downloaded: https://repo.maven.apache.org/maven2/org/apache/flink/flink-core/1.3.0/flink-core-1.3.0-tests.jar
(753 KB at 718.3 KB/sec)
2017-06-09\T\12:27:37.960 [INFO] Downloading: https://repo.maven.apache.org/maven2/org/apache/flink/flink-test-utils-junit/1.3.0/flink-test-utils-junit-1.3.0.jar
2017-06-09\T\12:27:37.964 [INFO] Downloaded: https://repo.maven.apache.org/maven2/org/apache/flink/flink-streaming-java_2.10/1.3.0/flink-streaming-java_2.10-1.3.0-tests.jar
(1133 KB at 1077.8 KB/sec)
2017-06-09\T\12:27:37.965 [INFO] Downloading: https://repo.maven.apache.org/maven2/org/apache/curator/curator-test/2.12.0/curator-test-2.12.0.jar
2017-06-09\T\12:27:37.989 [INFO] Downloaded: https://repo.maven.apache.org/maven2/org/apache/flink/flink-test-utils-junit/1.3.0/flink-test-utils-junit-1.3.0.jar
(26 KB at 23.6 KB/sec)
2017-06-09\T\12:27:38.077 [INFO] Downloaded: https://repo.maven.apache.org/maven2/org/apache/flink/flink-runtime_2.10/1.3.0/flink-runtime_2.10-1.3.0-tests.jar
(2841 KB at 2440.3 KB/sec)
2017-06-09\T\12:27:38.082 [INFO] Downloaded: https://repo.maven.apache.org/maven2/org/apache/flink/flink-streaming-java_2.10/1.3.0/flink-streaming-java_2.10-1.3.0.jar
(3128 KB at 2675.3 KB/sec)
2017-06-09\T\12:27:38.109 [INFO] Downloaded: https://repo.maven.apache.org/maven2/org/apache/flink/flink-test-utils_2.10/1.3.0/flink-test-utils_2.10-1.3.0.jar
(2365 KB at 1976.9 KB/sec)
2017-06-09\T\12:27:38.145 [INFO] Downloaded: https://repo.maven.apache.org/maven2/org/apache/curator/curator-test/2.12.0/curator-test-2.12.0.jar
(2368 KB at 1921.8 KB/sec)
2017-06-09\T\12:27:38.156 [INFO] 
2017-06-09\T\12:27:38.156 [INFO] --- maven-clean-plugin:3.0.0:clean (default-clean) @ beam-runners-flink_2.10
---
2017-06-09\T\12:27:38.157 [INFO] Deleting <https://builds.apache.org/job/beam_PostCommit_Java_JDK_Versions_Test/jdk=JDK%201.7%20(latest),label=beam/ws/runners/flink>
(includes = [**/*.pyc, **/*.egg-info/, **/sdks/python/LICENSE, **/sdks/python/NOTICE, **/sdks/python/README.md],
excludes = [])
2017-06-09\T\12:27:38.160 [INFO] 
2017-06-09\T\12:27:38.160 [INFO] --- maven-enforcer-plugin:1.4.1:enforce (enforce) @ beam-runners-flink_2.10
---
2017-06-09\T\12:27:40.152 [INFO] 
2017-06-09\T\12:27:40.152 [INFO] --- maven-enforcer-plugin:1.4.1:enforce (enforce-banned-dependencies)
@ beam-runners-flink_2.10 ---
2017-06-09\T\12:27:40.168 [INFO] 
2017-06-09\T\12:27:40.168 [INFO] --- maven-remote-resources-plugin:1.5:process (process-resource-bundles)
@ beam-runners-flink_2.10 ---
2017-06-09\T\12:27:40.652 [INFO] 
2017-06-09\T\12:27:40.652 [INFO] --- maven-resources-plugin:3.0.2:resources (default-resources)
@ beam-runners-flink_2.10 ---
2017-06-09\T\12:27:40.653 [INFO] Using 'UTF-8' encoding to copy filtered resources.
2017-06-09\T\12:27:40.653 [INFO] Copying 1 resource
2017-06-09\T\12:27:40.675 [INFO] Copying 3 resources
2017-06-09\T\12:27:40.676 [INFO] 
2017-06-09\T\12:27:40.676 [INFO] --- maven-compiler-plugin:3.6.1:compile (default-compile)
@ beam-runners-flink_2.10 ---
2017-06-09\T\12:27:40.688 [INFO] Changes detected - recompiling the module!
2017-06-09\T\12:27:40.689 [INFO] Compiling 65 source files to <https://builds.apache.org/job/beam_PostCommit_Java_JDK_Versions_Test/jdk=JDK%201.7%20(latest),label=beam/ws/runners/flink/target/classes>
2017-06-09\T\12:27:42.497 [INFO] <https://builds.apache.org/job/beam_PostCommit_Java_JDK_Versions_Test/jdk=JDK%201.7%20(latest),label=beam/ws/runners/flink/src/main/java/org/apache/beam/runners/flink/FlinkStreamingTransformTranslators.java>:
Some input files use or override a deprecated API.
2017-06-09\T\12:27:42.497 [INFO] <https://builds.apache.org/job/beam_PostCommit_Java_JDK_Versions_Test/jdk=JDK%201.7%20(latest),label=beam/ws/runners/flink/src/main/java/org/apache/beam/runners/flink/FlinkStreamingTransformTranslators.java>:
Recompile with -Xlint:deprecation for details.
2017-06-09\T\12:27:42.497 [INFO] <https://builds.apache.org/job/beam_PostCommit_Java_JDK_Versions_Test/jdk=JDK%201.7%20(latest),label=beam/ws/runners/flink/src/main/java/org/apache/beam/runners/flink/translation/wrappers/streaming/DoFnOperator.java>:
Some input files use unchecked or unsafe operations.
2017-06-09\T\12:27:42.497 [INFO] <https://builds.apache.org/job/beam_PostCommit_Java_JDK_Versions_Test/jdk=JDK%201.7%20(latest),label=beam/ws/runners/flink/src/main/java/org/apache/beam/runners/flink/translation/wrappers/streaming/DoFnOperator.java>:
Recompile with -Xlint:unchecked for details.
2017-06-09\T\12:27:42.497 [INFO] -------------------------------------------------------------
2017-06-09\T\12:27:42.497 [ERROR] COMPILATION ERROR : 
2017-06-09\T\12:27:42.497 [INFO] -------------------------------------------------------------
2017-06-09\T\12:27:42.497 [ERROR] <https://builds.apache.org/job/beam_PostCommit_Java_JDK_Versions_Test/jdk=JDK%201.7%20(latest),label=beam/ws/runners/flink/src/main/java/org/apache/beam/runners/flink/FlinkStreamingTransformTranslators.java>:[366,27]
method put in interface java.util.Map<K,V> cannot be applied to given types;
  required: org.apache.beam.sdk.values.TupleTag<?>,org.apache.flink.util.OutputTag<org.apache.beam.sdk.util.WindowedValue<?>>
  found: org.apache.beam.sdk.values.TupleTag<capture#1 of ?>,org.apache.flink.util.OutputTag<java.lang.Object>
  reason: actual argument org.apache.flink.util.OutputTag<java.lang.Object> cannot be
converted to org.apache.flink.util.OutputTag<org.apache.beam.sdk.util.WindowedValue<?>>
by method invocation conversion
2017-06-09\T\12:27:42.497 [INFO] 1 error
2017-06-09\T\12:27:42.497 [INFO] -------------------------------------------------------------
2017-06-09\T\12:27:42.497 [INFO] ------------------------------------------------------------------------
2017-06-09\T\12:27:42.498 [INFO] Reactor Summary:
2017-06-09\T\12:27:42.498 [INFO] 
2017-06-09\T\12:27:42.498 [INFO] Apache Beam :: Parent .............................. SUCCESS
[ 18.772 s]
2017-06-09\T\12:27:42.498 [INFO] Apache Beam :: SDKs :: Java :: Build Tools ......... SUCCESS
[  5.525 s]
2017-06-09\T\12:27:42.498 [INFO] Apache Beam :: SDKs ................................ SUCCESS
[  0.455 s]
2017-06-09\T\12:27:42.498 [INFO] Apache Beam :: SDKs :: Common ...................... SUCCESS
[  0.438 s]
2017-06-09\T\12:27:42.498 [INFO] Apache Beam :: SDKs :: Common :: Runner API ........ SUCCESS
[  6.603 s]
2017-06-09\T\12:27:42.498 [INFO] Apache Beam :: SDKs :: Common :: Fn API ............ SUCCESS
[  4.550 s]
2017-06-09\T\12:27:42.498 [INFO] Apache Beam :: SDKs :: Java ........................ SUCCESS
[  0.413 s]
2017-06-09\T\12:27:42.498 [INFO] Apache Beam :: SDKs :: Java :: Core ................ SUCCESS
[01:12 min]
2017-06-09\T\12:27:42.498 [INFO] Apache Beam :: Runners ............................. SUCCESS
[  0.409 s]
2017-06-09\T\12:27:42.498 [INFO] Apache Beam :: Runners :: Core Construction Java ... SUCCESS
[ 10.666 s]
2017-06-09\T\12:27:42.498 [INFO] Apache Beam :: Runners :: Core Java ................ SUCCESS
[ 24.067 s]
2017-06-09\T\12:27:42.498 [INFO] Apache Beam :: Runners :: Direct Java .............. SUCCESS
[02:53 min]
2017-06-09\T\12:27:42.498 [INFO] Apache Beam :: SDKs :: Java :: IO .................. SUCCESS
[  0.399 s]
2017-06-09\T\12:27:42.498 [INFO] Apache Beam :: SDKs :: Java :: IO :: Common ........ SUCCESS
[  2.637 s]
2017-06-09\T\12:27:42.498 [INFO] Apache Beam :: SDKs :: Java :: IO :: Cassandra ..... SUCCESS
[ 13.942 s]
2017-06-09\T\12:27:42.498 [INFO] Apache Beam :: SDKs :: Java :: IO :: Elasticsearch . SUCCESS
[ 22.240 s]
2017-06-09\T\12:27:42.498 [INFO] Apache Beam :: SDKs :: Java :: Extensions .......... SUCCESS
[  0.391 s]
2017-06-09\T\12:27:42.498 [INFO] Apache Beam :: SDKs :: Java :: Extensions :: Google Cloud
Platform Core SUCCESS [ 19.658 s]
2017-06-09\T\12:27:42.498 [INFO] Apache Beam :: SDKs :: Java :: Extensions :: Protobuf SUCCESS
[  7.931 s]
2017-06-09\T\12:27:42.498 [INFO] Apache Beam :: SDKs :: Java :: IO :: Google Cloud Platform
SUCCESS [ 50.197 s]
2017-06-09\T\12:27:42.498 [INFO] Apache Beam :: SDKs :: Java :: IO :: Hadoop Common . SUCCESS
[ 11.774 s]
2017-06-09\T\12:27:42.498 [INFO] Apache Beam :: SDKs :: Java :: IO :: Hadoop File System SUCCESS
[ 22.608 s]
2017-06-09\T\12:27:42.498 [INFO] Apache Beam :: SDKs :: Java :: IO :: Hadoop ........ SUCCESS
[  3.292 s]
2017-06-09\T\12:27:42.498 [INFO] Apache Beam :: SDKs :: Java :: IO :: Hadoop :: input-format
SUCCESS [ 12.285 s]
2017-06-09\T\12:27:42.498 [INFO] Apache Beam :: SDKs :: Java :: IO :: HBase ......... SUCCESS
[ 55.866 s]
2017-06-09\T\12:27:42.498 [INFO] Apache Beam :: SDKs :: Java :: IO :: HCatalog ...... SUCCESS
[01:01 min]
2017-06-09\T\12:27:42.498 [INFO] Apache Beam :: Runners :: Google Cloud Dataflow .... SUCCESS
[06:18 min]
2017-06-09\T\12:27:42.498 [INFO] Apache Beam :: SDKs :: Java :: IO :: JDBC .......... SUCCESS
[ 17.559 s]
2017-06-09\T\12:27:42.498 [INFO] Apache Beam :: SDKs :: Java :: IO :: JMS ........... SUCCESS
[  9.688 s]
2017-06-09\T\12:27:42.498 [INFO] Apache Beam :: SDKs :: Java :: IO :: Kafka ......... SUCCESS
[ 23.981 s]
2017-06-09\T\12:27:42.498 [INFO] Apache Beam :: SDKs :: Java :: IO :: Kinesis ....... SUCCESS
[ 11.874 s]
2017-06-09\T\12:27:42.498 [INFO] Apache Beam :: SDKs :: Java :: IO :: MongoDB ....... SUCCESS
[ 20.203 s]
2017-06-09\T\12:27:42.498 [INFO] Apache Beam :: SDKs :: Java :: IO :: MQTT .......... SUCCESS
[  9.932 s]
2017-06-09\T\12:27:42.498 [INFO] Apache Beam :: SDKs :: Java :: IO :: XML ........... SUCCESS
[ 13.440 s]
2017-06-09\T\12:27:42.498 [INFO] Apache Beam :: SDKs :: Java :: Maven Archetypes .... SUCCESS
[  0.393 s]
2017-06-09\T\12:27:42.498 [INFO] Apache Beam :: SDKs :: Java :: Maven Archetypes :: Starter
SUCCESS [ 10.327 s]
2017-06-09\T\12:27:42.498 [INFO] Apache Beam :: Examples ............................ SUCCESS
[  0.405 s]
2017-06-09\T\12:27:42.498 [INFO] Apache Beam :: Examples :: Java .................... SUCCESS
[07:07 min]
2017-06-09\T\12:27:42.498 [INFO] Apache Beam :: SDKs :: Java :: Maven Archetypes :: Examples
SUCCESS [ 28.330 s]
2017-06-09\T\12:27:42.498 [INFO] Apache Beam :: SDKs :: Java :: Extensions :: Jackson SUCCESS
[  8.960 s]
2017-06-09\T\12:27:42.498 [INFO] Apache Beam :: SDKs :: Java :: Extensions :: Join library
SUCCESS [ 11.731 s]
2017-06-09\T\12:27:42.498 [INFO] Apache Beam :: SDKs :: Java :: Extensions :: Sorter  SUCCESS
[ 24.646 s]
2017-06-09\T\12:27:42.498 [INFO] Apache Beam :: Runners :: Flink .................... FAILURE
[  7.155 s]
2017-06-09\T\12:27:42.498 [INFO] Apache Beam :: Runners :: Spark .................... SKIPPED
2017-06-09\T\12:27:42.498 [INFO] Apache Beam :: SDKs :: Java :: Aggregated Javadoc .. SKIPPED
2017-06-09\T\12:27:42.498 [INFO] ------------------------------------------------------------------------
2017-06-09\T\12:27:42.498 [INFO] BUILD FAILURE
2017-06-09\T\12:27:42.498 [INFO] ------------------------------------------------------------------------
2017-06-09\T\12:27:42.498 [INFO] Total time: 26:51 min
2017-06-09\T\12:27:42.499 [INFO] Finished at: 2017-06-09T12:27:42+00:00
2017-06-09\T\12:27:43.523 [INFO] Final Memory: 249M/1607M
2017-06-09\T\12:27:43.523 [INFO] ------------------------------------------------------------------------
2017-06-09\T\12:27:43.525 [ERROR] Failed to execute goal org.apache.maven.plugins:maven-compiler-plugin:3.6.1:compile
(default-compile) on project beam-runners-flink_2.10: Compilation failure
2017-06-09\T\12:27:43.525 [ERROR] <https://builds.apache.org/job/beam_PostCommit_Java_JDK_Versions_Test/jdk=JDK%201.7%20(latest),label=beam/ws/runners/flink/src/main/java/org/apache/beam/runners/flink/FlinkStreamingTransformTranslators.java>:[366,27]
method put in interface java.util.Map<K,V> cannot be applied to given types;
2017-06-09\T\12:27:43.525 [ERROR] required: org.apache.beam.sdk.values.TupleTag<?>,org.apache.flink.util.OutputTag<org.apache.beam.sdk.util.WindowedValue<?>>
2017-06-09\T\12:27:43.525 [ERROR] found: org.apache.beam.sdk.values.TupleTag<capture#1
of ?>,org.apache.flink.util.OutputTag<java.lang.Object>
2017-06-09\T\12:27:43.525 [ERROR] reason: actual argument org.apache.flink.util.OutputTag<java.lang.Object>
cannot be converted to org.apache.flink.util.OutputTag<org.apache.beam.sdk.util.WindowedValue<?>>
by method invocation conversion
2017-06-09\T\12:27:43.525 [ERROR] -> [Help 1]
org.apache.maven.lifecycle.LifecycleExecutionException: Failed to execute goal org.apache.maven.plugins:maven-compiler-plugin:3.6.1:compile
(default-compile) on project beam-runners-flink_2.10: Compilation failure
<https://builds.apache.org/job/beam_PostCommit_Java_JDK_Versions_Test/jdk=JDK%201.7%20(latest),label=beam/ws/runners/flink/src/main/java/org/apache/beam/runners/flink/FlinkStreamingTransformTranslators.java>:[366,27]
method put in interface java.util.Map<K,V> cannot be applied to given types;
  required: org.apache.beam.sdk.values.TupleTag<?>,org.apache.flink.util.OutputTag<org.apache.beam.sdk.util.WindowedValue<?>>
  found: org.apache.beam.sdk.values.TupleTag<capture#1 of ?>,org.apache.flink.util.OutputTag<java.lang.Object>
  reason: actual argument org.apache.flink.util.OutputTag<java.lang.Object> cannot be
converted to org.apache.flink.util.OutputTag<org.apache.beam.sdk.util.WindowedValue<?>>
by method invocation conversion

	at org.apache.maven.lifecycle.internal.MojoExecutor.execute(MojoExecutor.java:212)
	at org.apache.maven.lifecycle.internal.MojoExecutor.execute(MojoExecutor.java:153)
	at org.apache.maven.lifecycle.internal.MojoExecutor.execute(MojoExecutor.java:145)
	at org.apache.maven.lifecycle.internal.LifecycleModuleBuilder.buildProject(LifecycleModuleBuilder.java:116)
	at org.apache.maven.lifecycle.internal.LifecycleModuleBuilder.buildProject(LifecycleModuleBuilder.java:80)
	at org.apache.maven.lifecycle.internal.builder.singlethreaded.SingleThreadedBuilder.build(SingleThreadedBuilder.java:51)
	at org.apache.maven.lifecycle.internal.LifecycleStarter.execute(LifecycleStarter.java:128)
	at org.apache.maven.DefaultMaven.doExecute(DefaultMaven.java:307)
	at org.apache.maven.DefaultMaven.doExecute(DefaultMaven.java:193)
	at org.apache.maven.DefaultMaven.execute(DefaultMaven.java:106)
	at org.apache.maven.cli.MavenCli.execute(MavenCli.java:862)
	at org.apache.maven.cli.MavenCli.doMain(MavenCli.java:286)
	at org.apache.maven.cli.MavenCli.main(MavenCli.java:197)
	at sun.reflect.NativeMethodAccessorImpl.invoke0(Native Method)
	at sun.reflect.NativeMethodAccessorImpl.invoke(NativeMethodAccessorImpl.java:57)
	at sun.reflect.DelegatingMethodAccessorImpl.invoke(DelegatingMethodAccessorImpl.java:43)
	at java.lang.reflect.Method.invoke(Method.java:606)
	at org.codehaus.plexus.classworlds.launcher.Launcher.launchEnhanced(Launcher.java:289)
	at org.codehaus.plexus.classworlds.launcher.Launcher.launch(Launcher.java:229)
	at org.codehaus.plexus.classworlds.launcher.Launcher.mainWithExitCode(Launcher.java:415)
	at org.codehaus.plexus.classworlds.launcher.Launcher.main(Launcher.java:356)
Caused by: org.apache.maven.plugin.compiler.CompilationFailureException: Compilation failure
<https://builds.apache.org/job/beam_PostCommit_Java_JDK_Versions_Test/jdk=JDK%201.7%20(latest),label=beam/ws/runners/flink/src/main/java/org/apache/beam/runners/flink/FlinkStreamingTransformTranslators.java>:[366,27]
method put in interface java.util.Map<K,V> cannot be applied to given types;
  required: org.apache.beam.sdk.values.TupleTag<?>,org.apache.flink.util.OutputTag<org.apache.beam.sdk.util.WindowedValue<?>>
  found: org.apache.beam.sdk.values.TupleTag<capture#1 of ?>,org.apache.flink.util.OutputTag<java.lang.Object>
  reason: actual argument org.apache.flink.util.OutputTag<java.lang.Object> cannot be
converted to org.apache.flink.util.OutputTag<org.apache.beam.sdk.util.WindowedValue<?>>
by method invocation conversion

	at org.apache.maven.plugin.compiler.AbstractCompilerMojo.execute(AbstractCompilerMojo.java:1029)
	at org.apache.maven.plugin.compiler.CompilerMojo.execute(CompilerMojo.java:137)
	at org.apache.maven.plugin.DefaultBuildPluginManager.executeMojo(DefaultBuildPluginManager.java:134)
	at org.apache.maven.lifecycle.internal.MojoExecutor.execute(MojoExecutor.java:208)
	... 20 more
2017-06-09\T\12:27:43.526 [ERROR] 
2017-06-09\T\12:27:43.526 [ERROR] Re-run Maven using the -X switch to enable full debug logging.
2017-06-09\T\12:27:43.526 [ERROR] 
2017-06-09\T\12:27:43.526 [ERROR] For more information about the errors and possible solutions,
please read the following articles:
2017-06-09\T\12:27:43.526 [ERROR] [Help 1] http://cwiki.apache.org/confluence/display/MAVEN/MojoFailureException
2017-06-09\T\12:27:43.526 [ERROR] 
2017-06-09\T\12:27:43.526 [ERROR] After correcting the problems, you can resume the build
with the command
2017-06-09\T\12:27:43.526 [ERROR]   mvn <goals> -rf :beam-runners-flink_2.10
Build step 'Invoke top-level Maven targets' marked build as failure
Not sending mail to unregistered user ccy@google.com
Not sending mail to unregistered user kirpichov@google.com
Not sending mail to unregistered user aljoscha.krettek@gmail.com
Not sending mail to unregistered user klk@google.com
Not sending mail to unregistered user hepei.hp@alibaba-inc.com

Mime
View raw message