beam-commits mailing list archives

Site index · List index
Message view « Date » · « Thread »
Top « Date » · « Thread »
From Apache Jenkins Server <jenk...@builds.apache.org>
Subject Build failed in Jenkins: beam_PostCommit_Java_MavenInstall #4187
Date Thu, 22 Jun 2017 21:42:04 GMT
See <https://builds.apache.org/job/beam_PostCommit_Java_MavenInstall/4187/display/redirect?page=changes>

Changes:

[altay] Clean up test_stream_test and remove stray print statement

------------------------------------------
[...truncated 3.49 MB...]
2017-06-22T21:41:03.609 [INFO] Replacing original artifact with shaded artifact.
2017-06-22T21:41:03.609 [INFO] Replacing <https://builds.apache.org/job/beam_PostCommit_Java_MavenInstall/ws/runners/spark/target/beam-runners-spark-2.1.0-SNAPSHOT.jar>
with <https://builds.apache.org/job/beam_PostCommit_Java_MavenInstall/ws/runners/spark/target/beam-runners-spark-2.1.0-SNAPSHOT-shaded.jar>
2017-06-22T21:41:03.609 [INFO] Replacing original test artifact with shaded test artifact.
2017-06-22T21:41:03.609 [INFO] Replacing <https://builds.apache.org/job/beam_PostCommit_Java_MavenInstall/ws/runners/spark/target/beam-runners-spark-2.1.0-SNAPSHOT-tests.jar>
with <https://builds.apache.org/job/beam_PostCommit_Java_MavenInstall/ws/runners/spark/target/beam-runners-spark-2.1.0-SNAPSHOT-shaded-tests.jar>
2017-06-22T21:41:03.609 [INFO] Dependency-reduced POM written at: <https://builds.apache.org/job/beam_PostCommit_Java_MavenInstall/ws/runners/spark/dependency-reduced-pom.xml>
2017-06-22T21:41:03.761 [INFO] Downloading: https://repo.maven.apache.org/maven2/net/java/dev/jets3t/jets3t/0.6.1/jets3t-0.6.1.jar
2017-06-22T21:41:03.762 [INFO] Downloading: https://repo.maven.apache.org/maven2/net/jpountz/lz4/lz4/1.2.0/lz4-1.2.0.jar
[INFO] I/O exception (java.net.SocketException) caught when processing request to {s}->https://repo.maven.apache.org:443:
Connection reset
[INFO] Retrying request to {s}->https://repo.maven.apache.org:443
[INFO] I/O exception (java.net.SocketException) caught when processing request to {s}->https://repo.maven.apache.org:443:
Connection reset
[INFO] Retrying request to {s}->https://repo.maven.apache.org:443
[INFO] I/O exception (java.net.SocketException) caught when processing request to {s}->https://repo.maven.apache.org:443:
Connection reset
[INFO] Retrying request to {s}->https://repo.maven.apache.org:443
2017-06-22T21:41:03.814 [INFO] Downloaded: https://repo.maven.apache.org/maven2/net/jpountz/lz4/lz4/1.2.0/lz4-1.2.0.jar
(162 KB at 3049.5 KB/sec)
2017-06-22T21:41:03.825 [INFO] Downloading: https://repository.apache.org/content/repositories/snapshots/net/java/dev/jets3t/jets3t/0.6.1/jets3t-0.6.1.jar
2017-06-22T21:41:04.028 [INFO] Downloading: http://repository.jboss.org/nexus/content/groups/public/net/java/dev/jets3t/jets3t/0.6.1/jets3t-0.6.1.jar
[JENKINS] Archiving disabled
2017-06-22T21:41:05.272 [INFO]                                                           
             
2017-06-22T21:41:05.272 [INFO] ------------------------------------------------------------------------
2017-06-22T21:41:05.272 [INFO] Skipping Apache Beam :: Parent
2017-06-22T21:41:05.272 [INFO] This project has been banned from the build due to previous
failures.
2017-06-22T21:41:05.273 [INFO] ------------------------------------------------------------------------
[JENKINS] Archiving disabled
[JENKINS] Archiving disabled
[JENKINS] Archiving disabled
[JENKINS] Archiving disabled
[JENKINS] Archiving disabled
[JENKINS] Archiving disabled
[JENKINS] Archiving disabled
[JENKINS] Archiving disabled
[JENKINS] Archiving disabled
[JENKINS] Archiving disabled
[JENKINS] Archiving disabled
[JENKINS] Archiving disabled
[JENKINS] Archiving disabled
[JENKINS] Archiving disabled
[JENKINS] Archiving disabled
[JENKINS] Archiving disabled
[JENKINS] Archiving disabled
[JENKINS] Archiving disabled
[JENKINS] Archiving disabled
[JENKINS] Archiving disabled
[JENKINS] Archiving disabled
[JENKINS] Archiving disabled
[JENKINS] Archiving disabled
[JENKINS] Archiving disabled
[JENKINS] Archiving disabled
[JENKINS] Archiving disabled
[JENKINS] Archiving disabled
[JENKINS] Archiving disabled
[JENKINS] Archiving disabled
[JENKINS] Archiving disabled
[JENKINS] Archiving disabled
[JENKINS] Archiving disabled
[JENKINS] Archiving disabled
[JENKINS] Archiving disabled
[JENKINS] Archiving disabled
[JENKINS] Archiving disabled
[JENKINS] Archiving disabled
[JENKINS] Archiving disabled
[JENKINS] Archiving disabled
[JENKINS] Archiving disabled
[JENKINS] Archiving disabled
[JENKINS] Archiving disabled
[JENKINS] Archiving disabled
[JENKINS] Archiving disabled
[JENKINS] Archiving disabled
[JENKINS] Archiving disabled
[JENKINS] Archiving disabled
[JENKINS] Archiving disabled
2017-06-22T21:41:28.680 [INFO] ------------------------------------------------------------------------
2017-06-22T21:41:28.680 [INFO] Reactor Summary:
2017-06-22T21:41:28.680 [INFO] 
2017-06-22T21:41:28.680 [INFO] Apache Beam :: Parent .............................. SUCCESS
[ 27.144 s]
2017-06-22T21:41:28.680 [INFO] Apache Beam :: SDKs :: Java :: Build Tools ......... SUCCESS
[ 10.989 s]
2017-06-22T21:41:28.680 [INFO] Apache Beam :: SDKs ................................ SUCCESS
[  6.766 s]
2017-06-22T21:41:28.680 [INFO] Apache Beam :: SDKs :: Common ...................... SUCCESS
[  1.827 s]
2017-06-22T21:41:28.680 [INFO] Apache Beam :: SDKs :: Common :: Runner API ........ SUCCESS
[ 22.547 s]
2017-06-22T21:41:28.680 [INFO] Apache Beam :: SDKs :: Common :: Fn API ............ SUCCESS
[ 24.718 s]
2017-06-22T21:41:28.680 [INFO] Apache Beam :: SDKs :: Java ........................ SUCCESS
[  2.370 s]
2017-06-22T21:41:28.680 [INFO] Apache Beam :: SDKs :: Java :: Core ................ SUCCESS
[03:50 min]
2017-06-22T21:41:28.680 [INFO] Apache Beam :: Runners ............................. SUCCESS
[  7.243 s]
2017-06-22T21:41:28.680 [INFO] Apache Beam :: Runners :: Core Construction Java ... SUCCESS
[ 52.352 s]
2017-06-22T21:41:28.680 [INFO] Apache Beam :: Runners :: Core Java ................ SUCCESS
[01:33 min]
2017-06-22T21:41:28.680 [INFO] Apache Beam :: Runners :: Direct Java .............. SUCCESS
[04:44 min]
2017-06-22T21:41:28.680 [INFO] Apache Beam :: SDKs :: Java :: IO .................. SUCCESS
[  2.002 s]
2017-06-22T21:41:28.680 [INFO] Apache Beam :: SDKs :: Java :: IO :: Common ........ SUCCESS
[  5.325 s]
2017-06-22T21:41:28.680 [INFO] Apache Beam :: SDKs :: Java :: IO :: Cassandra ..... SUCCESS
[ 34.702 s]
2017-06-22T21:41:28.680 [INFO] Apache Beam :: SDKs :: Java :: IO :: Elasticsearch . SUCCESS
[ 51.781 s]
2017-06-22T21:41:28.680 [INFO] Apache Beam :: SDKs :: Java :: Extensions .......... SUCCESS
[  1.738 s]
2017-06-22T21:41:28.681 [INFO] Apache Beam :: SDKs :: Java :: Extensions :: Google Cloud Platform
Core SUCCESS [ 52.724 s]
2017-06-22T21:41:28.681 [INFO] Apache Beam :: SDKs :: Java :: Extensions :: Protobuf SUCCESS
[ 31.052 s]
2017-06-22T21:41:28.681 [INFO] Apache Beam :: SDKs :: Java :: IO :: Google Cloud Platform
SUCCESS [01:54 min]
2017-06-22T21:41:28.681 [INFO] Apache Beam :: SDKs :: Java :: IO :: Hadoop Common . SUCCESS
[ 28.683 s]
2017-06-22T21:41:28.681 [INFO] Apache Beam :: SDKs :: Java :: IO :: Hadoop File System SUCCESS
[01:05 min]
2017-06-22T21:41:28.681 [INFO] Apache Beam :: SDKs :: Java :: IO :: Hadoop ........ SUCCESS
[  6.472 s]
2017-06-22T21:41:28.681 [INFO] Apache Beam :: SDKs :: Java :: IO :: Hadoop :: input-format
SUCCESS [ 29.903 s]
2017-06-22T21:41:28.681 [INFO] Apache Beam :: Runners :: Google Cloud Dataflow .... SUCCESS
[06:21 min]
2017-06-22T21:41:28.681 [INFO] Apache Beam :: SDKs :: Java :: IO :: Hadoop :: jdk1.8-tests
SUCCESS [01:56 min]
2017-06-22T21:41:28.681 [INFO] Apache Beam :: SDKs :: Java :: IO :: HBase ......... SUCCESS
[01:39 min]
2017-06-22T21:41:28.681 [INFO] Apache Beam :: SDKs :: Java :: IO :: HCatalog ...... SUCCESS
[01:43 min]
2017-06-22T21:41:28.681 [INFO] Apache Beam :: SDKs :: Java :: IO :: JDBC .......... SUCCESS
[ 41.273 s]
2017-06-22T21:41:28.681 [INFO] Apache Beam :: SDKs :: Java :: IO :: JMS ........... SUCCESS
[ 40.444 s]
2017-06-22T21:41:28.681 [INFO] Apache Beam :: SDKs :: Java :: IO :: Kafka ......... SUCCESS
[ 37.236 s]
2017-06-22T21:41:28.681 [INFO] Apache Beam :: SDKs :: Java :: IO :: Kinesis ....... SUCCESS
[ 31.725 s]
2017-06-22T21:41:28.681 [INFO] Apache Beam :: SDKs :: Java :: IO :: MongoDB ....... SUCCESS
[ 53.676 s]
2017-06-22T21:41:28.681 [INFO] Apache Beam :: SDKs :: Java :: IO :: MQTT .......... SUCCESS
[ 31.948 s]
2017-06-22T21:41:28.681 [INFO] Apache Beam :: SDKs :: Java :: IO :: XML ........... SUCCESS
[ 44.524 s]
2017-06-22T21:41:28.681 [INFO] Apache Beam :: SDKs :: Java :: Maven Archetypes .... SUCCESS
[  5.822 s]
2017-06-22T21:41:28.681 [INFO] Apache Beam :: SDKs :: Java :: Maven Archetypes :: Starter
SUCCESS [ 29.427 s]
2017-06-22T21:41:28.681 [INFO] Apache Beam :: Examples ............................ SUCCESS
[  3.437 s]
2017-06-22T21:41:28.681 [INFO] Apache Beam :: Examples :: Java .................... SUCCESS
[06:44 min]
2017-06-22T21:41:28.681 [INFO] Apache Beam :: SDKs :: Java :: Maven Archetypes :: Examples
SUCCESS [ 44.440 s]
2017-06-22T21:41:28.681 [INFO] Apache Beam :: Examples :: Java 8 .................. SUCCESS
[ 34.202 s]
2017-06-22T21:41:28.681 [INFO] Apache Beam :: SDKs :: Java :: Maven Archetypes :: Examples
- Java 8 SUCCESS [ 46.831 s]
2017-06-22T21:41:28.681 [INFO] Apache Beam :: SDKs :: Java :: Extensions :: Jackson SUCCESS
[ 24.587 s]
2017-06-22T21:41:28.681 [INFO] Apache Beam :: SDKs :: Java :: Extensions :: Join library SUCCESS
[ 28.167 s]
2017-06-22T21:41:28.681 [INFO] Apache Beam :: SDKs :: Java :: Extensions :: Sorter  SUCCESS
[01:01 min]
2017-06-22T21:41:28.681 [INFO] Apache Beam :: SDKs :: Java :: Harness ............. SUCCESS
[ 51.105 s]
2017-06-22T21:41:28.681 [INFO] Apache Beam :: SDKs :: Java :: Java 8 Tests ........ SUCCESS
[ 21.504 s]
2017-06-22T21:41:28.681 [INFO] Apache Beam :: SDKs :: Python ...................... SUCCESS
[28:03 min]
2017-06-22T21:41:28.681 [INFO] Apache Beam :: Runners :: Flink .................... SUCCESS
[01:02 min]
2017-06-22T21:41:28.681 [INFO] Apache Beam :: Runners :: Spark .................... FAILURE
[02:41 min]
2017-06-22T21:41:28.681 [INFO] Apache Beam :: Runners :: Apex ..................... SKIPPED
2017-06-22T21:41:28.681 [INFO] Apache Beam :: SDKs :: Java :: Aggregated Javadoc .. SKIPPED
2017-06-22T21:41:28.681 [INFO] ------------------------------------------------------------------------
2017-06-22T21:41:28.682 [INFO] BUILD FAILURE
2017-06-22T21:41:28.682 [INFO] ------------------------------------------------------------------------
2017-06-22T21:41:28.682 [INFO] Total time: 01:22 h
2017-06-22T21:41:28.682 [INFO] Finished at: 2017-06-22T21:41:28+00:00
2017-06-22T21:41:30.021 [INFO] Final Memory: 300M/1787M
2017-06-22T21:41:30.022 [INFO] ------------------------------------------------------------------------
Waiting for Jenkins to finish collecting data
2017-06-22T21:41:46.614 [ERROR] Failed to execute goal org.apache.maven.plugins:maven-shade-plugin:3.0.0:shade
(bundle-and-repackage) on project beam-runners-spark: Error creating shaded jar: Could not
resolve following dependencies: [net.java.dev.jets3t:jets3t:jar:0.6.1 (provided)]: Could not
resolve dependencies for project org.apache.beam:beam-runners-spark:jar:2.1.0-SNAPSHOT: Could
not transfer artifact net.java.dev.jets3t:jets3t:jar:0.6.1 from/to central (https://repo.maven.apache.org/maven2):
Connection reset -> [Help 1]
org.apache.maven.lifecycle.LifecycleExecutionException: Failed to execute goal org.apache.maven.plugins:maven-shade-plugin:3.0.0:shade
(bundle-and-repackage) on project beam-runners-spark: Error creating shaded jar: Could not
resolve following dependencies: [net.java.dev.jets3t:jets3t:jar:0.6.1 (provided)]
	at org.apache.maven.lifecycle.internal.MojoExecutor.execute(MojoExecutor.java:216)
	at org.apache.maven.lifecycle.internal.MojoExecutor.execute(MojoExecutor.java:153)
	at org.apache.maven.lifecycle.internal.MojoExecutor.execute(MojoExecutor.java:145)
	at org.apache.maven.lifecycle.internal.LifecycleModuleBuilder.buildProject(LifecycleModuleBuilder.java:116)
	at org.apache.maven.lifecycle.internal.LifecycleModuleBuilder.buildProject(LifecycleModuleBuilder.java:80)
	at org.apache.maven.lifecycle.internal.builder.singlethreaded.SingleThreadedBuilder.build(SingleThreadedBuilder.java:51)
	at org.apache.maven.lifecycle.internal.LifecycleStarter.execute(LifecycleStarter.java:128)
	at org.apache.maven.DefaultMaven.doExecute(DefaultMaven.java:307)
	at org.apache.maven.DefaultMaven.doExecute(DefaultMaven.java:193)
	at org.apache.maven.DefaultMaven.execute(DefaultMaven.java:106)
	at org.jvnet.hudson.maven3.launcher.Maven33Launcher.main(Maven33Launcher.java:129)
	at sun.reflect.NativeMethodAccessorImpl.invoke0(Native Method)
	at sun.reflect.NativeMethodAccessorImpl.invoke(NativeMethodAccessorImpl.java:62)
	at sun.reflect.DelegatingMethodAccessorImpl.invoke(DelegatingMethodAccessorImpl.java:43)
	at java.lang.reflect.Method.invoke(Method.java:498)
	at org.codehaus.plexus.classworlds.launcher.Launcher.launchStandard(Launcher.java:330)
	at org.codehaus.plexus.classworlds.launcher.Launcher.launch(Launcher.java:238)
	at jenkins.maven3.agent.Maven33Main.launch(Maven33Main.java:176)
	at sun.reflect.NativeMethodAccessorImpl.invoke0(Native Method)
	at sun.reflect.NativeMethodAccessorImpl.invoke(NativeMethodAccessorImpl.java:62)
	at sun.reflect.DelegatingMethodAccessorImpl.invoke(DelegatingMethodAccessorImpl.java:43)
	at java.lang.reflect.Method.invoke(Method.java:498)
	at hudson.maven.Maven3Builder.call(Maven3Builder.java:139)
	at hudson.maven.Maven3Builder.call(Maven3Builder.java:70)
	at hudson.remoting.UserRequest.perform(UserRequest.java:153)
	at hudson.remoting.UserRequest.perform(UserRequest.java:50)
	at hudson.remoting.Request$2.run(Request.java:336)
	at hudson.remoting.InterceptingExecutorService$1.call(InterceptingExecutorService.java:68)
	at java.util.concurrent.FutureTask.run(FutureTask.java:266)
	at java.util.concurrent.ThreadPoolExecutor.runWorker(ThreadPoolExecutor.java:1142)
	at java.util.concurrent.ThreadPoolExecutor$Worker.run(ThreadPoolExecutor.java:617)
	at java.lang.Thread.run(Thread.java:748)
Caused by: org.apache.maven.plugin.MojoExecutionException: Error creating shaded jar: Could
not resolve following dependencies: [net.java.dev.jets3t:jets3t:jar:0.6.1 (provided)]
	at org.apache.maven.plugins.shade.mojo.ShadeMojo.execute(ShadeMojo.java:546)
	at org.apache.maven.plugin.DefaultBuildPluginManager.executeMojo(DefaultBuildPluginManager.java:134)
	at org.apache.maven.lifecycle.internal.MojoExecutor.execute(MojoExecutor.java:208)
	... 31 more
Caused by: org.apache.maven.shared.dependency.graph.DependencyGraphBuilderException: Could
not resolve following dependencies: [net.java.dev.jets3t:jets3t:jar:0.6.1 (provided)]
	at org.apache.maven.shared.dependency.graph.internal.Maven31DependencyGraphBuilder.resolveDependencies(Maven31DependencyGraphBuilder.java:133)
	at org.apache.maven.shared.dependency.graph.internal.Maven31DependencyGraphBuilder.buildDependencyGraph(Maven31DependencyGraphBuilder.java:113)
	at org.apache.maven.shared.dependency.graph.internal.DefaultDependencyGraphBuilder.buildDependencyGraph(DefaultDependencyGraphBuilder.java:91)
	at org.apache.maven.shared.dependency.graph.internal.DefaultDependencyGraphBuilder.buildDependencyGraph(DefaultDependencyGraphBuilder.java:66)
	at org.apache.maven.plugins.shade.mojo.ShadeMojo.updateExcludesInDeps(ShadeMojo.java:1133)
	at org.apache.maven.plugins.shade.mojo.ShadeMojo.rewriteDependencyReducedPomIfWeHaveReduction(ShadeMojo.java:1060)
	at org.apache.maven.plugins.shade.mojo.ShadeMojo.createDependencyReducedPom(ShadeMojo.java:970)
	at org.apache.maven.plugins.shade.mojo.ShadeMojo.execute(ShadeMojo.java:538)
	... 33 more
Caused by: org.apache.maven.project.DependencyResolutionException: Could not resolve dependencies
for project org.apache.beam:beam-runners-spark:jar:2.1.0-SNAPSHOT: Could not transfer artifact
net.java.dev.jets3t:jets3t:jar:0.6.1 from/to central (https://repo.maven.apache.org/maven2):
Connection reset
	at org.apache.maven.project.DefaultProjectDependenciesResolver.resolve(DefaultProjectDependenciesResolver.java:211)
	at org.apache.maven.shared.dependency.graph.internal.Maven31DependencyGraphBuilder.resolveDependencies(Maven31DependencyGraphBuilder.java:127)
	... 40 more
Caused by: org.eclipse.aether.resolution.DependencyResolutionException: Could not transfer
artifact net.java.dev.jets3t:jets3t:jar:0.6.1 from/to central (https://repo.maven.apache.org/maven2):
Connection reset
	at org.eclipse.aether.internal.impl.DefaultRepositorySystem.resolveDependencies(DefaultRepositorySystem.java:384)
	at org.apache.maven.project.DefaultProjectDependenciesResolver.resolve(DefaultProjectDependenciesResolver.java:205)
	... 41 more
Caused by: org.eclipse.aether.resolution.ArtifactResolutionException: Could not transfer artifact
net.java.dev.jets3t:jets3t:jar:0.6.1 from/to central (https://repo.maven.apache.org/maven2):
Connection reset
	at org.eclipse.aether.internal.impl.DefaultArtifactResolver.resolve(DefaultArtifactResolver.java:444)
	at org.eclipse.aether.internal.impl.DefaultArtifactResolver.resolveArtifacts(DefaultArtifactResolver.java:246)
	at org.eclipse.aether.internal.impl.DefaultRepositorySystem.resolveDependencies(DefaultRepositorySystem.java:367)
	... 42 more
Caused by: org.eclipse.aether.transfer.ArtifactTransferException: Could not transfer artifact
net.java.dev.jets3t:jets3t:jar:0.6.1 from/to central (https://repo.maven.apache.org/maven2):
Connection reset
	at org.eclipse.aether.connector.basic.ArtifactTransportListener.transferFailed(ArtifactTransportListener.java:43)
	at org.eclipse.aether.connector.basic.BasicRepositoryConnector$TaskRunner.run(BasicRepositoryConnector.java:355)
	at org.eclipse.aether.util.concurrency.RunnableErrorForwarder$1.run(RunnableErrorForwarder.java:67)
	... 3 more
Caused by: org.apache.maven.wagon.TransferFailedException: Connection reset
	at org.apache.maven.wagon.providers.http.AbstractHttpClientWagon.fillInputData(AbstractHttpClientWagon.java:1066)
	at org.apache.maven.wagon.providers.http.AbstractHttpClientWagon.fillInputData(AbstractHttpClientWagon.java:960)
	at org.apache.maven.wagon.StreamWagon.getInputStream(StreamWagon.java:116)
	at org.apache.maven.wagon.StreamWagon.getIfNewer(StreamWagon.java:88)
	at org.apache.maven.wagon.StreamWagon.get(StreamWagon.java:61)
	at org.eclipse.aether.transport.wagon.WagonTransporter$GetTaskRunner.run(WagonTransporter.java:560)
	at org.eclipse.aether.transport.wagon.WagonTransporter.execute(WagonTransporter.java:427)
	at org.eclipse.aether.transport.wagon.WagonTransporter.get(WagonTransporter.java:404)
	at org.eclipse.aether.connector.basic.BasicRepositoryConnector$GetTaskRunner.runTask(BasicRepositoryConnector.java:447)
	at org.eclipse.aether.connector.basic.BasicRepositoryConnector$TaskRunner.run(BasicRepositoryConnector.java:350)
	... 4 more
Caused by: java.net.SocketException: Connection reset
	at java.net.SocketInputStream.read(SocketInputStream.java:210)
	at java.net.SocketInputStream.read(SocketInputStream.java:141)
	at sun.security.ssl.InputRecord.readFully(InputRecord.java:465)
	at sun.security.ssl.InputRecord.read(InputRecord.java:503)
	at sun.security.ssl.SSLSocketImpl.readRecord(SSLSocketImpl.java:973)
	at sun.security.ssl.SSLSocketImpl.readDataRecord(SSLSocketImpl.java:930)
	at sun.security.ssl.AppInputStream.read(AppInputStream.java:105)
	at org.apache.maven.wagon.providers.http.httpclient.impl.io.SessionInputBufferImpl.streamRead(SessionInputBufferImpl.java:136)
	at org.apache.maven.wagon.providers.http.httpclient.impl.io.SessionInputBufferImpl.fillBuffer(SessionInputBufferImpl.java:152)
	at org.apache.maven.wagon.providers.http.httpclient.impl.io.SessionInputBufferImpl.readLine(SessionInputBufferImpl.java:270)
	at org.apache.maven.wagon.providers.http.httpclient.impl.conn.DefaultHttpResponseParser.parseHead(DefaultHttpResponseParser.java:140)
	at org.apache.maven.wagon.providers.http.httpclient.impl.conn.DefaultHttpResponseParser.parseHead(DefaultHttpResponseParser.java:57)
	at org.apache.maven.wagon.providers.http.httpclient.impl.io.AbstractMessageParser.parse(AbstractMessageParser.java:260)
	at org.apache.maven.wagon.providers.http.httpclient.impl.DefaultBHttpClientConnection.receiveResponseHeader(DefaultBHttpClientConnection.java:161)
	at org.apache.maven.wagon.providers.http.httpclient.impl.conn.CPoolProxy.receiveResponseHeader(CPoolProxy.java:153)
	at org.apache.maven.wagon.providers.http.httpclient.protocol.HttpRequestExecutor.doReceiveResponse(HttpRequestExecutor.java:271)
	at org.apache.maven.wagon.providers.http.httpclient.protocol.HttpRequestExecutor.execute(HttpRequestExecutor.java:123)
	at org.apache.maven.wagon.providers.http.httpclient.impl.execchain.MainClientExec.execute(MainClientExec.java:254)
	at org.apache.maven.wagon.providers.http.httpclient.impl.execchain.ProtocolExec.execute(ProtocolExec.java:195)
	at org.apache.maven.wagon.providers.http.httpclient.impl.execchain.RetryExec.execute(RetryExec.java:86)
	at org.apache.maven.wagon.providers.http.httpclient.impl.execchain.RedirectExec.execute(RedirectExec.java:108)
	at org.apache.maven.wagon.providers.http.httpclient.impl.client.InternalHttpClient.doExecute(InternalHttpClient.java:184)
	at org.apache.maven.wagon.providers.http.httpclient.impl.client.CloseableHttpClient.execute(CloseableHttpClient.java:82)
	at org.apache.maven.wagon.providers.http.AbstractHttpClientWagon.execute(AbstractHttpClientWagon.java:832)
	at org.apache.maven.wagon.providers.http.AbstractHttpClientWagon.fillInputData(AbstractHttpClientWagon.java:983)
	... 13 more
2017-06-22T21:41:46.619 [ERROR] 
2017-06-22T21:41:46.619 [ERROR] Re-run Maven using the -X switch to enable full debug logging.
2017-06-22T21:41:46.619 [ERROR] 
2017-06-22T21:41:46.619 [ERROR] For more information about the errors and possible solutions,
please read the following articles:
2017-06-22T21:41:46.619 [ERROR] [Help 1] http://cwiki.apache.org/confluence/display/MAVEN/MojoExecutionException
2017-06-22T21:41:46.619 [ERROR] 
2017-06-22T21:41:46.619 [ERROR] After correcting the problems, you can resume the build with
the command
2017-06-22T21:41:46.619 [ERROR]   mvn <goals> -rf :beam-runners-spark
channel stopped
Not sending mail to unregistered user github@nakomis.com

Mime
View raw message