beam-commits mailing list archives

Site index · List index
Message view « Date » · « Thread »
Top « Date » · « Thread »
From Apache Jenkins Server <jenk...@builds.apache.org>
Subject Build failed in Jenkins: beam_PostCommit_Java_JDK_Versions_Test » OpenJDK 8 (on Ubuntu only),beam #109
Date Tue, 20 Jun 2017 18:12:15 GMT
See <https://builds.apache.org/job/beam_PostCommit_Java_JDK_Versions_Test/jdk=OpenJDK%208%20(on%20Ubuntu%20only),label=beam/109/display/redirect?page=changes>

Changes:

[lcwik] Retries http code 0 (usually network error)

------------------------------------------
[...truncated 854.58 KB...]
2017-06-20\T\18:11:56.234 [INFO] Downloading: https://repo.maven.apache.org/maven2/org/apache/hadoop/hadoop-mapreduce-client-app/2.5.1/hadoop-mapreduce-client-app-2.5.1.jar
2017-06-20\T\18:11:56.240 [INFO] Downloaded: https://repo.maven.apache.org/maven2/org/apache/hadoop/hadoop-mapreduce-client-jobclient/2.5.1/hadoop-mapreduce-client-jobclient-2.5.1-tests.jar
(1453 KB at 774.6 KB/sec)
2017-06-20\T\18:11:56.240 [INFO] Downloading: https://repo.maven.apache.org/maven2/org/apache/hadoop/hadoop-yarn-server-web-proxy/2.5.1/hadoop-yarn-server-web-proxy-2.5.1.jar
2017-06-20\T\18:11:56.241 [INFO] Downloaded: https://repo.maven.apache.org/maven2/org/apache/hadoop/hadoop-mapreduce-client-shuffle/2.5.1/hadoop-mapreduce-client-shuffle-2.5.1.jar
(43 KB at 22.7 KB/sec)
2017-06-20\T\18:11:56.241 [INFO] Downloading: https://repo.maven.apache.org/maven2/org/apache/hadoop/hadoop-yarn-api/2.5.1/hadoop-yarn-api-2.5.1.jar
2017-06-20\T\18:11:56.275 [INFO] Downloaded: https://repo.maven.apache.org/maven2/org/apache/hadoop/hadoop-yarn-server-web-proxy/2.5.1/hadoop-yarn-server-web-proxy-2.5.1.jar
(28 KB at 14.6 KB/sec)
2017-06-20\T\18:11:56.275 [INFO] Downloading: https://repo.maven.apache.org/maven2/org/apache/hadoop/hadoop-mapreduce-client-jobclient/2.5.1/hadoop-mapreduce-client-jobclient-2.5.1.jar
2017-06-20\T\18:11:56.303 [INFO] Downloaded: https://repo.maven.apache.org/maven2/org/apache/hadoop/hadoop-mapreduce-client-jobclient/2.5.1/hadoop-mapreduce-client-jobclient-2.5.1.jar
(35 KB at 18.0 KB/sec)
2017-06-20\T\18:11:56.303 [INFO] Downloading: https://repo.maven.apache.org/maven2/org/apache/hadoop/hadoop-mapreduce-client-hs/2.5.1/hadoop-mapreduce-client-hs-2.5.1.jar
2017-06-20\T\18:11:56.316 [INFO] Downloaded: https://repo.maven.apache.org/maven2/org/apache/hadoop/hadoop-mapreduce-client-app/2.5.1/hadoop-mapreduce-client-app-2.5.1.jar
(480 KB at 246.0 KB/sec)
2017-06-20\T\18:11:56.316 [INFO] Downloading: https://repo.maven.apache.org/maven2/org/apache/hadoop/hadoop-common/2.5.1/hadoop-common-2.5.1.jar
2017-06-20\T\18:11:56.376 [INFO] Downloaded: https://repo.maven.apache.org/maven2/org/apache/hadoop/hadoop-mapreduce-client-hs/2.5.1/hadoop-mapreduce-client-hs-2.5.1.jar
(228 KB at 113.2 KB/sec)
2017-06-20\T\18:11:56.376 [INFO] Downloading: https://repo.maven.apache.org/maven2/org/apache/hadoop/hadoop-annotations/2.5.1/hadoop-annotations-2.5.1.jar
2017-06-20\T\18:11:56.404 [INFO] Downloaded: https://repo.maven.apache.org/maven2/org/apache/hadoop/hadoop-annotations/2.5.1/hadoop-annotations-2.5.1.jar
(17 KB at 8.2 KB/sec)
2017-06-20\T\18:11:56.404 [INFO] Downloading: https://repo.maven.apache.org/maven2/commons-el/commons-el/1.0/commons-el-1.0.jar
2017-06-20\T\18:11:56.448 [INFO] Downloaded: https://repo.maven.apache.org/maven2/commons-el/commons-el/1.0/commons-el-1.0.jar
(110 KB at 52.7 KB/sec)
2017-06-20\T\18:11:56.448 [INFO] Downloading: https://repo.maven.apache.org/maven2/org/apache/hbase/hbase-hadoop-compat/1.2.6/hbase-hadoop-compat-1.2.6-tests.jar
2017-06-20\T\18:11:56.462 [INFO] Downloaded: https://repo.maven.apache.org/maven2/org/apache/hadoop/hadoop-yarn-api/2.5.1/hadoop-yarn-api-2.5.1.jar
(1612 KB at 768.3 KB/sec)
2017-06-20\T\18:11:56.462 [INFO] Downloading: https://repo.maven.apache.org/maven2/org/apache/hbase/hbase-hadoop2-compat/1.2.6/hbase-hadoop2-compat-1.2.6-tests.jar
2017-06-20\T\18:11:56.476 [INFO] Downloaded: https://repo.maven.apache.org/maven2/org/apache/hbase/hbase-hadoop-compat/1.2.6/hbase-hadoop-compat-1.2.6-tests.jar
(20 KB at 9.0 KB/sec)
2017-06-20\T\18:11:56.476 [INFO] Downloading: https://repo.maven.apache.org/maven2/org/apache/hbase/hbase-annotations/1.2.6/hbase-annotations-1.2.6.jar
2017-06-20\T\18:11:56.489 [INFO] Downloaded: https://repo.maven.apache.org/maven2/org/apache/hbase/hbase-hadoop2-compat/1.2.6/hbase-hadoop2-compat-1.2.6-tests.jar
(30 KB at 13.8 KB/sec)
2017-06-20\T\18:11:56.504 [INFO] Downloaded: https://repo.maven.apache.org/maven2/org/apache/hbase/hbase-annotations/1.2.6/hbase-annotations-1.2.6.jar
(21 KB at 9.5 KB/sec)
2017-06-20\T\18:11:56.602 [INFO] Downloaded: https://repo.maven.apache.org/maven2/org/apache/hadoop/hadoop-common/2.5.1/hadoop-common-2.5.1.jar
(2894 KB at 1293.4 KB/sec)
2017-06-20\T\18:11:57.071 [INFO] Downloaded: https://repo.maven.apache.org/maven2/org/apache/hbase/hbase-shaded-client/1.2.6/hbase-shaded-client-1.2.6.jar
(29957 KB at 11062.3 KB/sec)
2017-06-20\T\18:11:58.513 [INFO] Downloaded: https://repo.maven.apache.org/maven2/org/apache/hbase/hbase-shaded-server/1.2.6/hbase-shaded-server-1.2.6.jar
(50961 KB at 12282.7 KB/sec)
2017-06-20\T\18:11:58.535 [INFO] 
2017-06-20\T\18:11:58.536 [INFO] --- maven-clean-plugin:3.0.0:clean (default-clean) @ beam-sdks-java-io-hbase
---
2017-06-20\T\18:11:58.538 [INFO] Deleting <https://builds.apache.org/job/beam_PostCommit_Java_JDK_Versions_Test/jdk=OpenJDK%208%20(on%20Ubuntu%20only),label=beam/ws/sdks/java/io/hbase>
(includes = [**/*.pyc, **/*.egg-info/, **/sdks/python/LICENSE, **/sdks/python/NOTICE, **/sdks/python/README.md],
excludes = [])
2017-06-20\T\18:11:58.540 [INFO] 
2017-06-20\T\18:11:58.540 [INFO] --- maven-enforcer-plugin:1.4.1:enforce (enforce) @ beam-sdks-java-io-hbase
---
2017-06-20\T\18:12:03.800 [INFO] 
2017-06-20\T\18:12:03.801 [INFO] --- maven-enforcer-plugin:1.4.1:enforce (enforce-banned-dependencies)
@ beam-sdks-java-io-hbase ---
2017-06-20\T\18:12:03.835 [INFO] 
2017-06-20\T\18:12:03.835 [INFO] --- maven-remote-resources-plugin:1.5:process (process-resource-bundles)
@ beam-sdks-java-io-hbase ---
2017-06-20\T\18:12:04.080 [INFO] 
2017-06-20\T\18:12:04.080 [INFO] --- maven-resources-plugin:3.0.2:resources (default-resources)
@ beam-sdks-java-io-hbase ---
2017-06-20\T\18:12:04.081 [INFO] Using 'UTF-8' encoding to copy filtered resources.
2017-06-20\T\18:12:04.081 [INFO] skip non existing resourceDirectory <https://builds.apache.org/job/beam_PostCommit_Java_JDK_Versions_Test/jdk=OpenJDK%208%20(on%20Ubuntu%20only),label=beam/ws/sdks/java/io/hbase/src/main/resources>
2017-06-20\T\18:12:04.081 [INFO] Copying 3 resources
2017-06-20\T\18:12:04.082 [INFO] 
2017-06-20\T\18:12:04.082 [INFO] --- maven-compiler-plugin:3.6.1:compile (default-compile)
@ beam-sdks-java-io-hbase ---
2017-06-20\T\18:12:04.086 [INFO] Changes detected - recompiling the module!
2017-06-20\T\18:12:04.086 [INFO] Compiling 5 source files to <https://builds.apache.org/job/beam_PostCommit_Java_JDK_Versions_Test/jdk=OpenJDK%208%20(on%20Ubuntu%20only),label=beam/ws/sdks/java/io/hbase/target/classes>
2017-06-20\T\18:12:04.645 [INFO] 
2017-06-20\T\18:12:04.645 [INFO] --- maven-compiler-plugin:3.6.1:compile (compile-package-info)
@ beam-sdks-java-io-hbase ---
2017-06-20\T\18:12:04.650 [INFO] Changes detected - recompiling the module!
2017-06-20\T\18:12:04.651 [INFO] Compiling 1 source file to <https://builds.apache.org/job/beam_PostCommit_Java_JDK_Versions_Test/jdk=OpenJDK%208%20(on%20Ubuntu%20only),label=beam/ws/sdks/java/io/hbase/target/classes>
2017-06-20\T\18:12:04.725 [INFO] 
2017-06-20\T\18:12:04.726 [INFO] --- maven-resources-plugin:3.0.2:testResources (default-testResources)
@ beam-sdks-java-io-hbase ---
2017-06-20\T\18:12:04.727 [INFO] Using 'UTF-8' encoding to copy filtered resources.
2017-06-20\T\18:12:04.728 [INFO] Copying 1 resource
2017-06-20\T\18:12:04.729 [INFO] Copying 3 resources
2017-06-20\T\18:12:04.730 [INFO] 
2017-06-20\T\18:12:04.730 [INFO] --- maven-compiler-plugin:3.6.1:testCompile (default-testCompile)
@ beam-sdks-java-io-hbase ---
2017-06-20\T\18:12:04.741 [INFO] Changes detected - recompiling the module!
2017-06-20\T\18:12:04.742 [INFO] Compiling 5 source files to <https://builds.apache.org/job/beam_PostCommit_Java_JDK_Versions_Test/jdk=OpenJDK%208%20(on%20Ubuntu%20only),label=beam/ws/sdks/java/io/hbase/target/test-classes>
2017-06-20\T\18:12:06.791 [INFO] 
2017-06-20\T\18:12:06.791 [INFO] --- maven-checkstyle-plugin:2.17:check (default) @ beam-sdks-java-io-hbase
---
2017-06-20\T\18:12:07.287 [INFO] Starting audit...
Audit done.
2017-06-20\T\18:12:07.287 [INFO] 
2017-06-20\T\18:12:07.288 [INFO] --- maven-surefire-plugin:2.20:test (default-test) @ beam-sdks-java-io-hbase
---
2017-06-20\T\18:12:07.290 [INFO] Surefire report directory: <https://builds.apache.org/job/beam_PostCommit_Java_JDK_Versions_Test/jdk=OpenJDK%208%20(on%20Ubuntu%20only),label=beam/ws/sdks/java/io/hbase/target/surefire-reports>
2017-06-20\T\18:12:07.291 [INFO] Using configured provider org.apache.maven.surefire.junitcore.JUnitCoreProvider
2017-06-20\T\18:12:07.291 [INFO] parallel='all', perCoreThreadCount=true, threadCount=4, useUnlimitedThreads=false,
threadCountSuites=0, threadCountClasses=0, threadCountMethods=0, parallelOptimized=true
2017-06-20\T\18:12:07.292 [INFO] 
2017-06-20\T\18:12:07.292 [INFO] -------------------------------------------------------
2017-06-20\T\18:12:07.292 [INFO]  T E S T S
2017-06-20\T\18:12:07.292 [INFO] -------------------------------------------------------
2017-06-20\T\18:12:10.518 [INFO] Running org.apache.beam.sdk.io.hbase.HBaseCoderProviderRegistrarTest
2017-06-20\T\18:12:10.519 [INFO] Tests run: 2, Failures: 0, Errors: 0, Skipped: 0, Time elapsed:
0.401 s - in org.apache.beam.sdk.io.hbase.HBaseCoderProviderRegistrarTest
2017-06-20\T\18:12:10.519 [INFO] Running org.apache.beam.sdk.io.hbase.HBaseResultCoderTest
2017-06-20\T\18:12:10.520 [INFO] Tests run: 1, Failures: 0, Errors: 0, Skipped: 0, Time elapsed:
1.576 s - in org.apache.beam.sdk.io.hbase.HBaseResultCoderTest
2017-06-20\T\18:12:10.520 [INFO] Running org.apache.beam.sdk.io.hbase.HBaseMutationCoderTest
2017-06-20\T\18:12:10.523 [INFO] Tests run: 1, Failures: 0, Errors: 0, Skipped: 0, Time elapsed:
1.646 s - in org.apache.beam.sdk.io.hbase.HBaseMutationCoderTest
2017-06-20\T\18:12:10.523 [INFO] Running org.apache.beam.sdk.io.hbase.SerializableScanTest
2017-06-20\T\18:12:10.530 [INFO] Tests run: 2, Failures: 0, Errors: 0, Skipped: 0, Time elapsed:
1.276 s - in org.apache.beam.sdk.io.hbase.SerializableScanTest
2017-06-20\T\18:12:10.530 [INFO] Running org.apache.beam.sdk.io.hbase.HBaseIOTest
2017-06-20\T\18:12:10.536 [ERROR] Tests run: 1, Failures: 0, Errors: 1, Skipped: 0, Time elapsed:
0 s <<< FAILURE! - in org.apache.beam.sdk.io.hbase.HBaseIOTest
2017-06-20\T\18:12:10.538 [ERROR] org.apache.beam.sdk.io.hbase.HBaseIOTest  Time elapsed:
0 s  <<< ERROR!
java.io.IOException: Shutting down
	at org.apache.hadoop.hbase.MiniHBaseCluster.init(MiniHBaseCluster.java:235)
	at org.apache.hadoop.hbase.MiniHBaseCluster.<init>(MiniHBaseCluster.java:97)
	at org.apache.hadoop.hbase.HBaseTestingUtility.startMiniHBaseCluster(HBaseTestingUtility.java:1036)
	at org.apache.hadoop.hbase.HBaseTestingUtility.startMiniHBaseCluster(HBaseTestingUtility.java:1002)
	at org.apache.beam.sdk.io.hbase.HBaseIOTest.beforeClass(HBaseIOTest.java:102)
	at sun.reflect.NativeMethodAccessorImpl.invoke0(Native Method)
	at sun.reflect.NativeMethodAccessorImpl.invoke(NativeMethodAccessorImpl.java:57)
	at sun.reflect.DelegatingMethodAccessorImpl.invoke(DelegatingMethodAccessorImpl.java:43)
	at java.lang.reflect.Method.invoke(Method.java:606)
	at org.junit.runners.model.FrameworkMethod$1.runReflectiveCall(FrameworkMethod.java:50)
	at org.junit.internal.runners.model.ReflectiveCallable.run(ReflectiveCallable.java:12)
	at org.junit.runners.model.FrameworkMethod.invokeExplosively(FrameworkMethod.java:47)
	at org.junit.internal.runners.statements.RunBefores.evaluate(RunBefores.java:24)
	at org.junit.internal.runners.statements.RunAfters.evaluate(RunAfters.java:27)
	at org.junit.runners.ParentRunner.run(ParentRunner.java:363)
	at org.junit.runners.Suite.runChild(Suite.java:128)
	at org.junit.runners.Suite.runChild(Suite.java:27)
	at org.junit.runners.ParentRunner$3.run(ParentRunner.java:290)
	at org.apache.maven.surefire.junitcore.pc.Scheduler$1.run(Scheduler.java:393)
	at java.util.concurrent.Executors$RunnableAdapter.call(Executors.java:473)
	at java.util.concurrent.FutureTask.run(FutureTask.java:262)
	at java.util.concurrent.ThreadPoolExecutor.runWorker(ThreadPoolExecutor.java:1145)
	at java.util.concurrent.ThreadPoolExecutor$Worker.run(ThreadPoolExecutor.java:615)
	at java.lang.Thread.run(Thread.java:745)
Caused by: java.lang.RuntimeException: Failed construction of Master: class org.apache.hadoop.hbase.master.HMasterIllegal
character in path at index 93: file:<https://builds.apache.org/job/beam_PostCommit_Java_JDK_Versions_Test/jdk=OpenJDK%208%20(on%20Ubuntu%20only),label=beam/ws/sdks/java/io/hbase/target/test-data/2cbef391-aac6-441a-888d-4b40092292c4>
	at org.apache.hadoop.hbase.util.JVMClusterUtil.createMasterThread(JVMClusterUtil.java:143)
	at org.apache.hadoop.hbase.LocalHBaseCluster.addMaster(LocalHBaseCluster.java:220)
	at org.apache.hadoop.hbase.LocalHBaseCluster.<init>(LocalHBaseCluster.java:155)
	at org.apache.hadoop.hbase.MiniHBaseCluster.init(MiniHBaseCluster.java:217)
	... 23 more
Caused by: java.lang.IllegalArgumentException: Illegal character in path at index 93: file:<https://builds.apache.org/job/beam_PostCommit_Java_JDK_Versions_Test/jdk=OpenJDK%208%20(on%20Ubuntu%20only),label=beam/ws/sdks/java/io/hbase/target/test-data/2cbef391-aac6-441a-888d-4b40092292c4>
	at java.net.URI.create(URI.java:852)
	at org.apache.hadoop.fs.FileSystem.getDefaultUri(FileSystem.java:175)
	at org.apache.hadoop.fs.FileSystem.get(FileSystem.java:167)
	at org.apache.hadoop.hbase.fs.HFileSystem.<init>(HFileSystem.java:80)
	at org.apache.hadoop.hbase.regionserver.HRegionServer.initializeFileSystem(HRegionServer.java:613)
	at org.apache.hadoop.hbase.regionserver.HRegionServer.<init>(HRegionServer.java:564)
	at org.apache.hadoop.hbase.master.HMaster.<init>(HMaster.java:412)
	at sun.reflect.NativeConstructorAccessorImpl.newInstance0(Native Method)
	at sun.reflect.NativeConstructorAccessorImpl.newInstance(NativeConstructorAccessorImpl.java:57)
	at sun.reflect.DelegatingConstructorAccessorImpl.newInstance(DelegatingConstructorAccessorImpl.java:45)
	at java.lang.reflect.Constructor.newInstance(Constructor.java:526)
	at org.apache.hadoop.hbase.util.JVMClusterUtil.createMasterThread(JVMClusterUtil.java:139)
	... 26 more
Caused by: java.net.URISyntaxException: Illegal character in path at index 93: file:<https://builds.apache.org/job/beam_PostCommit_Java_JDK_Versions_Test/jdk=OpenJDK%208%20(on%20Ubuntu%20only),label=beam/ws/sdks/java/io/hbase/target/test-data/2cbef391-aac6-441a-888d-4b40092292c4>
	at java.net.URI$Parser.fail(URI.java:2822)
	at java.net.URI$Parser.checkChars(URI.java:2995)
	at java.net.URI$Parser.parseHierarchical(URI.java:3079)
	at java.net.URI$Parser.parse(URI.java:3027)
	at java.net.URI.<init>(URI.java:588)
	at java.net.URI.create(URI.java:850)
	... 37 more

2017-06-20\T\18:12:10.877 [INFO] 
2017-06-20\T\18:12:10.877 [INFO] Results:
2017-06-20\T\18:12:10.877 [INFO] 
2017-06-20\T\18:12:10.877 [ERROR] Errors: 
2017-06-20\T\18:12:10.877 [ERROR]   HBaseIOTest.beforeClass:102 » IO Shutting down
2017-06-20\T\18:12:10.877 [INFO] 
2017-06-20\T\18:12:10.877 [ERROR] Tests run: 7, Failures: 0, Errors: 1, Skipped: 0
2017-06-20\T\18:12:10.877 [INFO] 
2017-06-20\T\18:12:10.879 [INFO] ------------------------------------------------------------------------
2017-06-20\T\18:12:10.879 [INFO] Reactor Summary:
2017-06-20\T\18:12:10.879 [INFO] 
2017-06-20\T\18:12:10.879 [INFO] Apache Beam :: Parent .............................. SUCCESS
[ 17.935 s]
2017-06-20\T\18:12:10.879 [INFO] Apache Beam :: SDKs :: Java :: Build Tools ......... SUCCESS
[  6.087 s]
2017-06-20\T\18:12:10.879 [INFO] Apache Beam :: SDKs ................................ SUCCESS
[  0.419 s]
2017-06-20\T\18:12:10.879 [INFO] Apache Beam :: SDKs :: Common ...................... SUCCESS
[  0.362 s]
2017-06-20\T\18:12:10.879 [INFO] Apache Beam :: SDKs :: Common :: Runner API ........ SUCCESS
[  6.347 s]
2017-06-20\T\18:12:10.879 [INFO] Apache Beam :: SDKs :: Common :: Fn API ............ SUCCESS
[  4.549 s]
2017-06-20\T\18:12:10.879 [INFO] Apache Beam :: SDKs :: Java ........................ SUCCESS
[  0.402 s]
2017-06-20\T\18:12:10.879 [INFO] Apache Beam :: SDKs :: Java :: Core ................ SUCCESS
[01:18 min]
2017-06-20\T\18:12:10.879 [INFO] Apache Beam :: Runners ............................. SUCCESS
[  0.392 s]
2017-06-20\T\18:12:10.879 [INFO] Apache Beam :: Runners :: Core Construction Java ... SUCCESS
[ 11.896 s]
2017-06-20\T\18:12:10.879 [INFO] Apache Beam :: Runners :: Core Java ................ SUCCESS
[ 29.320 s]
2017-06-20\T\18:12:10.879 [INFO] Apache Beam :: Runners :: Direct Java .............. SUCCESS
[03:40 min]
2017-06-20\T\18:12:10.879 [INFO] Apache Beam :: SDKs :: Java :: IO .................. SUCCESS
[  0.843 s]
2017-06-20\T\18:12:10.879 [INFO] Apache Beam :: SDKs :: Java :: IO :: Common ........ SUCCESS
[  4.592 s]
2017-06-20\T\18:12:10.879 [INFO] Apache Beam :: SDKs :: Java :: IO :: Cassandra ..... SUCCESS
[ 26.365 s]
2017-06-20\T\18:12:10.879 [INFO] Apache Beam :: SDKs :: Java :: IO :: Elasticsearch . SUCCESS
[ 41.212 s]
2017-06-20\T\18:12:10.879 [INFO] Apache Beam :: SDKs :: Java :: Extensions .......... SUCCESS
[  0.615 s]
2017-06-20\T\18:12:10.879 [INFO] Apache Beam :: SDKs :: Java :: Extensions :: Google Cloud
Platform Core SUCCESS [ 36.116 s]
2017-06-20\T\18:12:10.879 [INFO] Apache Beam :: SDKs :: Java :: Extensions :: Protobuf SUCCESS
[ 12.108 s]
2017-06-20\T\18:12:10.879 [INFO] Apache Beam :: SDKs :: Java :: IO :: Google Cloud Platform
SUCCESS [01:01 min]
2017-06-20\T\18:12:10.880 [INFO] Apache Beam :: SDKs :: Java :: IO :: Hadoop Common . SUCCESS
[ 13.523 s]
2017-06-20\T\18:12:10.880 [INFO] Apache Beam :: SDKs :: Java :: IO :: Hadoop File System SUCCESS
[ 36.965 s]
2017-06-20\T\18:12:10.880 [INFO] Apache Beam :: SDKs :: Java :: IO :: Hadoop ........ SUCCESS
[  3.992 s]
2017-06-20\T\18:12:10.880 [INFO] Apache Beam :: SDKs :: Java :: IO :: Hadoop :: input-format
SUCCESS [ 13.980 s]
2017-06-20\T\18:12:10.880 [INFO] Apache Beam :: SDKs :: Java :: IO :: HBase ......... FAILURE
[ 18.607 s]
2017-06-20\T\18:12:10.880 [INFO] Apache Beam :: SDKs :: Java :: IO :: HCatalog ...... SKIPPED
2017-06-20\T\18:12:10.880 [INFO] Apache Beam :: Runners :: Google Cloud Dataflow .... SKIPPED
2017-06-20\T\18:12:10.880 [INFO] Apache Beam :: SDKs :: Java :: IO :: JDBC .......... SKIPPED
2017-06-20\T\18:12:10.880 [INFO] Apache Beam :: SDKs :: Java :: IO :: JMS ........... SKIPPED
2017-06-20\T\18:12:10.880 [INFO] Apache Beam :: SDKs :: Java :: IO :: Kafka ......... SKIPPED
2017-06-20\T\18:12:10.880 [INFO] Apache Beam :: SDKs :: Java :: IO :: Kinesis ....... SKIPPED
2017-06-20\T\18:12:10.880 [INFO] Apache Beam :: SDKs :: Java :: IO :: MongoDB ....... SKIPPED
2017-06-20\T\18:12:10.880 [INFO] Apache Beam :: SDKs :: Java :: IO :: MQTT .......... SKIPPED
2017-06-20\T\18:12:10.880 [INFO] Apache Beam :: SDKs :: Java :: IO :: XML ........... SKIPPED
2017-06-20\T\18:12:10.880 [INFO] Apache Beam :: SDKs :: Java :: Maven Archetypes .... SKIPPED
2017-06-20\T\18:12:10.880 [INFO] Apache Beam :: SDKs :: Java :: Maven Archetypes :: Starter
SKIPPED
2017-06-20\T\18:12:10.880 [INFO] Apache Beam :: Examples ............................ SKIPPED
2017-06-20\T\18:12:10.880 [INFO] Apache Beam :: Examples :: Java .................... SKIPPED
2017-06-20\T\18:12:10.880 [INFO] Apache Beam :: SDKs :: Java :: Maven Archetypes :: Examples
SKIPPED
2017-06-20\T\18:12:10.880 [INFO] Apache Beam :: SDKs :: Java :: Extensions :: Jackson SKIPPED
2017-06-20\T\18:12:10.880 [INFO] Apache Beam :: SDKs :: Java :: Extensions :: Join library
SKIPPED
2017-06-20\T\18:12:10.880 [INFO] Apache Beam :: SDKs :: Java :: Extensions :: Sorter  SKIPPED
2017-06-20\T\18:12:10.880 [INFO] Apache Beam :: Runners :: Flink .................... SKIPPED
2017-06-20\T\18:12:10.880 [INFO] Apache Beam :: Runners :: Spark .................... SKIPPED
2017-06-20\T\18:12:10.880 [INFO] Apache Beam :: SDKs :: Java :: Aggregated Javadoc .. SKIPPED
2017-06-20\T\18:12:10.880 [INFO] ------------------------------------------------------------------------
2017-06-20\T\18:12:10.880 [INFO] BUILD FAILURE
2017-06-20\T\18:12:10.880 [INFO] ------------------------------------------------------------------------
2017-06-20\T\18:12:10.880 [INFO] Total time: 10:50 min
2017-06-20\T\18:12:10.880 [INFO] Finished at: 2017-06-20T18:12:10+00:00
2017-06-20\T\18:12:11.627 [INFO] Final Memory: 169M/1583M
2017-06-20\T\18:12:11.627 [INFO] ------------------------------------------------------------------------
2017-06-20\T\18:12:11.629 [ERROR] Failed to execute goal org.apache.maven.plugins:maven-surefire-plugin:2.20:test
(default-test) on project beam-sdks-java-io-hbase: There are test failures.
2017-06-20\T\18:12:11.629 [ERROR] 
2017-06-20\T\18:12:11.629 [ERROR] Please refer to <https://builds.apache.org/job/beam_PostCommit_Java_JDK_Versions_Test/jdk=OpenJDK%208%20(on%20Ubuntu%20only),label=beam/ws/sdks/java/io/hbase/target/surefire-reports>
for the individual test results.
2017-06-20\T\18:12:11.629 [ERROR] Please refer to dump files (if any exist) [date]-jvmRun[N].dump,
[date].dumpstream and [date]-jvmRun[N].dumpstream.
2017-06-20\T\18:12:11.629 [ERROR] -> [Help 1]
org.apache.maven.lifecycle.LifecycleExecutionException: Failed to execute goal org.apache.maven.plugins:maven-surefire-plugin:2.20:test
(default-test) on project beam-sdks-java-io-hbase: There are test failures.

Please refer to <https://builds.apache.org/job/beam_PostCommit_Java_JDK_Versions_Test/jdk=OpenJDK%208%20(on%20Ubuntu%20only),label=beam/ws/sdks/java/io/hbase/target/surefire-reports>
for the individual test results.
Please refer to dump files (if any exist) [date]-jvmRun[N].dump, [date].dumpstream and [date]-jvmRun[N].dumpstream.
	at org.apache.maven.lifecycle.internal.MojoExecutor.execute(MojoExecutor.java:212)
	at org.apache.maven.lifecycle.internal.MojoExecutor.execute(MojoExecutor.java:153)
	at org.apache.maven.lifecycle.internal.MojoExecutor.execute(MojoExecutor.java:145)
	at org.apache.maven.lifecycle.internal.LifecycleModuleBuilder.buildProject(LifecycleModuleBuilder.java:116)
	at org.apache.maven.lifecycle.internal.LifecycleModuleBuilder.buildProject(LifecycleModuleBuilder.java:80)
	at org.apache.maven.lifecycle.internal.builder.singlethreaded.SingleThreadedBuilder.build(SingleThreadedBuilder.java:51)
	at org.apache.maven.lifecycle.internal.LifecycleStarter.execute(LifecycleStarter.java:128)
	at org.apache.maven.DefaultMaven.doExecute(DefaultMaven.java:307)
	at org.apache.maven.DefaultMaven.doExecute(DefaultMaven.java:193)
	at org.apache.maven.DefaultMaven.execute(DefaultMaven.java:106)
	at org.apache.maven.cli.MavenCli.execute(MavenCli.java:862)
	at org.apache.maven.cli.MavenCli.doMain(MavenCli.java:286)
	at org.apache.maven.cli.MavenCli.main(MavenCli.java:197)
	at sun.reflect.NativeMethodAccessorImpl.invoke0(Native Method)
	at sun.reflect.NativeMethodAccessorImpl.invoke(NativeMethodAccessorImpl.java:57)
	at sun.reflect.DelegatingMethodAccessorImpl.invoke(DelegatingMethodAccessorImpl.java:43)
	at java.lang.reflect.Method.invoke(Method.java:606)
	at org.codehaus.plexus.classworlds.launcher.Launcher.launchEnhanced(Launcher.java:289)
	at org.codehaus.plexus.classworlds.launcher.Launcher.launch(Launcher.java:229)
	at org.codehaus.plexus.classworlds.launcher.Launcher.mainWithExitCode(Launcher.java:415)
	at org.codehaus.plexus.classworlds.launcher.Launcher.main(Launcher.java:356)
Caused by: org.apache.maven.plugin.MojoFailureException: There are test failures.

Please refer to <https://builds.apache.org/job/beam_PostCommit_Java_JDK_Versions_Test/jdk=OpenJDK%208%20(on%20Ubuntu%20only),label=beam/ws/sdks/java/io/hbase/target/surefire-reports>
for the individual test results.
Please refer to dump files (if any exist) [date]-jvmRun[N].dump, [date].dumpstream and [date]-jvmRun[N].dumpstream.
	at org.apache.maven.plugin.surefire.SurefireHelper.throwException(SurefireHelper.java:204)
	at org.apache.maven.plugin.surefire.SurefireHelper.reportExecution(SurefireHelper.java:98)
	at org.apache.maven.plugin.surefire.SurefirePlugin.handleSummary(SurefirePlugin.java:334)
	at org.apache.maven.plugin.surefire.AbstractSurefireMojo.executeAfterPreconditionsChecked(AbstractSurefireMojo.java:937)
	at org.apache.maven.plugin.surefire.AbstractSurefireMojo.execute(AbstractSurefireMojo.java:785)
	at org.apache.maven.plugin.DefaultBuildPluginManager.executeMojo(DefaultBuildPluginManager.java:134)
	at org.apache.maven.lifecycle.internal.MojoExecutor.execute(MojoExecutor.java:208)
	... 20 more
2017-06-20\T\18:12:11.630 [ERROR] 
2017-06-20\T\18:12:11.630 [ERROR] Re-run Maven using the -X switch to enable full debug logging.
2017-06-20\T\18:12:11.630 [ERROR] 
2017-06-20\T\18:12:11.630 [ERROR] For more information about the errors and possible solutions,
please read the following articles:
2017-06-20\T\18:12:11.630 [ERROR] [Help 1] http://cwiki.apache.org/confluence/display/MAVEN/MojoFailureException
2017-06-20\T\18:12:11.630 [ERROR] 
2017-06-20\T\18:12:11.630 [ERROR] After correcting the problems, you can resume the build
with the command
2017-06-20\T\18:12:11.630 [ERROR]   mvn <goals> -rf :beam-sdks-java-io-hbase
Build step 'Invoke top-level Maven targets' marked build as failure

Mime
View raw message