beam-commits mailing list archives

Site index · List index
Message view « Date » · « Thread »
Top « Date » · « Thread »
From Apache Jenkins Server <jenk...@builds.apache.org>
Subject Build failed in Jenkins: beam_PostCommit_Java_MavenInstall_Windows #116
Date Sat, 10 Jun 2017 12:35:38 GMT
See <https://builds.apache.org/job/beam_PostCommit_Java_MavenInstall_Windows/116/display/redirect>

------------------------------------------
[...truncated 2.64 MB...]
2017-06-10T12:33:51.338 [INFO] Downloaded: https://repo.maven.apache.org/maven2/org/sonatype/gossip/gossip/1.8/gossip-1.8.pom
(12 KB at 1125.6 KB/sec)
2017-06-10T12:33:51.341 [INFO] Downloading: https://repo.maven.apache.org/maven2/org/sonatype/forge/forge-parent/9/forge-parent-9.pom
2017-06-10T12:33:51.351 [INFO] Downloaded: https://repo.maven.apache.org/maven2/org/sonatype/forge/forge-parent/9/forge-parent-9.pom
(13 KB at 1283.4 KB/sec)
2017-06-10T12:33:51.355 [INFO] Downloading: https://repo.maven.apache.org/maven2/org/sonatype/gossip/gossip-core/1.8/gossip-core-1.8.pom
2017-06-10T12:33:51.364 [INFO] Downloaded: https://repo.maven.apache.org/maven2/org/sonatype/gossip/gossip-core/1.8/gossip-core-1.8.pom
(3 KB at 241.4 KB/sec)
2017-06-10T12:33:51.368 [INFO] Downloading: https://repo.maven.apache.org/maven2/org/sonatype/gossip/gossip-bootstrap/1.8/gossip-bootstrap-1.8.pom
2017-06-10T12:33:51.378 [INFO] Downloaded: https://repo.maven.apache.org/maven2/org/sonatype/gossip/gossip-bootstrap/1.8/gossip-bootstrap-1.8.pom
(2 KB at 157.3 KB/sec)
2017-06-10T12:33:51.382 [INFO] Downloading: https://repo.maven.apache.org/maven2/com/google/guava/guava/14.0.1/guava-14.0.1.pom
2017-06-10T12:33:51.392 [INFO] Downloaded: https://repo.maven.apache.org/maven2/com/google/guava/guava/14.0.1/guava-14.0.1.pom
(6 KB at 583.3 KB/sec)
2017-06-10T12:33:51.395 [INFO] Downloading: https://repo.maven.apache.org/maven2/com/google/guava/guava-parent/14.0.1/guava-parent-14.0.1.pom
2017-06-10T12:33:51.403 [INFO] Downloaded: https://repo.maven.apache.org/maven2/com/google/guava/guava-parent/14.0.1/guava-parent-14.0.1.pom
(3 KB at 311.9 KB/sec)
2017-06-10T12:33:51.407 [INFO] Downloading: https://repo.maven.apache.org/maven2/org/codehaus/plexus/plexus-classworlds/2.4.2/plexus-classworlds-2.4.2.pom
2017-06-10T12:33:51.418 [INFO] Downloaded: https://repo.maven.apache.org/maven2/org/codehaus/plexus/plexus-classworlds/2.4.2/plexus-classworlds-2.4.2.pom
(4 KB at 311.5 KB/sec)
2017-06-10T12:33:51.422 [INFO] Downloading: https://repo.maven.apache.org/maven2/org/codehaus/plexus/plexus-interpolation/1.16/plexus-interpolation-1.16.pom
2017-06-10T12:33:51.431 [INFO] Downloaded: https://repo.maven.apache.org/maven2/org/codehaus/plexus/plexus-interpolation/1.16/plexus-interpolation-1.16.pom
(2 KB at 111.4 KB/sec)
2017-06-10T12:33:51.436 [INFO] Downloading: https://repo.maven.apache.org/maven2/org/eclipse/aether/aether-api/0.9.0.M2/aether-api-0.9.0.M2.pom
2017-06-10T12:33:51.443 [INFO] Downloaded: https://repo.maven.apache.org/maven2/org/eclipse/aether/aether-api/0.9.0.M2/aether-api-0.9.0.M2.pom
(2 KB at 242.3 KB/sec)
2017-06-10T12:33:51.448 [INFO] Downloading: https://repo.maven.apache.org/maven2/org/codehaus/gmaven/gmaven-adapter-api/2.0/gmaven-adapter-api-2.0.pom
2017-06-10T12:33:51.457 [INFO] Downloaded: https://repo.maven.apache.org/maven2/org/codehaus/gmaven/gmaven-adapter-api/2.0/gmaven-adapter-api-2.0.pom
(2 KB at 196.0 KB/sec)
2017-06-10T12:33:51.461 [INFO] Downloading: https://repo.maven.apache.org/maven2/org/codehaus/gmaven/gmaven-adapter-impl/2.0/gmaven-adapter-impl-2.0.pom
2017-06-10T12:33:51.469 [INFO] Downloaded: https://repo.maven.apache.org/maven2/org/codehaus/gmaven/gmaven-adapter-impl/2.0/gmaven-adapter-impl-2.0.pom
(3 KB at 331.8 KB/sec)
2017-06-10T12:33:51.474 [INFO] Downloading: https://repo.maven.apache.org/maven2/org/codehaus/groovy/groovy-all/2.1.5/groovy-all-2.1.5.pom
2017-06-10T12:33:51.485 [INFO] Downloaded: https://repo.maven.apache.org/maven2/org/codehaus/groovy/groovy-all/2.1.5/groovy-all-2.1.5.pom
(18 KB at 1601.5 KB/sec)
2017-06-10T12:33:51.489 [INFO] Downloading: https://repo.maven.apache.org/maven2/org/apache/ant/ant/1.8.4/ant-1.8.4.pom
2017-06-10T12:33:51.498 [INFO] Downloaded: https://repo.maven.apache.org/maven2/org/apache/ant/ant/1.8.4/ant-1.8.4.pom
(10 KB at 1047.5 KB/sec)
2017-06-10T12:33:51.502 [INFO] Downloading: https://repo.maven.apache.org/maven2/org/apache/ant/ant-parent/1.8.4/ant-parent-1.8.4.pom
2017-06-10T12:33:51.511 [INFO] Downloaded: https://repo.maven.apache.org/maven2/org/apache/ant/ant-parent/1.8.4/ant-parent-1.8.4.pom
(5 KB at 494.9 KB/sec)
2017-06-10T12:33:51.515 [INFO] Downloading: https://repo.maven.apache.org/maven2/org/apache/ant/ant-launcher/1.8.4/ant-launcher-1.8.4.pom
2017-06-10T12:33:51.525 [INFO] Downloaded: https://repo.maven.apache.org/maven2/org/apache/ant/ant-launcher/1.8.4/ant-launcher-1.8.4.pom
(3 KB at 230.6 KB/sec)
2017-06-10T12:33:51.528 [INFO] Downloading: https://repo.maven.apache.org/maven2/org/fusesource/jansi/jansi/1.11/jansi-1.11.pom
2017-06-10T12:33:51.540 [INFO] Downloaded: https://repo.maven.apache.org/maven2/org/fusesource/jansi/jansi/1.11/jansi-1.11.pom
(4 KB at 293.1 KB/sec)
2017-06-10T12:33:51.543 [INFO] Downloading: https://repo.maven.apache.org/maven2/org/fusesource/jansi/jansi-project/1.11/jansi-project-1.11.pom
2017-06-10T12:33:51.554 [INFO] Downloaded: https://repo.maven.apache.org/maven2/org/fusesource/jansi/jansi-project/1.11/jansi-project-1.11.pom
(12 KB at 1016.2 KB/sec)
2017-06-10T12:33:51.558 [INFO] Downloading: https://repo.maven.apache.org/maven2/org/fusesource/fusesource-pom/1.8/fusesource-pom-1.8.pom
2017-06-10T12:33:51.570 [INFO] Downloaded: https://repo.maven.apache.org/maven2/org/fusesource/fusesource-pom/1.8/fusesource-pom-1.8.pom
(15 KB at 1192.6 KB/sec)
2017-06-10T12:33:51.583 [INFO] Downloading: https://repo.maven.apache.org/maven2/org/sonatype/gossip/gossip-slf4j/1.8/gossip-slf4j-1.8.jar
2017-06-10T12:33:51.583 [INFO] Downloading: https://repo.maven.apache.org/maven2/org/sonatype/gossip/gossip-core/1.8/gossip-core-1.8.jar
2017-06-10T12:33:51.583 [INFO] Downloading: https://repo.maven.apache.org/maven2/org/sonatype/gossip/gossip-bootstrap/1.8/gossip-bootstrap-1.8.jar
2017-06-10T12:33:51.583 [INFO] Downloading: https://repo.maven.apache.org/maven2/com/google/guava/guava/14.0.1/guava-14.0.1.jar
2017-06-10T12:33:51.584 [INFO] Downloading: https://repo.maven.apache.org/maven2/org/codehaus/plexus/plexus-classworlds/2.4.2/plexus-classworlds-2.4.2.jar
2017-06-10T12:33:51.596 [INFO] Downloaded: https://repo.maven.apache.org/maven2/org/sonatype/gossip/gossip-slf4j/1.8/gossip-slf4j-1.8.jar
(5 KB at 294.9 KB/sec)
2017-06-10T12:33:51.596 [INFO] Downloading: https://repo.maven.apache.org/maven2/org/codehaus/plexus/plexus-interpolation/1.16/plexus-interpolation-1.16.jar
2017-06-10T12:33:51.599 [INFO] Downloaded: https://repo.maven.apache.org/maven2/org/sonatype/gossip/gossip-bootstrap/1.8/gossip-bootstrap-1.8.jar
(20 KB at 1205.9 KB/sec)
2017-06-10T12:33:51.599 [INFO] Downloading: https://repo.maven.apache.org/maven2/org/eclipse/aether/aether-api/0.9.0.M2/aether-api-0.9.0.M2.jar
2017-06-10T12:33:51.600 [INFO] Downloaded: https://repo.maven.apache.org/maven2/org/codehaus/plexus/plexus-classworlds/2.4.2/plexus-classworlds-2.4.2.jar
(46 KB at 2698.1 KB/sec)
2017-06-10T12:33:51.600 [INFO] Downloading: https://repo.maven.apache.org/maven2/org/codehaus/gmaven/gmaven-adapter-api/2.0/gmaven-adapter-api-2.0.jar
2017-06-10T12:33:51.611 [INFO] Downloaded: https://repo.maven.apache.org/maven2/org/sonatype/gossip/gossip-core/1.8/gossip-core-1.8.jar
(57 KB at 2016.4 KB/sec)
2017-06-10T12:33:51.611 [INFO] Downloading: https://repo.maven.apache.org/maven2/org/codehaus/gmaven/gmaven-adapter-impl/2.0/gmaven-adapter-impl-2.0.jar
2017-06-10T12:33:51.619 [INFO] Downloaded: https://repo.maven.apache.org/maven2/org/codehaus/plexus/plexus-interpolation/1.16/plexus-interpolation-1.16.jar
(60 KB at 1663.1 KB/sec)
2017-06-10T12:33:51.619 [INFO] Downloading: https://repo.maven.apache.org/maven2/org/codehaus/groovy/groovy-all/2.1.5/groovy-all-2.1.5.jar
2017-06-10T12:33:51.619 [INFO] Downloaded: https://repo.maven.apache.org/maven2/org/codehaus/gmaven/gmaven-adapter-api/2.0/gmaven-adapter-api-2.0.jar
(7 KB at 192.0 KB/sec)
2017-06-10T12:33:51.619 [INFO] Downloading: https://repo.maven.apache.org/maven2/org/apache/ant/ant/1.8.4/ant-1.8.4.jar
2017-06-10T12:33:51.633 [INFO] Downloaded: https://repo.maven.apache.org/maven2/org/codehaus/gmaven/gmaven-adapter-impl/2.0/gmaven-adapter-impl-2.0.jar
(16 KB at 315.9 KB/sec)
2017-06-10T12:33:51.633 [INFO] Downloading: https://repo.maven.apache.org/maven2/org/apache/ant/ant-launcher/1.8.4/ant-launcher-1.8.4.jar
2017-06-10T12:33:51.636 [INFO] Downloaded: https://repo.maven.apache.org/maven2/org/eclipse/aether/aether-api/0.9.0.M2/aether-api-0.9.0.M2.jar
(131 KB at 2468.3 KB/sec)
2017-06-10T12:33:51.636 [INFO] Downloading: https://repo.maven.apache.org/maven2/org/fusesource/jansi/jansi/1.11/jansi-1.11.jar
2017-06-10T12:33:51.664 [INFO] Downloaded: https://repo.maven.apache.org/maven2/org/apache/ant/ant-launcher/1.8.4/ant-launcher-1.8.4.jar
(18 KB at 222.2 KB/sec)
2017-06-10T12:33:51.665 [INFO] Downloaded: https://repo.maven.apache.org/maven2/org/fusesource/jansi/jansi/1.11/jansi-1.11.jar
(112 KB at 1362.6 KB/sec)
2017-06-10T12:33:51.802 [INFO] Downloaded: https://repo.maven.apache.org/maven2/org/apache/ant/ant/1.8.4/ant-1.8.4.jar
(1897 KB at 8658.5 KB/sec)
2017-06-10T12:33:51.811 [INFO] Downloaded: https://repo.maven.apache.org/maven2/com/google/guava/guava/14.0.1/guava-14.0.1.jar
(2138 KB at 9376.4 KB/sec)
2017-06-10T12:33:52.153 [INFO] Downloaded: https://repo.maven.apache.org/maven2/org/codehaus/groovy/groovy-all/2.1.5/groovy-all-2.1.5.jar
(6219 KB at 10909.2 KB/sec)
[JENKINS] Archiving disabled
2017-06-10T12:33:55.331 [INFO]                                                           
             
2017-06-10T12:33:55.331 [INFO] ------------------------------------------------------------------------
2017-06-10T12:33:55.331 [INFO] Skipping Apache Beam :: Parent
2017-06-10T12:33:55.331 [INFO] This project has been banned from the build due to previous
failures.
2017-06-10T12:33:55.331 [INFO] ------------------------------------------------------------------------
[JENKINS] Archiving disabled
[JENKINS] Archiving disabled
[JENKINS] Archiving disabled
[JENKINS] Archiving disabled
[JENKINS] Archiving disabled
[JENKINS] Archiving disabled
[JENKINS] Archiving disabled
[JENKINS] Archiving disabled
[JENKINS] Archiving disabled
[JENKINS] Archiving disabled
[JENKINS] Archiving disabled
[JENKINS] Archiving disabled
[JENKINS] Archiving disabled
[JENKINS] Archiving disabled
[JENKINS] Archiving disabled
[JENKINS] Archiving disabled
[JENKINS] Archiving disabled
[JENKINS] Archiving disabled
[JENKINS] Archiving disabled
[JENKINS] Archiving disabled
[JENKINS] Archiving disabled
[JENKINS] Archiving disabled
[JENKINS] Archiving disabled
[JENKINS] Archiving disabled
[JENKINS] Archiving disabled
[JENKINS] Archiving disabled
[JENKINS] Archiving disabled
[JENKINS] Archiving disabled
[JENKINS] Archiving disabled
[JENKINS] Archiving disabled
[JENKINS] Archiving disabled
[JENKINS] Archiving disabled
[JENKINS] Archiving disabled
[JENKINS] Archiving disabled
[JENKINS] Archiving disabled
[JENKINS] Archiving disabled
[JENKINS] Archiving disabled
[JENKINS] Archiving disabled
[JENKINS] Archiving disabled
[JENKINS] Archiving disabled
[JENKINS] Archiving disabled
[JENKINS] Archiving disabled
[JENKINS] Archiving disabled
[JENKINS] Archiving disabled
[JENKINS] Archiving disabled
[JENKINS] Archiving disabled
[JENKINS] Archiving disabled
[JENKINS] Archiving disabled
[JENKINS] Archiving disabled
[JENKINS] Archiving disabled
2017-06-10T12:34:58.816 [INFO] ------------------------------------------------------------------------
2017-06-10T12:34:58.816 [INFO] Reactor Summary:
2017-06-10T12:34:58.816 [INFO] 
2017-06-10T12:34:58.817 [INFO] Apache Beam :: Parent .............................. SUCCESS
[ 31.635 s]
2017-06-10T12:34:58.817 [INFO] Apache Beam :: SDKs :: Java :: Build Tools ......... SUCCESS
[ 18.211 s]
2017-06-10T12:34:58.817 [INFO] Apache Beam :: SDKs ................................ SUCCESS
[  9.226 s]
2017-06-10T12:34:58.817 [INFO] Apache Beam :: SDKs :: Common ...................... SUCCESS
[  6.575 s]
2017-06-10T12:34:58.817 [INFO] Apache Beam :: SDKs :: Common :: Runner API ........ SUCCESS
[ 28.418 s]
2017-06-10T12:34:58.817 [INFO] Apache Beam :: SDKs :: Common :: Fn API ............ SUCCESS
[ 24.152 s]
2017-06-10T12:34:58.817 [INFO] Apache Beam :: SDKs :: Java ........................ SUCCESS
[  5.615 s]
2017-06-10T12:34:58.817 [INFO] Apache Beam :: SDKs :: Java :: Core ................ SUCCESS
[04:16 min]
2017-06-10T12:34:58.817 [INFO] Apache Beam :: Runners ............................. SUCCESS
[  6.436 s]
2017-06-10T12:34:58.817 [INFO] Apache Beam :: Runners :: Core Construction Java ... SUCCESS
[ 49.544 s]
2017-06-10T12:34:58.817 [INFO] Apache Beam :: Runners :: Core Java ................ SUCCESS
[01:10 min]
2017-06-10T12:34:58.817 [INFO] Apache Beam :: Runners :: Direct Java .............. SUCCESS
[03:30 min]
2017-06-10T12:34:58.817 [INFO] Apache Beam :: SDKs :: Java :: IO .................. SUCCESS
[  7.120 s]
2017-06-10T12:34:58.818 [INFO] Apache Beam :: SDKs :: Java :: IO :: Common ........ SUCCESS
[ 11.036 s]
2017-06-10T12:34:58.818 [INFO] Apache Beam :: SDKs :: Java :: IO :: Cassandra ..... SUCCESS
[ 39.562 s]
2017-06-10T12:34:58.818 [INFO] Apache Beam :: SDKs :: Java :: IO :: Elasticsearch . SUCCESS
[ 55.200 s]
2017-06-10T12:34:58.818 [INFO] Apache Beam :: SDKs :: Java :: Extensions .......... SUCCESS
[  5.814 s]
2017-06-10T12:34:58.818 [INFO] Apache Beam :: SDKs :: Java :: Extensions :: Google Cloud Platform
Core SUCCESS [ 54.574 s]
2017-06-10T12:34:58.819 [INFO] Apache Beam :: SDKs :: Java :: Extensions :: Protobuf SUCCESS
[ 30.457 s]
2017-06-10T12:34:58.819 [INFO] Apache Beam :: SDKs :: Java :: IO :: Google Cloud Platform
SUCCESS [01:32 min]
2017-06-10T12:34:58.819 [INFO] Apache Beam :: SDKs :: Java :: IO :: Hadoop Common . SUCCESS
[ 32.725 s]
2017-06-10T12:34:58.819 [INFO] Apache Beam :: SDKs :: Java :: IO :: Hadoop File System SUCCESS
[ 40.401 s]
2017-06-10T12:34:58.819 [INFO] Apache Beam :: SDKs :: Java :: IO :: Hadoop ........ SUCCESS
[  8.689 s]
2017-06-10T12:34:58.819 [INFO] Apache Beam :: SDKs :: Java :: IO :: Hadoop :: input-format
SUCCESS [ 34.602 s]
2017-06-10T12:34:58.819 [INFO] Apache Beam :: SDKs :: Java :: IO :: Hadoop :: jdk1.8-tests
SUCCESS [01:40 min]
2017-06-10T12:34:58.819 [INFO] Apache Beam :: SDKs :: Java :: IO :: HBase ......... SUCCESS
[ 43.200 s]
2017-06-10T12:34:58.819 [INFO] Apache Beam :: SDKs :: Java :: IO :: HCatalog ...... SUCCESS
[01:01 min]
2017-06-10T12:34:58.819 [INFO] Apache Beam :: SDKs :: Java :: IO :: JDBC .......... SUCCESS
[ 38.256 s]
2017-06-10T12:34:58.819 [INFO] Apache Beam :: SDKs :: Java :: IO :: JMS ........... SUCCESS
[ 34.646 s]
2017-06-10T12:34:58.819 [INFO] Apache Beam :: SDKs :: Java :: IO :: Kafka ......... SUCCESS
[ 44.865 s]
2017-06-10T12:34:58.819 [INFO] Apache Beam :: SDKs :: Java :: IO :: Kinesis ....... SUCCESS
[ 36.894 s]
2017-06-10T12:34:58.819 [INFO] Apache Beam :: SDKs :: Java :: IO :: MongoDB ....... SUCCESS
[ 47.601 s]
2017-06-10T12:34:58.819 [INFO] Apache Beam :: SDKs :: Java :: IO :: MQTT .......... SUCCESS
[ 33.417 s]
2017-06-10T12:34:58.819 [INFO] Apache Beam :: SDKs :: Java :: IO :: XML ........... SUCCESS
[ 29.372 s]
2017-06-10T12:34:58.820 [INFO] Apache Beam :: SDKs :: Java :: Maven Archetypes .... SUCCESS
[  5.295 s]
2017-06-10T12:34:58.820 [INFO] Apache Beam :: SDKs :: Java :: Maven Archetypes :: Starter
SUCCESS [ 24.907 s]
2017-06-10T12:34:58.820 [INFO] Apache Beam :: SDKs :: Java :: Extensions :: Jackson SUCCESS
[ 26.779 s]
2017-06-10T12:34:58.820 [INFO] Apache Beam :: SDKs :: Java :: Extensions :: Join library SUCCESS
[ 30.149 s]
2017-06-10T12:34:58.820 [INFO] Apache Beam :: SDKs :: Java :: Extensions :: Sorter  SUCCESS
[ 36.154 s]
2017-06-10T12:34:58.820 [INFO] Apache Beam :: Runners :: Google Cloud Dataflow .... SUCCESS
[ 52.424 s]
2017-06-10T12:34:58.820 [INFO] Apache Beam :: SDKs :: Java :: Harness ............. SUCCESS
[ 55.764 s]
2017-06-10T12:34:58.820 [INFO] Apache Beam :: SDKs :: Java :: Java 8 Tests ........ SUCCESS
[ 22.901 s]
2017-06-10T12:34:58.820 [INFO] Apache Beam :: SDKs :: Python ...................... FAILURE
[  3.946 s]
2017-06-10T12:34:58.820 [INFO] Apache Beam :: Runners :: Flink .................... SKIPPED
2017-06-10T12:34:58.820 [INFO] Apache Beam :: Runners :: Spark .................... SKIPPED
2017-06-10T12:34:58.820 [INFO] Apache Beam :: Runners :: Apex ..................... SKIPPED
2017-06-10T12:34:58.820 [INFO] Apache Beam :: Examples ............................ SKIPPED
2017-06-10T12:34:58.820 [INFO] Apache Beam :: Examples :: Java .................... SKIPPED
2017-06-10T12:34:58.820 [INFO] Apache Beam :: Examples :: Java 8 .................. SKIPPED
2017-06-10T12:34:58.820 [INFO] Apache Beam :: SDKs :: Java :: Aggregated Javadoc .. SKIPPED
2017-06-10T12:34:58.820 [INFO] ------------------------------------------------------------------------
2017-06-10T12:34:58.820 [INFO] BUILD FAILURE
2017-06-10T12:34:58.820 [INFO] ------------------------------------------------------------------------
2017-06-10T12:34:58.820 [INFO] Total time: 34:06 min
2017-06-10T12:34:58.821 [INFO] Finished at: 2017-06-10T12:34:58+00:00
2017-06-10T12:35:00.074 [INFO] Final Memory: 326M/2703M
2017-06-10T12:35:00.074 [INFO] ------------------------------------------------------------------------
Waiting for Jenkins to finish collecting data
2017-06-10T12:35:03.090 [ERROR] Failed to execute goal org.codehaus.gmaven:groovy-maven-plugin:2.0:execute
(find-supported-python-for-clean) on project beam-sdks-python: Unable to find Python 2.7 in
path -> [Help 1]
org.apache.maven.lifecycle.LifecycleExecutionException: Failed to execute goal org.codehaus.gmaven:groovy-maven-plugin:2.0:execute
(find-supported-python-for-clean) on project beam-sdks-python: Unable to find Python 2.7 in
path
	at org.apache.maven.lifecycle.internal.MojoExecutor.execute(MojoExecutor.java:212)
	at org.apache.maven.lifecycle.internal.MojoExecutor.execute(MojoExecutor.java:153)
	at org.apache.maven.lifecycle.internal.MojoExecutor.execute(MojoExecutor.java:145)
	at org.apache.maven.lifecycle.internal.LifecycleModuleBuilder.buildProject(LifecycleModuleBuilder.java:116)
	at org.apache.maven.lifecycle.internal.LifecycleModuleBuilder.buildProject(LifecycleModuleBuilder.java:80)
	at org.apache.maven.lifecycle.internal.builder.singlethreaded.SingleThreadedBuilder.build(SingleThreadedBuilder.java:51)
	at org.apache.maven.lifecycle.internal.LifecycleStarter.execute(LifecycleStarter.java:128)
	at org.apache.maven.DefaultMaven.doExecute(DefaultMaven.java:307)
	at org.apache.maven.DefaultMaven.doExecute(DefaultMaven.java:193)
	at org.apache.maven.DefaultMaven.execute(DefaultMaven.java:106)
	at org.jvnet.hudson.maven3.launcher.Maven33Launcher.main(Maven33Launcher.java:129)
	at sun.reflect.NativeMethodAccessorImpl.invoke0(Native Method)
	at sun.reflect.NativeMethodAccessorImpl.invoke(NativeMethodAccessorImpl.java:62)
	at sun.reflect.DelegatingMethodAccessorImpl.invoke(DelegatingMethodAccessorImpl.java:43)
	at java.lang.reflect.Method.invoke(Method.java:498)
	at org.codehaus.plexus.classworlds.launcher.Launcher.launchStandard(Launcher.java:330)
	at org.codehaus.plexus.classworlds.launcher.Launcher.launch(Launcher.java:238)
	at jenkins.maven3.agent.Maven33Main.launch(Maven33Main.java:176)
	at sun.reflect.NativeMethodAccessorImpl.invoke0(Native Method)
	at sun.reflect.NativeMethodAccessorImpl.invoke(NativeMethodAccessorImpl.java:62)
	at sun.reflect.DelegatingMethodAccessorImpl.invoke(DelegatingMethodAccessorImpl.java:43)
	at java.lang.reflect.Method.invoke(Method.java:498)
	at hudson.maven.Maven3Builder.call(Maven3Builder.java:139)
	at hudson.maven.Maven3Builder.call(Maven3Builder.java:70)
	at hudson.remoting.UserRequest.perform(UserRequest.java:120)
	at hudson.remoting.UserRequest.perform(UserRequest.java:48)
	at hudson.remoting.Request$2.run(Request.java:326)
	at hudson.remoting.InterceptingExecutorService$1.call(InterceptingExecutorService.java:68)
	at java.util.concurrent.FutureTask.run(FutureTask.java:266)
	at java.util.concurrent.ThreadPoolExecutor.runWorker(ThreadPoolExecutor.java:1142)
	at java.util.concurrent.ThreadPoolExecutor$Worker.run(ThreadPoolExecutor.java:617)
	at java.lang.Thread.run(Thread.java:745)
Caused by: org.apache.maven.plugin.MojoFailureException: Unable to find Python 2.7 in path
	at sun.reflect.NativeConstructorAccessorImpl.newInstance0(Native Method)
	at sun.reflect.NativeConstructorAccessorImpl.newInstance(NativeConstructorAccessorImpl.java:62)
	at sun.reflect.DelegatingConstructorAccessorImpl.newInstance(DelegatingConstructorAccessorImpl.java:45)
	at java.lang.reflect.Constructor.newInstance(Constructor.java:423)
	at org.codehaus.groovy.reflection.CachedConstructor.invoke(CachedConstructor.java:77)
	at org.codehaus.groovy.runtime.callsite.ConstructorSite$ConstructorSiteNoUnwrapNoCoerce.callConstructor(ConstructorSite.java:102)
	at org.codehaus.groovy.runtime.callsite.CallSiteArray.defaultCallConstructor(CallSiteArray.java:57)
	at org.codehaus.groovy.runtime.callsite.AbstractCallSite.callConstructor(AbstractCallSite.java:182)
	at org.codehaus.groovy.runtime.callsite.AbstractCallSite.callConstructor(AbstractCallSite.java:190)
	at findSupportedPython.run(findSupportedPython.groovy:70)
	at groovy.lang.GroovyShell.evaluate(GroovyShell.java:518)
	at org.codehaus.gmaven.adapter.impl.ScriptExecutorImpl.execute(ScriptExecutorImpl.java:80)
	at org.codehaus.gmaven.plugin.ExecuteMojo$1.run(ExecuteMojo.java:100)
	at org.codehaus.gmaven.plugin.util.SystemNoExitGuard.run(SystemNoExitGuard.java:45)
	at org.codehaus.gmaven.plugin.ExecuteMojo.run(ExecuteMojo.java:96)
	at org.codehaus.gmaven.plugin.MojoSupport.execute(MojoSupport.java:45)
	at org.apache.maven.plugin.DefaultBuildPluginManager.executeMojo(DefaultBuildPluginManager.java:134)
	at org.apache.maven.lifecycle.internal.MojoExecutor.execute(MojoExecutor.java:208)
	... 31 more
2017-06-10T12:35:03.092 [ERROR] 
2017-06-10T12:35:03.092 [ERROR] Re-run Maven using the -X switch to enable full debug logging.
2017-06-10T12:35:03.092 [ERROR] 
2017-06-10T12:35:03.092 [ERROR] For more information about the errors and possible solutions,
please read the following articles:
2017-06-10T12:35:03.092 [ERROR] [Help 1] http://cwiki.apache.org/confluence/display/MAVEN/MojoFailureException
2017-06-10T12:35:03.093 [ERROR] 
2017-06-10T12:35:03.093 [ERROR] After correcting the problems, you can resume the build with
the command
2017-06-10T12:35:03.093 [ERROR]   mvn <goals> -rf :beam-sdks-python
channel stopped
Not sending mail to unregistered user github@nakomis.com
Not sending mail to unregistered user ccy@google.com
Not sending mail to unregistered user mingmxu@ebay.com
Not sending mail to unregistered user kirpichov@google.com
Not sending mail to unregistered user aljoscha.krettek@gmail.com
Not sending mail to unregistered user klk@google.com
Not sending mail to unregistered user sourabhbajaj@google.com
Not sending mail to unregistered user hepei.hp@alibaba-inc.com

Mime
View raw message