beam-commits mailing list archives

Site index · List index
Message view « Date » · « Thread »
Top « Date » · « Thread »
From Apache Jenkins Server <jenk...@builds.apache.org>
Subject Build failed in Jenkins: beam_PostCommit_Java_JDK_Versions_Test » OpenJDK 7 (on Ubuntu only),beam #61
Date Thu, 08 Jun 2017 18:09:38 GMT
See <https://builds.apache.org/job/beam_PostCommit_Java_JDK_Versions_Test/jdk=OpenJDK%207%20(on%20Ubuntu%20only),label=beam/61/display/redirect?page=changes>

Changes:

[tgroh] Expand all PValues to component PCollections always

[lcwik] Avoid flakiness in data channel for empty streams.

[altay] Refine Python DirectRunner watermark advancement behavior

[altay] Raise entity limit per RPC to 9MB.

------------------------------------------
[...truncated 520.65 KB...]
2017-06-08\T\18:07:23.474 [INFO] Running org.apache.beam.sdk.transforms.SampleTest$PickAnyTest
2017-06-08\T\18:07:24.715 [INFO] Tests run: 8, Failures: 0, Errors: 0, Skipped: 0, Time elapsed:
1.239 s - in org.apache.beam.sdk.transforms.SampleTest$PickAnyTest
2017-06-08\T\18:07:24.721 [INFO] Running org.apache.beam.sdk.transforms.SampleTest$MiscTest
2017-06-08\T\18:07:25.712 [INFO] Tests run: 5, Failures: 0, Errors: 0, Skipped: 0, Time elapsed:
0.989 s - in org.apache.beam.sdk.transforms.SampleTest$MiscTest
2017-06-08\T\18:07:25.712 [INFO] Running org.apache.beam.sdk.transforms.WithKeysTest
2017-06-08\T\18:07:26.122 [INFO] Tests run: 3, Failures: 0, Errors: 0, Skipped: 0, Time elapsed:
0.409 s - in org.apache.beam.sdk.transforms.WithKeysTest
2017-06-08\T\18:07:26.123 [INFO] Running org.apache.beam.sdk.transforms.ToStringTest
2017-06-08\T\18:07:26.669 [INFO] Tests run: 5, Failures: 0, Errors: 0, Skipped: 0, Time elapsed:
0.544 s - in org.apache.beam.sdk.transforms.ToStringTest
2017-06-08\T\18:07:26.669 [INFO] Running org.apache.beam.sdk.transforms.ReshuffleTest
2017-06-08\T\18:07:28.044 [INFO] Tests run: 8, Failures: 0, Errors: 0, Skipped: 0, Time elapsed:
1.373 s - in org.apache.beam.sdk.transforms.ReshuffleTest
2017-06-08\T\18:07:28.044 [INFO] Running org.apache.beam.sdk.transforms.ViewTest
2017-06-08\T\18:07:33.396 [INFO] Tests run: 37, Failures: 0, Errors: 0, Skipped: 0, Time elapsed:
5.35 s - in org.apache.beam.sdk.transforms.ViewTest
2017-06-08\T\18:07:33.396 [INFO] Running org.apache.beam.sdk.transforms.CombineFnsTest
2017-06-08\T\18:07:33.958 [INFO] Tests run: 3, Failures: 0, Errors: 0, Skipped: 0, Time elapsed:
0.561 s - in org.apache.beam.sdk.transforms.CombineFnsTest
2017-06-08\T\18:07:33.958 [INFO] Running org.apache.beam.sdk.transforms.GroupIntoBatchesTest
2017-06-08\T\18:07:34.565 [INFO] Tests run: 2, Failures: 0, Errors: 0, Skipped: 0, Time elapsed:
0.605 s - in org.apache.beam.sdk.transforms.GroupIntoBatchesTest
2017-06-08\T\18:07:34.565 [INFO] Running org.apache.beam.sdk.transforms.ParDoLifecycleTest
2017-06-08\T\18:07:34.972 [INFO] Tests run: 12, Failures: 0, Errors: 0, Skipped: 0, Time elapsed:
0.405 s - in org.apache.beam.sdk.transforms.ParDoLifecycleTest
2017-06-08\T\18:07:34.972 [INFO] Running org.apache.beam.sdk.transforms.ApproximateQuantilesTest
2017-06-08\T\18:07:35.445 [INFO] Tests run: 4, Failures: 0, Errors: 0, Skipped: 0, Time elapsed:
0.471 s - in org.apache.beam.sdk.transforms.ApproximateQuantilesTest
2017-06-08\T\18:07:35.445 [INFO] Running org.apache.beam.sdk.transforms.join.CoGroupByKeyTest
2017-06-08\T\18:07:36.025 [INFO] Tests run: 4, Failures: 0, Errors: 0, Skipped: 0, Time elapsed:
0.579 s - in org.apache.beam.sdk.transforms.join.CoGroupByKeyTest
2017-06-08\T\18:07:36.025 [INFO] Running org.apache.beam.sdk.transforms.PartitionTest
2017-06-08\T\18:07:36.391 [INFO] Tests run: 4, Failures: 0, Errors: 0, Skipped: 0, Time elapsed:
0.365 s - in org.apache.beam.sdk.transforms.PartitionTest
2017-06-08\T\18:07:36.391 [INFO] Running org.apache.beam.sdk.transforms.ReifyTimestampsTest
2017-06-08\T\18:07:36.673 [INFO] Tests run: 3, Failures: 0, Errors: 0, Skipped: 0, Time elapsed:
0.28 s - in org.apache.beam.sdk.transforms.ReifyTimestampsTest
2017-06-08\T\18:07:36.673 [INFO] Running org.apache.beam.sdk.transforms.DistinctTest
2017-06-08\T\18:07:37.243 [INFO] Tests run: 6, Failures: 0, Errors: 0, Skipped: 0, Time elapsed:
0.569 s - in org.apache.beam.sdk.transforms.DistinctTest
2017-06-08\T\18:07:37.244 [INFO] Running org.apache.beam.sdk.transforms.KvSwapTest
2017-06-08\T\18:07:37.514 [INFO] Tests run: 2, Failures: 0, Errors: 0, Skipped: 0, Time elapsed:
0.269 s - in org.apache.beam.sdk.transforms.KvSwapTest
2017-06-08\T\18:07:37.514 [INFO] Running org.apache.beam.sdk.options.ProxyInvocationHandlerTest
2017-06-08\T\18:07:37.569 [INFO] Tests run: 1, Failures: 0, Errors: 0, Skipped: 0, Time elapsed:
0.054 s - in org.apache.beam.sdk.options.ProxyInvocationHandlerTest
2017-06-08\T\18:07:37.570 [INFO] Running org.apache.beam.sdk.io.CountingSourceTest
2017-06-08\T\18:07:52.368 [INFO] Tests run: 8, Failures: 0, Errors: 0, Skipped: 0, Time elapsed:
14.796 s - in org.apache.beam.sdk.io.CountingSourceTest
2017-06-08\T\18:07:52.368 [INFO] Running org.apache.beam.sdk.io.GenerateSequenceTest
2017-06-08\T\18:08:01.412 [INFO] Tests run: 6, Failures: 0, Errors: 0, Skipped: 0, Time elapsed:
9.042 s - in org.apache.beam.sdk.io.GenerateSequenceTest
2017-06-08\T\18:08:01.412 [INFO] Running org.apache.beam.sdk.io.CompressedSourceTest
2017-06-08\T\18:08:28.464 [INFO] Tests run: 15, Failures: 0, Errors: 0, Skipped: 0, Time elapsed:
27.05 s - in org.apache.beam.sdk.io.CompressedSourceTest
2017-06-08\T\18:08:28.464 [INFO] Running org.apache.beam.sdk.io.AvroIOTest
2017-06-08\T\18:08:30.777 [ERROR] Tests run: 9, Failures: 1, Errors: 0, Skipped: 0, Time elapsed:
2.305 s <<< FAILURE! - in org.apache.beam.sdk.io.AvroIOTest
2017-06-08\T\18:08:30.777 [ERROR] testAvroIOWriteAndReadASingleFile(org.apache.beam.sdk.io.AvroIOTest)
 Time elapsed: 0.417 s  <<< FAILURE!
java.lang.AssertionError: 
AvroIO.Write/Write/AvroIO.Read/Read.out: 
Expected: iterable over [<GenericClass{intField=3, stringField=hi}>, <GenericClass{intField=5,
stringField=bar}>] in any order
     but: No item matches: <GenericClass{intField=3, stringField=hi}>, <GenericClass{intField=5,
stringField=bar}> in []
	at org.apache.beam.sdk.testing.PAssert$PAssertionSite.capture(PAssert.java:170)
	at org.apache.beam.sdk.testing.PAssert.that(PAssert.java:366)
	at org.apache.beam.sdk.testing.PAssert.that(PAssert.java:358)
	at org.apache.beam.sdk.io.AvroIOTest.testAvroIOWriteAndReadASingleFile(AvroIOTest.java:155)
	at sun.reflect.NativeMethodAccessorImpl.invoke0(Native Method)
	at sun.reflect.NativeMethodAccessorImpl.invoke(NativeMethodAccessorImpl.java:57)
	at sun.reflect.DelegatingMethodAccessorImpl.invoke(DelegatingMethodAccessorImpl.java:43)
	at java.lang.reflect.Method.invoke(Method.java:606)
	at org.junit.runners.model.FrameworkMethod$1.runReflectiveCall(FrameworkMethod.java:50)
	at org.junit.internal.runners.model.ReflectiveCallable.run(ReflectiveCallable.java:12)
	at org.junit.runners.model.FrameworkMethod.invokeExplosively(FrameworkMethod.java:47)
	at org.junit.internal.runners.statements.InvokeMethod.evaluate(InvokeMethod.java:17)
	at org.junit.rules.ExpectedException$ExpectedExceptionStatement.evaluate(ExpectedException.java:239)
	at org.apache.beam.sdk.testing.TestPipeline$1.evaluate(TestPipeline.java:321)
	at org.junit.rules.ExternalResource$1.evaluate(ExternalResource.java:48)
	at org.apache.beam.sdk.testing.TestPipeline$1.evaluate(TestPipeline.java:321)
	at org.junit.rules.RunRules.evaluate(RunRules.java:20)
	at org.junit.runners.ParentRunner.runLeaf(ParentRunner.java:325)
	at org.junit.runners.BlockJUnit4ClassRunner.runChild(BlockJUnit4ClassRunner.java:78)
	at org.junit.runners.BlockJUnit4ClassRunner.runChild(BlockJUnit4ClassRunner.java:57)
	at org.junit.runners.ParentRunner$3.run(ParentRunner.java:290)
	at org.junit.runners.ParentRunner$1.schedule(ParentRunner.java:71)
	at org.junit.runners.ParentRunner.runChildren(ParentRunner.java:288)
	at org.junit.runners.ParentRunner.access$000(ParentRunner.java:58)
	at org.junit.runners.ParentRunner$2.evaluate(ParentRunner.java:268)
	at org.junit.runners.ParentRunner.run(ParentRunner.java:363)
	at org.junit.runners.Suite.runChild(Suite.java:128)
	at org.junit.runners.Suite.runChild(Suite.java:27)
	at org.junit.runners.ParentRunner$3.run(ParentRunner.java:290)
	at org.junit.runners.ParentRunner$1.schedule(ParentRunner.java:71)
	at org.junit.runners.ParentRunner.runChildren(ParentRunner.java:288)
	at org.junit.runners.ParentRunner.access$000(ParentRunner.java:58)
	at org.junit.runners.ParentRunner$2.evaluate(ParentRunner.java:268)
	at org.junit.runners.ParentRunner.run(ParentRunner.java:363)
	at org.apache.maven.surefire.junitcore.JUnitCore.run(JUnitCore.java:55)
	at org.apache.maven.surefire.junitcore.JUnitCoreWrapper.createRequestAndRun(JUnitCoreWrapper.java:137)
	at org.apache.maven.surefire.junitcore.JUnitCoreWrapper.executeEager(JUnitCoreWrapper.java:107)
	at org.apache.maven.surefire.junitcore.JUnitCoreWrapper.execute(JUnitCoreWrapper.java:83)
	at org.apache.maven.surefire.junitcore.JUnitCoreWrapper.execute(JUnitCoreWrapper.java:75)
	at org.apache.maven.surefire.junitcore.JUnitCoreProvider.invoke(JUnitCoreProvider.java:157)
	at org.apache.maven.surefire.booter.ForkedBooter.invokeProviderInSameClassLoader(ForkedBooter.java:386)
	at org.apache.maven.surefire.booter.ForkedBooter.runSuitesInProcess(ForkedBooter.java:323)
	at org.apache.maven.surefire.booter.ForkedBooter.main(ForkedBooter.java:143)

2017-06-08\T\18:08:30.778 [INFO] Running org.apache.beam.sdk.io.TextIOTest
2017-06-08\T\18:08:38.909 [INFO] Tests run: 22, Failures: 0, Errors: 0, Skipped: 0, Time elapsed:
8.129 s - in org.apache.beam.sdk.io.TextIOTest
2017-06-08\T\18:08:38.909 [INFO] Running org.apache.beam.sdk.coders.AvroCoderTest
2017-06-08\T\18:08:39.040 [INFO] Tests run: 1, Failures: 0, Errors: 0, Skipped: 0, Time elapsed:
0.13 s - in org.apache.beam.sdk.coders.AvroCoderTest
2017-06-08\T\18:08:39.040 [INFO] Running org.apache.beam.sdk.transforms.WithTimestampsTest
2017-06-08\T\18:08:39.403 [INFO] Tests run: 5, Failures: 0, Errors: 0, Skipped: 0, Time elapsed:
0.361 s - in org.apache.beam.sdk.transforms.WithTimestampsTest
2017-06-08\T\18:08:39.403 [INFO] Running org.apache.beam.sdk.transforms.FlatMapElementsTest
2017-06-08\T\18:08:39.578 [INFO] Tests run: 3, Failures: 0, Errors: 0, Skipped: 0, Time elapsed:
0.174 s - in org.apache.beam.sdk.transforms.FlatMapElementsTest
2017-06-08\T\18:08:39.578 [INFO] Running org.apache.beam.sdk.transforms.GroupByKeyTest
2017-06-08\T\18:09:01.270 [INFO] Tests run: 13, Failures: 0, Errors: 0, Skipped: 0, Time elapsed:
21.691 s - in org.apache.beam.sdk.transforms.GroupByKeyTest
2017-06-08\T\18:09:01.270 [INFO] Running org.apache.beam.sdk.transforms.FilterTest
2017-06-08\T\18:09:02.311 [INFO] Tests run: 8, Failures: 0, Errors: 0, Skipped: 0, Time elapsed:
1.04 s - in org.apache.beam.sdk.transforms.FilterTest
2017-06-08\T\18:09:02.312 [INFO] Running org.apache.beam.sdk.transforms.windowing.WindowTest
2017-06-08\T\18:09:02.786 [INFO] Tests run: 4, Failures: 0, Errors: 0, Skipped: 0, Time elapsed:
0.473 s - in org.apache.beam.sdk.transforms.windowing.WindowTest
2017-06-08\T\18:09:02.787 [INFO] Running org.apache.beam.sdk.transforms.SplittableDoFnTest
2017-06-08\T\18:09:06.328 [INFO] Tests run: 8, Failures: 0, Errors: 0, Skipped: 0, Time elapsed:
3.539 s - in org.apache.beam.sdk.transforms.SplittableDoFnTest
2017-06-08\T\18:09:06.328 [INFO] Running org.apache.beam.sdk.transforms.ParDoTest
2017-06-08\T\18:09:15.117 [INFO] Tests run: 63, Failures: 0, Errors: 0, Skipped: 0, Time elapsed:
8.786 s - in org.apache.beam.sdk.transforms.ParDoTest
2017-06-08\T\18:09:15.117 [INFO] Running org.apache.beam.sdk.values.PDoneTest
2017-06-08\T\18:09:15.287 [WARNING] Tests run: 2, Failures: 0, Errors: 0, Skipped: 1, Time
elapsed: 0.169 s - in org.apache.beam.sdk.values.PDoneTest
2017-06-08\T\18:09:15.287 [INFO] Running org.apache.beam.sdk.io.AvroIOTransformTest$AvroIOReadTransformTest
2017-06-08\T\18:09:15.887 [INFO] Tests run: 6, Failures: 0, Errors: 0, Skipped: 0, Time elapsed:
0.598 s - in org.apache.beam.sdk.io.AvroIOTransformTest$AvroIOReadTransformTest
2017-06-08\T\18:09:15.887 [INFO] Running org.apache.beam.sdk.io.AvroIOTransformTest$AvroIOWriteTransformTest
2017-06-08\T\18:09:16.177 [INFO] Tests run: 3, Failures: 0, Errors: 0, Skipped: 0, Time elapsed:
0.289 s - in org.apache.beam.sdk.io.AvroIOTransformTest$AvroIOWriteTransformTest
2017-06-08\T\18:09:16.177 [INFO] Running org.apache.beam.sdk.io.WriteFilesTest
2017-06-08\T\18:09:17.901 [INFO] Tests run: 8, Failures: 0, Errors: 0, Skipped: 0, Time elapsed:
1.723 s - in org.apache.beam.sdk.io.WriteFilesTest
2017-06-08\T\18:09:17.901 [INFO] Running org.apache.beam.sdk.io.FileBasedSourceTest
2017-06-08\T\18:09:18.242 [INFO] Tests run: 2, Failures: 0, Errors: 0, Skipped: 0, Time elapsed:
0.34 s - in org.apache.beam.sdk.io.FileBasedSourceTest
2017-06-08\T\18:09:18.243 [INFO] Running org.apache.beam.sdk.io.ReadTest
2017-06-08\T\18:09:18.263 [INFO] Tests run: 2, Failures: 0, Errors: 0, Skipped: 0, Time elapsed:
0.019 s - in org.apache.beam.sdk.io.ReadTest
2017-06-08\T\18:09:18.263 [INFO] Running org.apache.beam.sdk.coders.CoderRegistryTest
2017-06-08\T\18:09:18.383 [INFO] Tests run: 2, Failures: 0, Errors: 0, Skipped: 0, Time elapsed:
0.119 s - in org.apache.beam.sdk.coders.CoderRegistryTest
2017-06-08\T\18:09:18.383 [INFO] Running org.apache.beam.sdk.transforms.FlattenTest
2017-06-08\T\18:09:19.644 [INFO] Tests run: 16, Failures: 0, Errors: 0, Skipped: 0, Time elapsed:
1.259 s - in org.apache.beam.sdk.transforms.FlattenTest
2017-06-08\T\18:09:19.644 [INFO] Running org.apache.beam.sdk.transforms.windowing.WindowingTest
2017-06-08\T\18:09:20.220 [INFO] Tests run: 6, Failures: 0, Errors: 0, Skipped: 0, Time elapsed:
0.575 s - in org.apache.beam.sdk.transforms.windowing.WindowingTest
2017-06-08\T\18:09:20.220 [INFO] Running org.apache.beam.sdk.transforms.ValuesTest
2017-06-08\T\18:09:20.370 [INFO] Tests run: 2, Failures: 0, Errors: 0, Skipped: 0, Time elapsed:
0.149 s - in org.apache.beam.sdk.transforms.ValuesTest
2017-06-08\T\18:09:20.370 [INFO] Running org.apache.beam.sdk.transforms.RegexTest
2017-06-08\T\18:09:22.571 [INFO] Tests run: 27, Failures: 0, Errors: 0, Skipped: 0, Time elapsed:
2.199 s - in org.apache.beam.sdk.transforms.RegexTest
2017-06-08\T\18:09:22.571 [INFO] Running org.apache.beam.sdk.transforms.CreateTest
2017-06-08\T\18:09:23.356 [INFO] Tests run: 10, Failures: 0, Errors: 0, Skipped: 0, Time elapsed:
0.784 s - in org.apache.beam.sdk.transforms.CreateTest
2017-06-08\T\18:09:23.357 [INFO] Running org.apache.beam.sdk.transforms.CombineTest
2017-06-08\T\18:09:26.332 [INFO] Tests run: 22, Failures: 0, Errors: 0, Skipped: 0, Time elapsed:
2.973 s - in org.apache.beam.sdk.transforms.CombineTest
2017-06-08\T\18:09:26.803 [INFO] 
2017-06-08\T\18:09:26.803 [INFO] Results:
2017-06-08\T\18:09:26.803 [INFO] 
2017-06-08\T\18:09:26.803 [ERROR] Failures: 
2017-06-08\T\18:09:26.803 [ERROR]   AvroIOTest.testAvroIOWriteAndReadASingleFile:155 AvroIO.Write/Write/AvroIO.Read/Read.out:

Expected: iterable over [<GenericClass{intField=3, stringField=hi}>, <GenericClass{intField=5,
stringField=bar}>] in any order
     but: No item matches: <GenericClass{intField=3, stringField=hi}>, <GenericClass{intField=5,
stringField=bar}> in []
2017-06-08\T\18:09:26.803 [INFO] 
2017-06-08\T\18:09:26.803 [ERROR] Tests run: 483, Failures: 1, Errors: 0, Skipped: 1
2017-06-08\T\18:09:26.803 [INFO] 
2017-06-08\T\18:09:26.804 [INFO] ------------------------------------------------------------------------
2017-06-08\T\18:09:26.804 [INFO] Reactor Summary:
2017-06-08\T\18:09:26.804 [INFO] 
2017-06-08\T\18:09:26.805 [INFO] Apache Beam :: Parent .............................. SUCCESS
[ 18.705 s]
2017-06-08\T\18:09:26.805 [INFO] Apache Beam :: SDKs :: Java :: Build Tools ......... SUCCESS
[  7.439 s]
2017-06-08\T\18:09:26.805 [INFO] Apache Beam :: SDKs ................................ SUCCESS
[  0.653 s]
2017-06-08\T\18:09:26.805 [INFO] Apache Beam :: SDKs :: Common ...................... SUCCESS
[  0.485 s]
2017-06-08\T\18:09:26.805 [INFO] Apache Beam :: SDKs :: Common :: Runner API ........ SUCCESS
[  8.298 s]
2017-06-08\T\18:09:26.805 [INFO] Apache Beam :: SDKs :: Common :: Fn API ............ SUCCESS
[  6.214 s]
2017-06-08\T\18:09:26.805 [INFO] Apache Beam :: SDKs :: Java ........................ SUCCESS
[  0.771 s]
2017-06-08\T\18:09:26.805 [INFO] Apache Beam :: SDKs :: Java :: Core ................ SUCCESS
[01:40 min]
2017-06-08\T\18:09:26.805 [INFO] Apache Beam :: Runners ............................. SUCCESS
[  0.589 s]
2017-06-08\T\18:09:26.805 [INFO] Apache Beam :: Runners :: Core Construction Java ... SUCCESS
[ 12.910 s]
2017-06-08\T\18:09:26.805 [INFO] Apache Beam :: Runners :: Core Java ................ SUCCESS
[ 32.242 s]
2017-06-08\T\18:09:26.805 [INFO] Apache Beam :: Runners :: Direct Java .............. FAILURE
[03:59 min]
2017-06-08\T\18:09:26.805 [INFO] Apache Beam :: SDKs :: Java :: IO .................. SKIPPED
2017-06-08\T\18:09:26.805 [INFO] Apache Beam :: SDKs :: Java :: IO :: Common ........ SKIPPED
2017-06-08\T\18:09:26.805 [INFO] Apache Beam :: SDKs :: Java :: IO :: Cassandra ..... SKIPPED
2017-06-08\T\18:09:26.805 [INFO] Apache Beam :: SDKs :: Java :: IO :: Elasticsearch . SKIPPED
2017-06-08\T\18:09:26.805 [INFO] Apache Beam :: SDKs :: Java :: Extensions .......... SKIPPED
2017-06-08\T\18:09:26.805 [INFO] Apache Beam :: SDKs :: Java :: Extensions :: Google Cloud
Platform Core SKIPPED
2017-06-08\T\18:09:26.805 [INFO] Apache Beam :: SDKs :: Java :: Extensions :: Protobuf SKIPPED
2017-06-08\T\18:09:26.805 [INFO] Apache Beam :: SDKs :: Java :: IO :: Google Cloud Platform
SKIPPED
2017-06-08\T\18:09:26.805 [INFO] Apache Beam :: SDKs :: Java :: IO :: Hadoop Common . SKIPPED
2017-06-08\T\18:09:26.805 [INFO] Apache Beam :: SDKs :: Java :: IO :: Hadoop File System SKIPPED
2017-06-08\T\18:09:26.805 [INFO] Apache Beam :: SDKs :: Java :: IO :: Hadoop ........ SKIPPED
2017-06-08\T\18:09:26.805 [INFO] Apache Beam :: SDKs :: Java :: IO :: Hadoop :: input-format
SKIPPED
2017-06-08\T\18:09:26.805 [INFO] Apache Beam :: SDKs :: Java :: IO :: HBase ......... SKIPPED
2017-06-08\T\18:09:26.805 [INFO] Apache Beam :: Runners :: Google Cloud Dataflow .... SKIPPED
2017-06-08\T\18:09:26.805 [INFO] Apache Beam :: SDKs :: Java :: IO :: JDBC .......... SKIPPED
2017-06-08\T\18:09:26.805 [INFO] Apache Beam :: SDKs :: Java :: IO :: JMS ........... SKIPPED
2017-06-08\T\18:09:26.805 [INFO] Apache Beam :: SDKs :: Java :: IO :: Kafka ......... SKIPPED
2017-06-08\T\18:09:26.805 [INFO] Apache Beam :: SDKs :: Java :: IO :: Kinesis ....... SKIPPED
2017-06-08\T\18:09:26.805 [INFO] Apache Beam :: SDKs :: Java :: IO :: MongoDB ....... SKIPPED
2017-06-08\T\18:09:26.805 [INFO] Apache Beam :: SDKs :: Java :: IO :: MQTT .......... SKIPPED
2017-06-08\T\18:09:26.805 [INFO] Apache Beam :: SDKs :: Java :: IO :: XML ........... SKIPPED
2017-06-08\T\18:09:26.805 [INFO] Apache Beam :: SDKs :: Java :: Maven Archetypes .... SKIPPED
2017-06-08\T\18:09:26.805 [INFO] Apache Beam :: SDKs :: Java :: Maven Archetypes :: Starter
SKIPPED
2017-06-08\T\18:09:26.805 [INFO] Apache Beam :: Examples ............................ SKIPPED
2017-06-08\T\18:09:26.805 [INFO] Apache Beam :: Examples :: Java .................... SKIPPED
2017-06-08\T\18:09:26.806 [INFO] Apache Beam :: SDKs :: Java :: Maven Archetypes :: Examples
SKIPPED
2017-06-08\T\18:09:26.806 [INFO] Apache Beam :: SDKs :: Java :: Extensions :: Jackson SKIPPED
2017-06-08\T\18:09:26.806 [INFO] Apache Beam :: SDKs :: Java :: Extensions :: Join library
SKIPPED
2017-06-08\T\18:09:26.806 [INFO] Apache Beam :: SDKs :: Java :: Extensions :: Sorter  SKIPPED
2017-06-08\T\18:09:26.806 [INFO] Apache Beam :: Runners :: Flink .................... SKIPPED
2017-06-08\T\18:09:26.806 [INFO] Apache Beam :: Runners :: Spark .................... SKIPPED
2017-06-08\T\18:09:26.806 [INFO] Apache Beam :: SDKs :: Java :: Aggregated Javadoc .. SKIPPED
2017-06-08\T\18:09:26.806 [INFO] ------------------------------------------------------------------------
2017-06-08\T\18:09:26.806 [INFO] BUILD FAILURE
2017-06-08\T\18:09:26.806 [INFO] ------------------------------------------------------------------------
2017-06-08\T\18:09:26.806 [INFO] Total time: 07:12 min
2017-06-08\T\18:09:26.806 [INFO] Finished at: 2017-06-08T18:09:26+00:00
2017-06-08\T\18:09:27.514 [INFO] Final Memory: 113M/1537M
2017-06-08\T\18:09:27.514 [INFO] ------------------------------------------------------------------------
2017-06-08\T\18:09:27.515 [ERROR] Failed to execute goal org.apache.maven.plugins:maven-surefire-plugin:2.20:test
(validates-runner-tests) on project beam-runners-direct-java: There are test failures.
2017-06-08\T\18:09:27.515 [ERROR] 
2017-06-08\T\18:09:27.515 [ERROR] Please refer to <https://builds.apache.org/job/beam_PostCommit_Java_JDK_Versions_Test/jdk=OpenJDK%207%20(on%20Ubuntu%20only),label=beam/ws/runners/direct-java/target/surefire-reports>
for the individual test results.
2017-06-08\T\18:09:27.515 [ERROR] Please refer to dump files (if any exist) [date]-jvmRun[N].dump,
[date].dumpstream and [date]-jvmRun[N].dumpstream.
2017-06-08\T\18:09:27.515 [ERROR] -> [Help 1]
org.apache.maven.lifecycle.LifecycleExecutionException: Failed to execute goal org.apache.maven.plugins:maven-surefire-plugin:2.20:test
(validates-runner-tests) on project beam-runners-direct-java: There are test failures.

Please refer to <https://builds.apache.org/job/beam_PostCommit_Java_JDK_Versions_Test/jdk=OpenJDK%207%20(on%20Ubuntu%20only),label=beam/ws/runners/direct-java/target/surefire-reports>
for the individual test results.
Please refer to dump files (if any exist) [date]-jvmRun[N].dump, [date].dumpstream and [date]-jvmRun[N].dumpstream.
	at org.apache.maven.lifecycle.internal.MojoExecutor.execute(MojoExecutor.java:212)
	at org.apache.maven.lifecycle.internal.MojoExecutor.execute(MojoExecutor.java:153)
	at org.apache.maven.lifecycle.internal.MojoExecutor.execute(MojoExecutor.java:145)
	at org.apache.maven.lifecycle.internal.LifecycleModuleBuilder.buildProject(LifecycleModuleBuilder.java:116)
	at org.apache.maven.lifecycle.internal.LifecycleModuleBuilder.buildProject(LifecycleModuleBuilder.java:80)
	at org.apache.maven.lifecycle.internal.builder.singlethreaded.SingleThreadedBuilder.build(SingleThreadedBuilder.java:51)
	at org.apache.maven.lifecycle.internal.LifecycleStarter.execute(LifecycleStarter.java:128)
	at org.apache.maven.DefaultMaven.doExecute(DefaultMaven.java:307)
	at org.apache.maven.DefaultMaven.doExecute(DefaultMaven.java:193)
	at org.apache.maven.DefaultMaven.execute(DefaultMaven.java:106)
	at org.apache.maven.cli.MavenCli.execute(MavenCli.java:862)
	at org.apache.maven.cli.MavenCli.doMain(MavenCli.java:286)
	at org.apache.maven.cli.MavenCli.main(MavenCli.java:197)
	at sun.reflect.NativeMethodAccessorImpl.invoke0(Native Method)
	at sun.reflect.NativeMethodAccessorImpl.invoke(NativeMethodAccessorImpl.java:57)
	at sun.reflect.DelegatingMethodAccessorImpl.invoke(DelegatingMethodAccessorImpl.java:43)
	at java.lang.reflect.Method.invoke(Method.java:606)
	at org.codehaus.plexus.classworlds.launcher.Launcher.launchEnhanced(Launcher.java:289)
	at org.codehaus.plexus.classworlds.launcher.Launcher.launch(Launcher.java:229)
	at org.codehaus.plexus.classworlds.launcher.Launcher.mainWithExitCode(Launcher.java:415)
	at org.codehaus.plexus.classworlds.launcher.Launcher.main(Launcher.java:356)
Caused by: org.apache.maven.plugin.MojoFailureException: There are test failures.

Please refer to <https://builds.apache.org/job/beam_PostCommit_Java_JDK_Versions_Test/jdk=OpenJDK%207%20(on%20Ubuntu%20only),label=beam/ws/runners/direct-java/target/surefire-reports>
for the individual test results.
Please refer to dump files (if any exist) [date]-jvmRun[N].dump, [date].dumpstream and [date]-jvmRun[N].dumpstream.
	at org.apache.maven.plugin.surefire.SurefireHelper.throwException(SurefireHelper.java:204)
	at org.apache.maven.plugin.surefire.SurefireHelper.reportExecution(SurefireHelper.java:98)
	at org.apache.maven.plugin.surefire.SurefirePlugin.handleSummary(SurefirePlugin.java:334)
	at org.apache.maven.plugin.surefire.AbstractSurefireMojo.executeAfterPreconditionsChecked(AbstractSurefireMojo.java:937)
	at org.apache.maven.plugin.surefire.AbstractSurefireMojo.execute(AbstractSurefireMojo.java:785)
	at org.apache.maven.plugin.DefaultBuildPluginManager.executeMojo(DefaultBuildPluginManager.java:134)
	at org.apache.maven.lifecycle.internal.MojoExecutor.execute(MojoExecutor.java:208)
	... 20 more
2017-06-08\T\18:09:27.517 [ERROR] 
2017-06-08\T\18:09:27.517 [ERROR] Re-run Maven using the -X switch to enable full debug logging.
2017-06-08\T\18:09:27.517 [ERROR] 
2017-06-08\T\18:09:27.517 [ERROR] For more information about the errors and possible solutions,
please read the following articles:
2017-06-08\T\18:09:27.517 [ERROR] [Help 1] http://cwiki.apache.org/confluence/display/MAVEN/MojoFailureException
2017-06-08\T\18:09:27.517 [ERROR] 
2017-06-08\T\18:09:27.517 [ERROR] After correcting the problems, you can resume the build
with the command
2017-06-08\T\18:09:27.517 [ERROR]   mvn <goals> -rf :beam-runners-direct-java
Build step 'Invoke top-level Maven targets' marked build as failure
Not sending mail to unregistered user ccy@google.com

Mime
View raw message