beam-commits mailing list archives

Site index · List index
Message view « Date » · « Thread »
Top « Date » · « Thread »
From Apache Jenkins Server <jenk...@builds.apache.org>
Subject Build failed in Jenkins: beam_PostCommit_Java_MavenInstall #4208
Date Sat, 24 Jun 2017 18:26:04 GMT
See <https://builds.apache.org/job/beam_PostCommit_Java_MavenInstall/4208/display/redirect>

------------------------------------------
[...truncated 1.21 MB...]
2017-06-24T18:25:08.800 [INFO] Downloaded: https://repo.maven.apache.org/maven2/org/apache/hive/hive-serde/2.1.0/hive-serde-2.1.0.jar
(895 KB at 358.4 KB/sec)
2017-06-24T18:25:08.800 [INFO] Downloading: https://repo.maven.apache.org/maven2/org/apache/hive/hive-service/2.1.0/hive-service-2.1.0.jar
2017-06-24T18:25:08.953 [INFO] Downloaded: https://repo.maven.apache.org/maven2/org/apache/hive/hive-service/2.1.0/hive-service-2.1.0.jar
(472 KB at 178.2 KB/sec)
2017-06-24T18:25:08.953 [INFO] Downloading: https://repo.maven.apache.org/maven2/org/apache/hive/hive-llap-server/2.1.0/hive-llap-server-2.1.0.jar
2017-06-24T18:25:08.963 [INFO] Downloaded: https://repo.maven.apache.org/maven2/org/apache/hive/hive-service-rpc/2.1.0/hive-service-rpc-2.1.0.jar
(1503 KB at 565.2 KB/sec)
2017-06-24T18:25:08.963 [INFO] Downloading: https://repo.maven.apache.org/maven2/org/apache/slider/slider-core/0.90.2-incubating/slider-core-0.90.2-incubating.jar
2017-06-24T18:25:09.113 [INFO] Downloaded: https://repo.maven.apache.org/maven2/org/apache/parquet/parquet-hadoop-bundle/1.8.1/parquet-hadoop-bundle-1.8.1.jar
(2835 KB at 1009.4 KB/sec)
2017-06-24T18:25:09.114 [INFO] Downloading: https://repo.maven.apache.org/maven2/com/beust/jcommander/1.30/jcommander-1.30.jar
2017-06-24T18:25:09.115 [INFO] Downloaded: https://repo.maven.apache.org/maven2/org/apache/hive/hive-llap-server/2.1.0/hive-llap-server-2.1.0.jar
(545 KB at 193.8 KB/sec)
2017-06-24T18:25:09.115 [INFO] Downloading: https://repo.maven.apache.org/maven2/org/apache/hadoop/hadoop-yarn-registry/2.7.1/hadoop-yarn-registry-2.7.1.jar
2017-06-24T18:25:09.154 [INFO] Downloaded: https://repo.maven.apache.org/maven2/com/beust/jcommander/1.30/jcommander-1.30.jar
(59 KB at 20.7 KB/sec)
2017-06-24T18:25:09.155 [INFO] Downloading: https://repo.maven.apache.org/maven2/org/apache/hbase/hbase-hadoop2-compat/1.1.1/hbase-hadoop2-compat-1.1.1.jar
2017-06-24T18:25:09.155 [INFO] Downloaded: https://repo.maven.apache.org/maven2/org/apache/hadoop/hadoop-yarn-registry/2.7.1/hadoop-yarn-registry-2.7.1.jar
(96 KB at 33.6 KB/sec)
2017-06-24T18:25:09.156 [INFO] Downloading: https://repo.maven.apache.org/maven2/org/apache/hbase/hbase-server/1.1.1/hbase-server-1.1.1.jar
2017-06-24T18:25:09.194 [INFO] Downloaded: https://repo.maven.apache.org/maven2/org/apache/hbase/hbase-hadoop2-compat/1.1.1/hbase-hadoop2-compat-1.1.1.jar
(80 KB at 27.5 KB/sec)
2017-06-24T18:25:09.194 [INFO] Downloading: https://repo.maven.apache.org/maven2/org/apache/hbase/hbase-procedure/1.1.1/hbase-procedure-1.1.1.jar
2017-06-24T18:25:09.240 [INFO] Downloaded: https://repo.maven.apache.org/maven2/org/apache/hbase/hbase-procedure/1.1.1/hbase-procedure-1.1.1.jar
(100 KB at 33.9 KB/sec)
2017-06-24T18:25:09.241 [INFO] Downloading: https://repo.maven.apache.org/maven2/org/apache/hbase/hbase-common/1.1.1/hbase-common-1.1.1-tests.jar
2017-06-24T18:25:09.314 [INFO] Downloaded: https://repo.maven.apache.org/maven2/org/apache/slider/slider-core/0.90.2-incubating/slider-core-0.90.2-incubating.jar
(1744 KB at 579.4 KB/sec)
2017-06-24T18:25:09.314 [INFO] Downloading: https://repo.maven.apache.org/maven2/org/apache/hbase/hbase-prefix-tree/1.1.1/hbase-prefix-tree-1.1.1.jar
2017-06-24T18:25:09.316 [INFO] Downloaded: https://repo.maven.apache.org/maven2/org/apache/hbase/hbase-common/1.1.1/hbase-common-1.1.1-tests.jar
(206 KB at 68.2 KB/sec)
2017-06-24T18:25:09.316 [INFO] Downloading: https://repo.maven.apache.org/maven2/org/apache/hbase/hbase-hadoop-compat/1.1.1/hbase-hadoop-compat-1.1.1.jar
2017-06-24T18:25:09.360 [INFO] Downloaded: https://repo.maven.apache.org/maven2/org/apache/hbase/hbase-prefix-tree/1.1.1/hbase-prefix-tree-1.1.1.jar
(100 KB at 32.6 KB/sec)
2017-06-24T18:25:09.361 [INFO] Downloading: https://repo.maven.apache.org/maven2/javax/servlet/jsp-api/2.0/jsp-api-2.0.jar
2017-06-24T18:25:09.362 [INFO] Downloaded: https://repo.maven.apache.org/maven2/org/apache/hbase/hbase-hadoop-compat/1.1.1/hbase-hadoop-compat-1.1.1.jar
(36 KB at 11.5 KB/sec)
2017-06-24T18:25:09.362 [INFO] Downloading: https://repo.maven.apache.org/maven2/org/jamon/jamon-runtime/2.3.1/jamon-runtime-2.3.1.jar
2017-06-24T18:25:09.395 [INFO] Downloaded: https://repo.maven.apache.org/maven2/org/jamon/jamon-runtime/2.3.1/jamon-runtime-2.3.1.jar
(21 KB at 6.5 KB/sec)
2017-06-24T18:25:09.396 [INFO] Downloading: https://repo.maven.apache.org/maven2/org/apache/thrift/libthrift/0.9.3/libthrift-0.9.3.jar
2017-06-24T18:25:09.400 [INFO] Downloaded: https://repo.maven.apache.org/maven2/javax/servlet/jsp-api/2.0/jsp-api-2.0.jar
(50 KB at 15.9 KB/sec)
2017-06-24T18:25:09.455 [INFO] Downloaded: https://repo.maven.apache.org/maven2/org/apache/thrift/libthrift/0.9.3/libthrift-0.9.3.jar
(229 KB at 72.6 KB/sec)
2017-06-24T18:25:09.594 [INFO] Downloaded: https://repo.maven.apache.org/maven2/org/apache/hbase/hbase-server/1.1.1/hbase-server-1.1.1.jar
(3878 KB at 1178.9 KB/sec)
2017-06-24T18:25:09.914 [INFO] Downloaded: https://repo.maven.apache.org/maven2/it/unimi/dsi/fastutil/6.5.6/fastutil-6.5.6.jar
(16502 KB at 4572.5 KB/sec)
2017-06-24T18:25:10.138 [INFO] Downloaded: https://repo.maven.apache.org/maven2/org/apache/hive/hive-exec/2.1.0/hive-exec-2.1.0.jar
(31655 KB at 8254.2 KB/sec)
2017-06-24T18:25:10.157 [INFO] Downloading: http://www.datanucleus.org/downloads/maven2/org/pentaho/pentaho-aggdesigner-algorithm/5.1.5-jhyde/pentaho-aggdesigner-algorithm-5.1.5-jhyde.jar
2017-06-24T18:25:10.158 [INFO] Downloading: http://www.datanucleus.org/downloads/maven2/org/apache/hadoop/hadoop-hdfs/2.6.0/hadoop-hdfs-2.6.0.jar
2017-06-24T18:25:10.463 [INFO] Downloading: http://conjars.org/repo/org/pentaho/pentaho-aggdesigner-algorithm/5.1.5-jhyde/pentaho-aggdesigner-algorithm-5.1.5-jhyde.jar
2017-06-24T18:25:10.578 [INFO] Downloaded: http://conjars.org/repo/org/pentaho/pentaho-aggdesigner-algorithm/5.1.5-jhyde/pentaho-aggdesigner-algorithm-5.1.5-jhyde.jar
(0 B at 0.0 KB/sec)
[JENKINS] Archiving disabled
2017-06-24T18:25:11.222 [INFO]                                                           
             
2017-06-24T18:25:11.222 [INFO] ------------------------------------------------------------------------
2017-06-24T18:25:11.222 [INFO] Skipping Apache Beam :: Parent
2017-06-24T18:25:11.222 [INFO] This project has been banned from the build due to previous
failures.
2017-06-24T18:25:11.222 [INFO] ------------------------------------------------------------------------
[JENKINS] Archiving disabled
[JENKINS] Archiving disabled
[JENKINS] Archiving disabled
[JENKINS] Archiving disabled
[JENKINS] Archiving disabled
[JENKINS] Archiving disabled
[JENKINS] Archiving disabled
[JENKINS] Archiving disabled
[JENKINS] Archiving disabled
[JENKINS] Archiving disabled
[JENKINS] Archiving disabled
[JENKINS] Archiving disabled
[JENKINS] Archiving disabled
[JENKINS] Archiving disabled
[JENKINS] Archiving disabled
[JENKINS] Archiving disabled
[JENKINS] Archiving disabled
[JENKINS] Archiving disabled
[JENKINS] Archiving disabled
[JENKINS] Archiving disabled
[JENKINS] Archiving disabled
[JENKINS] Archiving disabled
[JENKINS] Archiving disabled
[JENKINS] Archiving disabled
[JENKINS] Archiving disabled
[JENKINS] Archiving disabled
[JENKINS] Archiving disabled
[JENKINS] Archiving disabled
[JENKINS] Archiving disabled
[JENKINS] Archiving disabled
[JENKINS] Archiving disabled
[JENKINS] Archiving disabled
[JENKINS] Archiving disabled
[JENKINS] Archiving disabled
[JENKINS] Archiving disabled
[JENKINS] Archiving disabled
[JENKINS] Archiving disabled
[JENKINS] Archiving disabled
[JENKINS] Archiving disabled
[JENKINS] Archiving disabled
[JENKINS] Archiving disabled
[JENKINS] Archiving disabled
[JENKINS] Archiving disabled
[JENKINS] Archiving disabled
[JENKINS] Archiving disabled
[JENKINS] Archiving disabled
[JENKINS] Archiving disabled
[JENKINS] Archiving disabled
2017-06-24T18:25:29.613 [INFO] ------------------------------------------------------------------------
2017-06-24T18:25:29.613 [INFO] Reactor Summary:
2017-06-24T18:25:29.613 [INFO] 
2017-06-24T18:25:29.613 [INFO] Apache Beam :: Parent .............................. SUCCESS
[ 31.942 s]
2017-06-24T18:25:29.613 [INFO] Apache Beam :: SDKs :: Java :: Build Tools ......... SUCCESS
[  9.144 s]
2017-06-24T18:25:29.613 [INFO] Apache Beam :: SDKs ................................ SUCCESS
[  5.639 s]
2017-06-24T18:25:29.613 [INFO] Apache Beam :: SDKs :: Common ...................... SUCCESS
[  1.758 s]
2017-06-24T18:25:29.613 [INFO] Apache Beam :: SDKs :: Common :: Runner API ........ SUCCESS
[ 17.749 s]
2017-06-24T18:25:29.613 [INFO] Apache Beam :: SDKs :: Common :: Fn API ............ SUCCESS
[ 17.061 s]
2017-06-24T18:25:29.614 [INFO] Apache Beam :: SDKs :: Java ........................ SUCCESS
[  1.902 s]
2017-06-24T18:25:29.614 [INFO] Apache Beam :: SDKs :: Java :: Core ................ SUCCESS
[02:43 min]
2017-06-24T18:25:29.614 [INFO] Apache Beam :: Runners ............................. SUCCESS
[  1.946 s]
2017-06-24T18:25:29.614 [INFO] Apache Beam :: Runners :: Core Construction Java ... SUCCESS
[ 37.705 s]
2017-06-24T18:25:29.614 [INFO] Apache Beam :: Runners :: Core Java ................ SUCCESS
[ 56.340 s]
2017-06-24T18:25:29.614 [INFO] Apache Beam :: Runners :: Direct Java .............. SUCCESS
[03:40 min]
2017-06-24T18:25:29.614 [INFO] Apache Beam :: SDKs :: Java :: IO .................. SUCCESS
[  1.821 s]
2017-06-24T18:25:29.614 [INFO] Apache Beam :: SDKs :: Java :: IO :: Common ........ SUCCESS
[  4.314 s]
2017-06-24T18:25:29.614 [INFO] Apache Beam :: SDKs :: Java :: IO :: Cassandra ..... SUCCESS
[ 28.935 s]
2017-06-24T18:25:29.614 [INFO] Apache Beam :: SDKs :: Java :: IO :: Elasticsearch . SUCCESS
[ 43.015 s]
2017-06-24T18:25:29.614 [INFO] Apache Beam :: SDKs :: Java :: Extensions .......... SUCCESS
[  1.550 s]
2017-06-24T18:25:29.614 [INFO] Apache Beam :: SDKs :: Java :: Extensions :: Google Cloud Platform
Core SUCCESS [ 41.745 s]
2017-06-24T18:25:29.614 [INFO] Apache Beam :: SDKs :: Java :: Extensions :: Protobuf SUCCESS
[ 22.898 s]
2017-06-24T18:25:29.614 [INFO] Apache Beam :: SDKs :: Java :: IO :: Google Cloud Platform
SUCCESS [01:24 min]
2017-06-24T18:25:29.614 [INFO] Apache Beam :: SDKs :: Java :: IO :: Hadoop Common . SUCCESS
[ 23.133 s]
2017-06-24T18:25:29.614 [INFO] Apache Beam :: SDKs :: Java :: IO :: Hadoop File System SUCCESS
[ 45.712 s]
2017-06-24T18:25:29.614 [INFO] Apache Beam :: SDKs :: Java :: IO :: Hadoop ........ SUCCESS
[  5.800 s]
2017-06-24T18:25:29.614 [INFO] Apache Beam :: SDKs :: Java :: IO :: Hadoop :: input-format
SUCCESS [ 25.008 s]
2017-06-24T18:25:29.614 [INFO] Apache Beam :: Runners :: Google Cloud Dataflow .... SUCCESS
[05:42 min]
2017-06-24T18:25:29.614 [INFO] Apache Beam :: SDKs :: Java :: IO :: Hadoop :: jdk1.8-tests
SUCCESS [01:13 min]
2017-06-24T18:25:29.614 [INFO] Apache Beam :: SDKs :: Java :: IO :: HBase ......... SUCCESS
[ 57.850 s]
2017-06-24T18:25:29.614 [INFO] Apache Beam :: SDKs :: Java :: IO :: HCatalog ...... FAILURE
[  7.988 s]
2017-06-24T18:25:29.614 [INFO] Apache Beam :: SDKs :: Java :: IO :: JDBC .......... SKIPPED
2017-06-24T18:25:29.614 [INFO] Apache Beam :: SDKs :: Java :: IO :: JMS ........... SKIPPED
2017-06-24T18:25:29.614 [INFO] Apache Beam :: SDKs :: Java :: IO :: Kafka ......... SKIPPED
2017-06-24T18:25:29.614 [INFO] Apache Beam :: SDKs :: Java :: IO :: Kinesis ....... SKIPPED
2017-06-24T18:25:29.614 [INFO] Apache Beam :: SDKs :: Java :: IO :: MongoDB ....... SKIPPED
2017-06-24T18:25:29.614 [INFO] Apache Beam :: SDKs :: Java :: IO :: MQTT .......... SKIPPED
2017-06-24T18:25:29.614 [INFO] Apache Beam :: SDKs :: Java :: IO :: XML ........... SKIPPED
2017-06-24T18:25:29.614 [INFO] Apache Beam :: SDKs :: Java :: Maven Archetypes .... SKIPPED
2017-06-24T18:25:29.614 [INFO] Apache Beam :: SDKs :: Java :: Maven Archetypes :: Starter
SKIPPED
2017-06-24T18:25:29.614 [INFO] Apache Beam :: Examples ............................ SKIPPED
2017-06-24T18:25:29.614 [INFO] Apache Beam :: Examples :: Java .................... SKIPPED
2017-06-24T18:25:29.614 [INFO] Apache Beam :: SDKs :: Java :: Maven Archetypes :: Examples
SKIPPED
2017-06-24T18:25:29.614 [INFO] Apache Beam :: Examples :: Java 8 .................. SKIPPED
2017-06-24T18:25:29.614 [INFO] Apache Beam :: SDKs :: Java :: Maven Archetypes :: Examples
- Java 8 SKIPPED
2017-06-24T18:25:29.614 [INFO] Apache Beam :: SDKs :: Java :: Extensions :: Jackson SKIPPED
2017-06-24T18:25:29.614 [INFO] Apache Beam :: SDKs :: Java :: Extensions :: Join library SKIPPED
2017-06-24T18:25:29.614 [INFO] Apache Beam :: SDKs :: Java :: Extensions :: Sorter  SKIPPED
2017-06-24T18:25:29.614 [INFO] Apache Beam :: SDKs :: Java :: Harness ............. SKIPPED
2017-06-24T18:25:29.614 [INFO] Apache Beam :: SDKs :: Java :: Java 8 Tests ........ SKIPPED
2017-06-24T18:25:29.614 [INFO] Apache Beam :: SDKs :: Python ...................... SKIPPED
2017-06-24T18:25:29.614 [INFO] Apache Beam :: Runners :: Flink .................... SKIPPED
2017-06-24T18:25:29.614 [INFO] Apache Beam :: Runners :: Spark .................... SKIPPED
2017-06-24T18:25:29.614 [INFO] Apache Beam :: Runners :: Apex ..................... SKIPPED
2017-06-24T18:25:29.614 [INFO] Apache Beam :: SDKs :: Java :: Aggregated Javadoc .. SKIPPED
2017-06-24T18:25:29.614 [INFO] ------------------------------------------------------------------------
2017-06-24T18:25:29.614 [INFO] BUILD FAILURE
2017-06-24T18:25:29.614 [INFO] ------------------------------------------------------------------------
2017-06-24T18:25:29.614 [INFO] Total time: 23:46 min
2017-06-24T18:25:29.614 [INFO] Finished at: 2017-06-24T18:25:29+00:00
2017-06-24T18:25:30.303 [INFO] Final Memory: 236M/1779M
2017-06-24T18:25:30.303 [INFO] ------------------------------------------------------------------------
Waiting for Jenkins to finish collecting data
2017-06-24T18:25:48.559 [ERROR] Failed to execute goal on project beam-sdks-java-io-hcatalog:
Could not resolve dependencies for project org.apache.beam:beam-sdks-java-io-hcatalog:jar:2.1.0-SNAPSHOT:
Could not transfer artifact org.apache.hadoop:hadoop-hdfs:jar:2.6.0 from/to central (https://repo.maven.apache.org/maven2):
GET request of: org/apache/hadoop/hadoop-hdfs/2.6.0/hadoop-hdfs-2.6.0.jar from central failed:
Connection reset -> [Help 1]
org.apache.maven.lifecycle.LifecycleExecutionException: Failed to execute goal on project
beam-sdks-java-io-hcatalog: Could not resolve dependencies for project org.apache.beam:beam-sdks-java-io-hcatalog:jar:2.1.0-SNAPSHOT:
Could not transfer artifact org.apache.hadoop:hadoop-hdfs:jar:2.6.0 from/to central (https://repo.maven.apache.org/maven2):
GET request of: org/apache/hadoop/hadoop-hdfs/2.6.0/hadoop-hdfs-2.6.0.jar from central failed
	at org.apache.maven.lifecycle.internal.LifecycleDependencyResolver.getDependencies(LifecycleDependencyResolver.java:221)
	at org.apache.maven.lifecycle.internal.LifecycleDependencyResolver.resolveProjectDependencies(LifecycleDependencyResolver.java:127)
	at org.apache.maven.lifecycle.internal.MojoExecutor.ensureDependenciesAreResolved(MojoExecutor.java:257)
	at org.apache.maven.lifecycle.internal.MojoExecutor.execute(MojoExecutor.java:200)
	at org.apache.maven.lifecycle.internal.MojoExecutor.execute(MojoExecutor.java:153)
	at org.apache.maven.lifecycle.internal.MojoExecutor.execute(MojoExecutor.java:145)
	at org.apache.maven.lifecycle.internal.LifecycleModuleBuilder.buildProject(LifecycleModuleBuilder.java:116)
	at org.apache.maven.lifecycle.internal.LifecycleModuleBuilder.buildProject(LifecycleModuleBuilder.java:80)
	at org.apache.maven.lifecycle.internal.builder.singlethreaded.SingleThreadedBuilder.build(SingleThreadedBuilder.java:51)
	at org.apache.maven.lifecycle.internal.LifecycleStarter.execute(LifecycleStarter.java:128)
	at org.apache.maven.DefaultMaven.doExecute(DefaultMaven.java:307)
	at org.apache.maven.DefaultMaven.doExecute(DefaultMaven.java:193)
	at org.apache.maven.DefaultMaven.execute(DefaultMaven.java:106)
	at org.jvnet.hudson.maven3.launcher.Maven33Launcher.main(Maven33Launcher.java:129)
	at sun.reflect.NativeMethodAccessorImpl.invoke0(Native Method)
	at sun.reflect.NativeMethodAccessorImpl.invoke(NativeMethodAccessorImpl.java:62)
	at sun.reflect.DelegatingMethodAccessorImpl.invoke(DelegatingMethodAccessorImpl.java:43)
	at java.lang.reflect.Method.invoke(Method.java:498)
	at org.codehaus.plexus.classworlds.launcher.Launcher.launchStandard(Launcher.java:330)
	at org.codehaus.plexus.classworlds.launcher.Launcher.launch(Launcher.java:238)
	at jenkins.maven3.agent.Maven33Main.launch(Maven33Main.java:176)
	at sun.reflect.NativeMethodAccessorImpl.invoke0(Native Method)
	at sun.reflect.NativeMethodAccessorImpl.invoke(NativeMethodAccessorImpl.java:62)
	at sun.reflect.DelegatingMethodAccessorImpl.invoke(DelegatingMethodAccessorImpl.java:43)
	at java.lang.reflect.Method.invoke(Method.java:498)
	at hudson.maven.Maven3Builder.call(Maven3Builder.java:139)
	at hudson.maven.Maven3Builder.call(Maven3Builder.java:70)
	at hudson.remoting.UserRequest.perform(UserRequest.java:153)
	at hudson.remoting.UserRequest.perform(UserRequest.java:50)
	at hudson.remoting.Request$2.run(Request.java:336)
	at hudson.remoting.InterceptingExecutorService$1.call(InterceptingExecutorService.java:68)
	at java.util.concurrent.FutureTask.run(FutureTask.java:266)
	at java.util.concurrent.ThreadPoolExecutor.runWorker(ThreadPoolExecutor.java:1142)
	at java.util.concurrent.ThreadPoolExecutor$Worker.run(ThreadPoolExecutor.java:617)
	at java.lang.Thread.run(Thread.java:748)
Caused by: org.apache.maven.project.DependencyResolutionException: Could not resolve dependencies
for project org.apache.beam:beam-sdks-java-io-hcatalog:jar:2.1.0-SNAPSHOT: Could not transfer
artifact org.apache.hadoop:hadoop-hdfs:jar:2.6.0 from/to central (https://repo.maven.apache.org/maven2):
GET request of: org/apache/hadoop/hadoop-hdfs/2.6.0/hadoop-hdfs-2.6.0.jar from central failed
	at org.apache.maven.project.DefaultProjectDependenciesResolver.resolve(DefaultProjectDependenciesResolver.java:211)
	at org.apache.maven.lifecycle.internal.LifecycleDependencyResolver.getDependencies(LifecycleDependencyResolver.java:195)
	... 34 more
Caused by: org.eclipse.aether.resolution.DependencyResolutionException: Could not transfer
artifact org.apache.hadoop:hadoop-hdfs:jar:2.6.0 from/to central (https://repo.maven.apache.org/maven2):
GET request of: org/apache/hadoop/hadoop-hdfs/2.6.0/hadoop-hdfs-2.6.0.jar from central failed
	at org.eclipse.aether.internal.impl.DefaultRepositorySystem.resolveDependencies(DefaultRepositorySystem.java:384)
	at org.apache.maven.project.DefaultProjectDependenciesResolver.resolve(DefaultProjectDependenciesResolver.java:205)
	... 35 more
Caused by: org.eclipse.aether.resolution.ArtifactResolutionException: Could not transfer artifact
org.apache.hadoop:hadoop-hdfs:jar:2.6.0 from/to central (https://repo.maven.apache.org/maven2):
GET request of: org/apache/hadoop/hadoop-hdfs/2.6.0/hadoop-hdfs-2.6.0.jar from central failed
	at org.eclipse.aether.internal.impl.DefaultArtifactResolver.resolve(DefaultArtifactResolver.java:444)
	at org.eclipse.aether.internal.impl.DefaultArtifactResolver.resolveArtifacts(DefaultArtifactResolver.java:246)
	at org.eclipse.aether.internal.impl.DefaultRepositorySystem.resolveDependencies(DefaultRepositorySystem.java:367)
	... 36 more
Caused by: org.eclipse.aether.transfer.ArtifactTransferException: Could not transfer artifact
org.apache.hadoop:hadoop-hdfs:jar:2.6.0 from/to central (https://repo.maven.apache.org/maven2):
GET request of: org/apache/hadoop/hadoop-hdfs/2.6.0/hadoop-hdfs-2.6.0.jar from central failed
	at org.eclipse.aether.connector.basic.ArtifactTransportListener.transferFailed(ArtifactTransportListener.java:43)
	at org.eclipse.aether.connector.basic.BasicRepositoryConnector$TaskRunner.run(BasicRepositoryConnector.java:355)
	at org.eclipse.aether.util.concurrency.RunnableErrorForwarder$1.run(RunnableErrorForwarder.java:67)
	... 3 more
Caused by: org.apache.maven.wagon.TransferFailedException: GET request of: org/apache/hadoop/hadoop-hdfs/2.6.0/hadoop-hdfs-2.6.0.jar
from central failed
	at org.apache.maven.wagon.AbstractWagon.getTransfer(AbstractWagon.java:363)
	at org.apache.maven.wagon.AbstractWagon.getTransfer(AbstractWagon.java:316)
	at org.apache.maven.wagon.AbstractWagon.getTransfer(AbstractWagon.java:285)
	at org.apache.maven.wagon.StreamWagon.getIfNewer(StreamWagon.java:97)
	at org.apache.maven.wagon.StreamWagon.get(StreamWagon.java:61)
	at org.eclipse.aether.transport.wagon.WagonTransporter$GetTaskRunner.run(WagonTransporter.java:560)
	at org.eclipse.aether.transport.wagon.WagonTransporter.execute(WagonTransporter.java:427)
	at org.eclipse.aether.transport.wagon.WagonTransporter.get(WagonTransporter.java:404)
	at org.eclipse.aether.connector.basic.BasicRepositoryConnector$GetTaskRunner.runTask(BasicRepositoryConnector.java:447)
	at org.eclipse.aether.connector.basic.BasicRepositoryConnector$TaskRunner.run(BasicRepositoryConnector.java:350)
	... 4 more
Caused by: java.net.SocketException: Connection reset
	at java.net.SocketInputStream.read(SocketInputStream.java:210)
	at java.net.SocketInputStream.read(SocketInputStream.java:141)
	at sun.security.ssl.InputRecord.readFully(InputRecord.java:465)
	at sun.security.ssl.InputRecord.readV3Record(InputRecord.java:593)
	at sun.security.ssl.InputRecord.read(InputRecord.java:532)
	at sun.security.ssl.SSLSocketImpl.readRecord(SSLSocketImpl.java:973)
	at sun.security.ssl.SSLSocketImpl.readDataRecord(SSLSocketImpl.java:930)
	at sun.security.ssl.AppInputStream.read(AppInputStream.java:105)
	at org.apache.maven.wagon.providers.http.httpclient.impl.io.SessionInputBufferImpl.streamRead(SessionInputBufferImpl.java:136)
	at org.apache.maven.wagon.providers.http.httpclient.impl.io.SessionInputBufferImpl.read(SessionInputBufferImpl.java:195)
	at org.apache.maven.wagon.providers.http.httpclient.impl.io.ContentLengthInputStream.read(ContentLengthInputStream.java:178)
	at org.apache.maven.wagon.providers.http.httpclient.conn.EofSensorInputStream.read(EofSensorInputStream.java:137)
	at org.apache.maven.wagon.AbstractWagon.transfer(AbstractWagon.java:531)
	at org.apache.maven.wagon.AbstractWagon.getTransfer(AbstractWagon.java:353)
	... 13 more
2017-06-24T18:25:48.560 [ERROR] 
2017-06-24T18:25:48.560 [ERROR] Re-run Maven using the -X switch to enable full debug logging.
2017-06-24T18:25:48.560 [ERROR] 
2017-06-24T18:25:48.560 [ERROR] For more information about the errors and possible solutions,
please read the following articles:
2017-06-24T18:25:48.560 [ERROR] [Help 1] http://cwiki.apache.org/confluence/display/MAVEN/DependencyResolutionException
2017-06-24T18:25:48.560 [ERROR] 
2017-06-24T18:25:48.560 [ERROR] After correcting the problems, you can resume the build with
the command
2017-06-24T18:25:48.560 [ERROR]   mvn <goals> -rf :beam-sdks-java-io-hcatalog
channel stopped
Not sending mail to unregistered user klk@google.com
Not sending mail to unregistered user github@nakomis.com
Not sending mail to unregistered user kirpichov@google.com

Mime
View raw message