beam-commits mailing list archives

Site index · List index
Message view « Date » · « Thread »
Top « Date » · « Thread »
From Apache Jenkins Server <jenk...@builds.apache.org>
Subject Build failed in Jenkins: beam_PostCommit_Java_JDK_Versions_Test » JDK 1.7 (latest),beam #109
Date Tue, 20 Jun 2017 18:09:46 GMT
See <https://builds.apache.org/job/beam_PostCommit_Java_JDK_Versions_Test/jdk=JDK%201.7%20(latest),label=beam/109/display/redirect?page=changes>

Changes:

[lcwik] Retries http code 0 (usually network error)

------------------------------------------
[...truncated 851.74 KB...]
2017-06-20\T\18:09:23.972 [INFO] Downloaded: https://repo.maven.apache.org/maven2/org/apache/hadoop/hadoop-yarn-server-web-proxy/2.5.1/hadoop-yarn-server-web-proxy-2.5.1.jar
(28 KB at 19.0 KB/sec)
2017-06-20\T\18:09:23.972 [INFO] Downloading: https://repo.maven.apache.org/maven2/org/apache/hadoop/hadoop-mapreduce-client-jobclient/2.5.1/hadoop-mapreduce-client-jobclient-2.5.1.jar
2017-06-20\T\18:09:24.001 [INFO] Downloaded: https://repo.maven.apache.org/maven2/org/apache/hadoop/hadoop-mapreduce-client-jobclient/2.5.1/hadoop-mapreduce-client-jobclient-2.5.1.jar
(35 KB at 23.3 KB/sec)
2017-06-20\T\18:09:24.001 [INFO] Downloading: https://repo.maven.apache.org/maven2/org/apache/hadoop/hadoop-mapreduce-client-hs/2.5.1/hadoop-mapreduce-client-hs-2.5.1.jar
2017-06-20\T\18:09:24.004 [INFO] Downloaded: https://repo.maven.apache.org/maven2/org/apache/hadoop/hadoop-mapreduce-client-app/2.5.1/hadoop-mapreduce-client-app-2.5.1.jar
(480 KB at 319.7 KB/sec)
2017-06-20\T\18:09:24.004 [INFO] Downloading: https://repo.maven.apache.org/maven2/org/apache/hadoop/hadoop-common/2.5.1/hadoop-common-2.5.1.jar
2017-06-20\T\18:09:24.062 [INFO] Downloaded: https://repo.maven.apache.org/maven2/org/apache/hadoop/hadoop-mapreduce-client-hs/2.5.1/hadoop-mapreduce-client-hs-2.5.1.jar
(228 KB at 146.0 KB/sec)
2017-06-20\T\18:09:24.062 [INFO] Downloading: https://repo.maven.apache.org/maven2/org/apache/hadoop/hadoop-annotations/2.5.1/hadoop-annotations-2.5.1.jar
2017-06-20\T\18:09:24.089 [INFO] Downloaded: https://repo.maven.apache.org/maven2/org/apache/hadoop/hadoop-annotations/2.5.1/hadoop-annotations-2.5.1.jar
(17 KB at 10.5 KB/sec)
2017-06-20\T\18:09:24.089 [INFO] Downloading: https://repo.maven.apache.org/maven2/commons-el/commons-el/1.0/commons-el-1.0.jar
2017-06-20\T\18:09:24.131 [INFO] Downloaded: https://repo.maven.apache.org/maven2/commons-el/commons-el/1.0/commons-el-1.0.jar
(110 KB at 67.4 KB/sec)
2017-06-20\T\18:09:24.131 [INFO] Downloading: https://repo.maven.apache.org/maven2/org/apache/hbase/hbase-hadoop-compat/1.2.6/hbase-hadoop-compat-1.2.6-tests.jar
2017-06-20\T\18:09:24.138 [INFO] Downloaded: https://repo.maven.apache.org/maven2/org/apache/hadoop/hadoop-yarn-api/2.5.1/hadoop-yarn-api-2.5.1.jar
(1612 KB at 986.0 KB/sec)
2017-06-20\T\18:09:24.138 [INFO] Downloading: https://repo.maven.apache.org/maven2/org/apache/hbase/hbase-hadoop2-compat/1.2.6/hbase-hadoop2-compat-1.2.6-tests.jar
2017-06-20\T\18:09:24.159 [INFO] Downloaded: https://repo.maven.apache.org/maven2/org/apache/hbase/hbase-hadoop-compat/1.2.6/hbase-hadoop-compat-1.2.6-tests.jar
(20 KB at 11.5 KB/sec)
2017-06-20\T\18:09:24.159 [INFO] Downloading: https://repo.maven.apache.org/maven2/org/apache/hbase/hbase-annotations/1.2.6/hbase-annotations-1.2.6.jar
2017-06-20\T\18:09:24.165 [INFO] Downloaded: https://repo.maven.apache.org/maven2/org/apache/hbase/hbase-hadoop2-compat/1.2.6/hbase-hadoop2-compat-1.2.6-tests.jar
(30 KB at 17.6 KB/sec)
2017-06-20\T\18:09:24.187 [INFO] Downloaded: https://repo.maven.apache.org/maven2/org/apache/hbase/hbase-annotations/1.2.6/hbase-annotations-1.2.6.jar
(21 KB at 12.1 KB/sec)
2017-06-20\T\18:09:24.196 [INFO] Downloaded: https://repo.maven.apache.org/maven2/org/apache/hadoop/hadoop-common/2.5.1/hadoop-common-2.5.1.jar
(2894 KB at 1708.9 KB/sec)
2017-06-20\T\18:09:24.414 [INFO] Downloaded: https://repo.maven.apache.org/maven2/org/apache/hbase/hbase-shaded-client/1.2.6/hbase-shaded-client-1.2.6.jar
(29957 KB at 15659.6 KB/sec)
2017-06-20\T\18:09:25.167 [INFO] Downloaded: https://repo.maven.apache.org/maven2/org/apache/hbase/hbase-shaded-server/1.2.6/hbase-shaded-server-1.2.6.jar
(50961 KB at 19122.3 KB/sec)
2017-06-20\T\18:09:25.182 [INFO] 
2017-06-20\T\18:09:25.182 [INFO] --- maven-clean-plugin:3.0.0:clean (default-clean) @ beam-sdks-java-io-hbase
---
2017-06-20\T\18:09:25.184 [INFO] Deleting <https://builds.apache.org/job/beam_PostCommit_Java_JDK_Versions_Test/jdk=JDK%201.7%20(latest),label=beam/ws/sdks/java/io/hbase>
(includes = [**/*.pyc, **/*.egg-info/, **/sdks/python/LICENSE, **/sdks/python/NOTICE, **/sdks/python/README.md],
excludes = [])
2017-06-20\T\18:09:25.185 [INFO] 
2017-06-20\T\18:09:25.185 [INFO] --- maven-enforcer-plugin:1.4.1:enforce (enforce) @ beam-sdks-java-io-hbase
---
2017-06-20\T\18:09:28.543 [INFO] 
2017-06-20\T\18:09:28.544 [INFO] --- maven-enforcer-plugin:1.4.1:enforce (enforce-banned-dependencies)
@ beam-sdks-java-io-hbase ---
2017-06-20\T\18:09:28.578 [INFO] 
2017-06-20\T\18:09:28.578 [INFO] --- maven-remote-resources-plugin:1.5:process (process-resource-bundles)
@ beam-sdks-java-io-hbase ---
2017-06-20\T\18:09:28.781 [INFO] 
2017-06-20\T\18:09:28.781 [INFO] --- maven-resources-plugin:3.0.2:resources (default-resources)
@ beam-sdks-java-io-hbase ---
2017-06-20\T\18:09:28.782 [INFO] Using 'UTF-8' encoding to copy filtered resources.
2017-06-20\T\18:09:28.782 [INFO] skip non existing resourceDirectory <https://builds.apache.org/job/beam_PostCommit_Java_JDK_Versions_Test/jdk=JDK%201.7%20(latest),label=beam/ws/sdks/java/io/hbase/src/main/resources>
2017-06-20\T\18:09:28.782 [INFO] Copying 3 resources
2017-06-20\T\18:09:28.783 [INFO] 
2017-06-20\T\18:09:28.783 [INFO] --- maven-compiler-plugin:3.6.1:compile (default-compile)
@ beam-sdks-java-io-hbase ---
2017-06-20\T\18:09:28.786 [INFO] Changes detected - recompiling the module!
2017-06-20\T\18:09:28.786 [INFO] Compiling 5 source files to <https://builds.apache.org/job/beam_PostCommit_Java_JDK_Versions_Test/jdk=JDK%201.7%20(latest),label=beam/ws/sdks/java/io/hbase/target/classes>
2017-06-20\T\18:09:29.944 [INFO] 
2017-06-20\T\18:09:29.944 [INFO] --- maven-compiler-plugin:3.6.1:compile (compile-package-info)
@ beam-sdks-java-io-hbase ---
2017-06-20\T\18:09:29.949 [INFO] Changes detected - recompiling the module!
2017-06-20\T\18:09:29.949 [INFO] Compiling 1 source file to <https://builds.apache.org/job/beam_PostCommit_Java_JDK_Versions_Test/jdk=JDK%201.7%20(latest),label=beam/ws/sdks/java/io/hbase/target/classes>
2017-06-20\T\18:09:30.005 [INFO] 
2017-06-20\T\18:09:30.006 [INFO] --- maven-resources-plugin:3.0.2:testResources (default-testResources)
@ beam-sdks-java-io-hbase ---
2017-06-20\T\18:09:30.007 [INFO] Using 'UTF-8' encoding to copy filtered resources.
2017-06-20\T\18:09:30.007 [INFO] Copying 1 resource
2017-06-20\T\18:09:30.008 [INFO] Copying 3 resources
2017-06-20\T\18:09:30.009 [INFO] 
2017-06-20\T\18:09:30.009 [INFO] --- maven-compiler-plugin:3.6.1:testCompile (default-testCompile)
@ beam-sdks-java-io-hbase ---
2017-06-20\T\18:09:30.018 [INFO] Changes detected - recompiling the module!
2017-06-20\T\18:09:30.018 [INFO] Compiling 5 source files to <https://builds.apache.org/job/beam_PostCommit_Java_JDK_Versions_Test/jdk=JDK%201.7%20(latest),label=beam/ws/sdks/java/io/hbase/target/test-classes>
2017-06-20\T\18:09:30.310 [INFO] 
2017-06-20\T\18:09:30.310 [INFO] --- maven-checkstyle-plugin:2.17:check (default) @ beam-sdks-java-io-hbase
---
2017-06-20\T\18:09:30.801 [INFO] Starting audit...
Audit done.
2017-06-20\T\18:09:30.801 [INFO] 
2017-06-20\T\18:09:30.801 [INFO] --- maven-surefire-plugin:2.20:test (default-test) @ beam-sdks-java-io-hbase
---
2017-06-20\T\18:09:30.804 [INFO] Surefire report directory: <https://builds.apache.org/job/beam_PostCommit_Java_JDK_Versions_Test/jdk=JDK%201.7%20(latest),label=beam/ws/sdks/java/io/hbase/target/surefire-reports>
2017-06-20\T\18:09:30.804 [INFO] Using configured provider org.apache.maven.surefire.junitcore.JUnitCoreProvider
2017-06-20\T\18:09:30.805 [INFO] parallel='all', perCoreThreadCount=true, threadCount=4, useUnlimitedThreads=false,
threadCountSuites=0, threadCountClasses=0, threadCountMethods=0, parallelOptimized=true
2017-06-20\T\18:09:30.805 [INFO] 
2017-06-20\T\18:09:30.805 [INFO] -------------------------------------------------------
2017-06-20\T\18:09:30.805 [INFO]  T E S T S
2017-06-20\T\18:09:30.805 [INFO] -------------------------------------------------------
2017-06-20\T\18:09:33.065 [INFO] Running org.apache.beam.sdk.io.hbase.HBaseCoderProviderRegistrarTest
2017-06-20\T\18:09:33.067 [INFO] Tests run: 2, Failures: 0, Errors: 0, Skipped: 0, Time elapsed:
0.287 s - in org.apache.beam.sdk.io.hbase.HBaseCoderProviderRegistrarTest
2017-06-20\T\18:09:33.067 [INFO] Running org.apache.beam.sdk.io.hbase.HBaseResultCoderTest
2017-06-20\T\18:09:33.068 [INFO] Tests run: 1, Failures: 0, Errors: 0, Skipped: 0, Time elapsed:
1.035 s - in org.apache.beam.sdk.io.hbase.HBaseResultCoderTest
2017-06-20\T\18:09:33.068 [INFO] Running org.apache.beam.sdk.io.hbase.HBaseMutationCoderTest
2017-06-20\T\18:09:33.070 [INFO] Tests run: 1, Failures: 0, Errors: 0, Skipped: 0, Time elapsed:
1.043 s - in org.apache.beam.sdk.io.hbase.HBaseMutationCoderTest
2017-06-20\T\18:09:33.070 [INFO] Running org.apache.beam.sdk.io.hbase.SerializableScanTest
2017-06-20\T\18:09:33.071 [INFO] Tests run: 2, Failures: 0, Errors: 0, Skipped: 0, Time elapsed:
0.827 s - in org.apache.beam.sdk.io.hbase.SerializableScanTest
2017-06-20\T\18:09:33.071 [INFO] Running org.apache.beam.sdk.io.hbase.HBaseIOTest
2017-06-20\T\18:09:33.074 [ERROR] Tests run: 1, Failures: 0, Errors: 1, Skipped: 0, Time elapsed:
0 s <<< FAILURE! - in org.apache.beam.sdk.io.hbase.HBaseIOTest
2017-06-20\T\18:09:33.074 [ERROR] org.apache.beam.sdk.io.hbase.HBaseIOTest  Time elapsed:
0 s  <<< ERROR!
java.io.IOException: Shutting down
	at org.apache.hadoop.hbase.MiniHBaseCluster.init(MiniHBaseCluster.java:235)
	at org.apache.hadoop.hbase.MiniHBaseCluster.<init>(MiniHBaseCluster.java:97)
	at org.apache.hadoop.hbase.HBaseTestingUtility.startMiniHBaseCluster(HBaseTestingUtility.java:1036)
	at org.apache.hadoop.hbase.HBaseTestingUtility.startMiniHBaseCluster(HBaseTestingUtility.java:1002)
	at org.apache.beam.sdk.io.hbase.HBaseIOTest.beforeClass(HBaseIOTest.java:102)
	at sun.reflect.NativeMethodAccessorImpl.invoke0(Native Method)
	at sun.reflect.NativeMethodAccessorImpl.invoke(NativeMethodAccessorImpl.java:57)
	at sun.reflect.DelegatingMethodAccessorImpl.invoke(DelegatingMethodAccessorImpl.java:43)
	at java.lang.reflect.Method.invoke(Method.java:606)
	at org.junit.runners.model.FrameworkMethod$1.runReflectiveCall(FrameworkMethod.java:50)
	at org.junit.internal.runners.model.ReflectiveCallable.run(ReflectiveCallable.java:12)
	at org.junit.runners.model.FrameworkMethod.invokeExplosively(FrameworkMethod.java:47)
	at org.junit.internal.runners.statements.RunBefores.evaluate(RunBefores.java:24)
	at org.junit.internal.runners.statements.RunAfters.evaluate(RunAfters.java:27)
	at org.junit.runners.ParentRunner.run(ParentRunner.java:363)
	at org.junit.runners.Suite.runChild(Suite.java:128)
	at org.junit.runners.Suite.runChild(Suite.java:27)
	at org.junit.runners.ParentRunner$3.run(ParentRunner.java:290)
	at org.apache.maven.surefire.junitcore.pc.Scheduler$1.run(Scheduler.java:393)
	at java.util.concurrent.Executors$RunnableAdapter.call(Executors.java:471)
	at java.util.concurrent.FutureTask.run(FutureTask.java:262)
	at java.util.concurrent.ThreadPoolExecutor.runWorker(ThreadPoolExecutor.java:1145)
	at java.util.concurrent.ThreadPoolExecutor$Worker.run(ThreadPoolExecutor.java:615)
	at java.lang.Thread.run(Thread.java:745)
Caused by: java.lang.RuntimeException: Failed construction of Master: class org.apache.hadoop.hbase.master.HMasterIllegal
character in path at index 89: file:<https://builds.apache.org/job/beam_PostCommit_Java_JDK_Versions_Test/jdk=JDK%201.7%20(latest),label=beam/ws/sdks/java/io/hbase/target/test-data/d67ce189-65f1-42c2-b7af-a8d46ca918b9>
	at org.apache.hadoop.hbase.util.JVMClusterUtil.createMasterThread(JVMClusterUtil.java:143)
	at org.apache.hadoop.hbase.LocalHBaseCluster.addMaster(LocalHBaseCluster.java:220)
	at org.apache.hadoop.hbase.LocalHBaseCluster.<init>(LocalHBaseCluster.java:155)
	at org.apache.hadoop.hbase.MiniHBaseCluster.init(MiniHBaseCluster.java:217)
	... 23 more
Caused by: java.lang.IllegalArgumentException: Illegal character in path at index 89: file:<https://builds.apache.org/job/beam_PostCommit_Java_JDK_Versions_Test/jdk=JDK%201.7%20(latest),label=beam/ws/sdks/java/io/hbase/target/test-data/d67ce189-65f1-42c2-b7af-a8d46ca918b9>
	at java.net.URI.create(URI.java:859)
	at org.apache.hadoop.fs.FileSystem.getDefaultUri(FileSystem.java:175)
	at org.apache.hadoop.fs.FileSystem.get(FileSystem.java:167)
	at org.apache.hadoop.hbase.fs.HFileSystem.<init>(HFileSystem.java:80)
	at org.apache.hadoop.hbase.regionserver.HRegionServer.initializeFileSystem(HRegionServer.java:613)
	at org.apache.hadoop.hbase.regionserver.HRegionServer.<init>(HRegionServer.java:564)
	at org.apache.hadoop.hbase.master.HMaster.<init>(HMaster.java:412)
	at sun.reflect.NativeConstructorAccessorImpl.newInstance0(Native Method)
	at sun.reflect.NativeConstructorAccessorImpl.newInstance(NativeConstructorAccessorImpl.java:57)
	at sun.reflect.DelegatingConstructorAccessorImpl.newInstance(DelegatingConstructorAccessorImpl.java:45)
	at java.lang.reflect.Constructor.newInstance(Constructor.java:526)
	at org.apache.hadoop.hbase.util.JVMClusterUtil.createMasterThread(JVMClusterUtil.java:139)
	... 26 more
Caused by: java.net.URISyntaxException: Illegal character in path at index 89: file:<https://builds.apache.org/job/beam_PostCommit_Java_JDK_Versions_Test/jdk=JDK%201.7%20(latest),label=beam/ws/sdks/java/io/hbase/target/test-data/d67ce189-65f1-42c2-b7af-a8d46ca918b9>
	at java.net.URI$Parser.fail(URI.java:2829)
	at java.net.URI$Parser.checkChars(URI.java:3002)
	at java.net.URI$Parser.parseHierarchical(URI.java:3086)
	at java.net.URI$Parser.parse(URI.java:3034)
	at java.net.URI.<init>(URI.java:595)
	at java.net.URI.create(URI.java:857)
	... 37 more

2017-06-20\T\18:09:33.405 [INFO] 
2017-06-20\T\18:09:33.405 [INFO] Results:
2017-06-20\T\18:09:33.405 [INFO] 
2017-06-20\T\18:09:33.405 [ERROR] Errors: 
2017-06-20\T\18:09:33.405 [ERROR]   HBaseIOTest.beforeClass:102 » IO Shutting down
2017-06-20\T\18:09:33.405 [INFO] 
2017-06-20\T\18:09:33.405 [ERROR] Tests run: 7, Failures: 0, Errors: 1, Skipped: 0
2017-06-20\T\18:09:33.405 [INFO] 
2017-06-20\T\18:09:33.406 [INFO] ------------------------------------------------------------------------
2017-06-20\T\18:09:33.406 [INFO] Reactor Summary:
2017-06-20\T\18:09:33.406 [INFO] 
2017-06-20\T\18:09:33.406 [INFO] Apache Beam :: Parent .............................. SUCCESS
[ 19.674 s]
2017-06-20\T\18:09:33.406 [INFO] Apache Beam :: SDKs :: Java :: Build Tools ......... SUCCESS
[  5.592 s]
2017-06-20\T\18:09:33.406 [INFO] Apache Beam :: SDKs ................................ SUCCESS
[  0.438 s]
2017-06-20\T\18:09:33.406 [INFO] Apache Beam :: SDKs :: Common ...................... SUCCESS
[  0.405 s]
2017-06-20\T\18:09:33.406 [INFO] Apache Beam :: SDKs :: Common :: Runner API ........ SUCCESS
[  6.292 s]
2017-06-20\T\18:09:33.406 [INFO] Apache Beam :: SDKs :: Common :: Fn API ............ SUCCESS
[  4.497 s]
2017-06-20\T\18:09:33.406 [INFO] Apache Beam :: SDKs :: Java ........................ SUCCESS
[  0.923 s]
2017-06-20\T\18:09:33.406 [INFO] Apache Beam :: SDKs :: Java :: Core ................ SUCCESS
[01:11 min]
2017-06-20\T\18:09:33.406 [INFO] Apache Beam :: Runners ............................. SUCCESS
[  0.406 s]
2017-06-20\T\18:09:33.406 [INFO] Apache Beam :: Runners :: Core Construction Java ... SUCCESS
[ 10.399 s]
2017-06-20\T\18:09:33.406 [INFO] Apache Beam :: Runners :: Core Java ................ SUCCESS
[ 24.005 s]
2017-06-20\T\18:09:33.406 [INFO] Apache Beam :: Runners :: Direct Java .............. SUCCESS
[03:00 min]
2017-06-20\T\18:09:33.406 [INFO] Apache Beam :: SDKs :: Java :: IO .................. SUCCESS
[  0.415 s]
2017-06-20\T\18:09:33.406 [INFO] Apache Beam :: SDKs :: Java :: IO :: Common ........ SUCCESS
[  2.599 s]
2017-06-20\T\18:09:33.407 [INFO] Apache Beam :: SDKs :: Java :: IO :: Cassandra ..... SUCCESS
[ 14.608 s]
2017-06-20\T\18:09:33.407 [INFO] Apache Beam :: SDKs :: Java :: IO :: Elasticsearch . SUCCESS
[ 22.699 s]
2017-06-20\T\18:09:33.407 [INFO] Apache Beam :: SDKs :: Java :: Extensions .......... SUCCESS
[  0.393 s]
2017-06-20\T\18:09:33.407 [INFO] Apache Beam :: SDKs :: Java :: Extensions :: Google Cloud
Platform Core SUCCESS [ 20.834 s]
2017-06-20\T\18:09:33.407 [INFO] Apache Beam :: SDKs :: Java :: Extensions :: Protobuf SUCCESS
[  7.890 s]
2017-06-20\T\18:09:33.407 [INFO] Apache Beam :: SDKs :: Java :: IO :: Google Cloud Platform
SUCCESS [ 48.498 s]
2017-06-20\T\18:09:33.407 [INFO] Apache Beam :: SDKs :: Java :: IO :: Hadoop Common . SUCCESS
[ 10.699 s]
2017-06-20\T\18:09:33.407 [INFO] Apache Beam :: SDKs :: Java :: IO :: Hadoop File System SUCCESS
[ 21.773 s]
2017-06-20\T\18:09:33.407 [INFO] Apache Beam :: SDKs :: Java :: IO :: Hadoop ........ SUCCESS
[  2.718 s]
2017-06-20\T\18:09:33.407 [INFO] Apache Beam :: SDKs :: Java :: IO :: Hadoop :: input-format
SUCCESS [  9.480 s]
2017-06-20\T\18:09:33.407 [INFO] Apache Beam :: SDKs :: Java :: IO :: HBase ......... FAILURE
[ 12.765 s]
2017-06-20\T\18:09:33.407 [INFO] Apache Beam :: SDKs :: Java :: IO :: HCatalog ...... SKIPPED
2017-06-20\T\18:09:33.407 [INFO] Apache Beam :: Runners :: Google Cloud Dataflow .... SKIPPED
2017-06-20\T\18:09:33.407 [INFO] Apache Beam :: SDKs :: Java :: IO :: JDBC .......... SKIPPED
2017-06-20\T\18:09:33.407 [INFO] Apache Beam :: SDKs :: Java :: IO :: JMS ........... SKIPPED
2017-06-20\T\18:09:33.407 [INFO] Apache Beam :: SDKs :: Java :: IO :: Kafka ......... SKIPPED
2017-06-20\T\18:09:33.407 [INFO] Apache Beam :: SDKs :: Java :: IO :: Kinesis ....... SKIPPED
2017-06-20\T\18:09:33.407 [INFO] Apache Beam :: SDKs :: Java :: IO :: MongoDB ....... SKIPPED
2017-06-20\T\18:09:33.407 [INFO] Apache Beam :: SDKs :: Java :: IO :: MQTT .......... SKIPPED
2017-06-20\T\18:09:33.407 [INFO] Apache Beam :: SDKs :: Java :: IO :: XML ........... SKIPPED
2017-06-20\T\18:09:33.407 [INFO] Apache Beam :: SDKs :: Java :: Maven Archetypes .... SKIPPED
2017-06-20\T\18:09:33.407 [INFO] Apache Beam :: SDKs :: Java :: Maven Archetypes :: Starter
SKIPPED
2017-06-20\T\18:09:33.407 [INFO] Apache Beam :: Examples ............................ SKIPPED
2017-06-20\T\18:09:33.407 [INFO] Apache Beam :: Examples :: Java .................... SKIPPED
2017-06-20\T\18:09:33.407 [INFO] Apache Beam :: SDKs :: Java :: Maven Archetypes :: Examples
SKIPPED
2017-06-20\T\18:09:33.407 [INFO] Apache Beam :: SDKs :: Java :: Extensions :: Jackson SKIPPED
2017-06-20\T\18:09:33.407 [INFO] Apache Beam :: SDKs :: Java :: Extensions :: Join library
SKIPPED
2017-06-20\T\18:09:33.407 [INFO] Apache Beam :: SDKs :: Java :: Extensions :: Sorter  SKIPPED
2017-06-20\T\18:09:33.407 [INFO] Apache Beam :: Runners :: Flink .................... SKIPPED
2017-06-20\T\18:09:33.407 [INFO] Apache Beam :: Runners :: Spark .................... SKIPPED
2017-06-20\T\18:09:33.407 [INFO] Apache Beam :: SDKs :: Java :: Aggregated Javadoc .. SKIPPED
2017-06-20\T\18:09:33.407 [INFO] ------------------------------------------------------------------------
2017-06-20\T\18:09:33.407 [INFO] BUILD FAILURE
2017-06-20\T\18:09:33.407 [INFO] ------------------------------------------------------------------------
2017-06-20\T\18:09:33.407 [INFO] Total time: 08:23 min
2017-06-20\T\18:09:33.407 [INFO] Finished at: 2017-06-20T18:09:33+00:00
2017-06-20\T\18:09:34.345 [INFO] Final Memory: 170M/1693M
2017-06-20\T\18:09:34.345 [INFO] ------------------------------------------------------------------------
2017-06-20\T\18:09:34.346 [ERROR] Failed to execute goal org.apache.maven.plugins:maven-surefire-plugin:2.20:test
(default-test) on project beam-sdks-java-io-hbase: There are test failures.
2017-06-20\T\18:09:34.346 [ERROR] 
2017-06-20\T\18:09:34.346 [ERROR] Please refer to <https://builds.apache.org/job/beam_PostCommit_Java_JDK_Versions_Test/jdk=JDK%201.7%20(latest),label=beam/ws/sdks/java/io/hbase/target/surefire-reports>
for the individual test results.
2017-06-20\T\18:09:34.346 [ERROR] Please refer to dump files (if any exist) [date]-jvmRun[N].dump,
[date].dumpstream and [date]-jvmRun[N].dumpstream.
2017-06-20\T\18:09:34.346 [ERROR] -> [Help 1]
org.apache.maven.lifecycle.LifecycleExecutionException: Failed to execute goal org.apache.maven.plugins:maven-surefire-plugin:2.20:test
(default-test) on project beam-sdks-java-io-hbase: There are test failures.

Please refer to <https://builds.apache.org/job/beam_PostCommit_Java_JDK_Versions_Test/jdk=JDK%201.7%20(latest),label=beam/ws/sdks/java/io/hbase/target/surefire-reports>
for the individual test results.
Please refer to dump files (if any exist) [date]-jvmRun[N].dump, [date].dumpstream and [date]-jvmRun[N].dumpstream.
	at org.apache.maven.lifecycle.internal.MojoExecutor.execute(MojoExecutor.java:212)
	at org.apache.maven.lifecycle.internal.MojoExecutor.execute(MojoExecutor.java:153)
	at org.apache.maven.lifecycle.internal.MojoExecutor.execute(MojoExecutor.java:145)
	at org.apache.maven.lifecycle.internal.LifecycleModuleBuilder.buildProject(LifecycleModuleBuilder.java:116)
	at org.apache.maven.lifecycle.internal.LifecycleModuleBuilder.buildProject(LifecycleModuleBuilder.java:80)
	at org.apache.maven.lifecycle.internal.builder.singlethreaded.SingleThreadedBuilder.build(SingleThreadedBuilder.java:51)
	at org.apache.maven.lifecycle.internal.LifecycleStarter.execute(LifecycleStarter.java:128)
	at org.apache.maven.DefaultMaven.doExecute(DefaultMaven.java:307)
	at org.apache.maven.DefaultMaven.doExecute(DefaultMaven.java:193)
	at org.apache.maven.DefaultMaven.execute(DefaultMaven.java:106)
	at org.apache.maven.cli.MavenCli.execute(MavenCli.java:862)
	at org.apache.maven.cli.MavenCli.doMain(MavenCli.java:286)
	at org.apache.maven.cli.MavenCli.main(MavenCli.java:197)
	at sun.reflect.NativeMethodAccessorImpl.invoke0(Native Method)
	at sun.reflect.NativeMethodAccessorImpl.invoke(NativeMethodAccessorImpl.java:57)
	at sun.reflect.DelegatingMethodAccessorImpl.invoke(DelegatingMethodAccessorImpl.java:43)
	at java.lang.reflect.Method.invoke(Method.java:606)
	at org.codehaus.plexus.classworlds.launcher.Launcher.launchEnhanced(Launcher.java:289)
	at org.codehaus.plexus.classworlds.launcher.Launcher.launch(Launcher.java:229)
	at org.codehaus.plexus.classworlds.launcher.Launcher.mainWithExitCode(Launcher.java:415)
	at org.codehaus.plexus.classworlds.launcher.Launcher.main(Launcher.java:356)
Caused by: org.apache.maven.plugin.MojoFailureException: There are test failures.

Please refer to <https://builds.apache.org/job/beam_PostCommit_Java_JDK_Versions_Test/jdk=JDK%201.7%20(latest),label=beam/ws/sdks/java/io/hbase/target/surefire-reports>
for the individual test results.
Please refer to dump files (if any exist) [date]-jvmRun[N].dump, [date].dumpstream and [date]-jvmRun[N].dumpstream.
	at org.apache.maven.plugin.surefire.SurefireHelper.throwException(SurefireHelper.java:204)
	at org.apache.maven.plugin.surefire.SurefireHelper.reportExecution(SurefireHelper.java:98)
	at org.apache.maven.plugin.surefire.SurefirePlugin.handleSummary(SurefirePlugin.java:334)
	at org.apache.maven.plugin.surefire.AbstractSurefireMojo.executeAfterPreconditionsChecked(AbstractSurefireMojo.java:937)
	at org.apache.maven.plugin.surefire.AbstractSurefireMojo.execute(AbstractSurefireMojo.java:785)
	at org.apache.maven.plugin.DefaultBuildPluginManager.executeMojo(DefaultBuildPluginManager.java:134)
	at org.apache.maven.lifecycle.internal.MojoExecutor.execute(MojoExecutor.java:208)
	... 20 more
2017-06-20\T\18:09:34.347 [ERROR] 
2017-06-20\T\18:09:34.347 [ERROR] Re-run Maven using the -X switch to enable full debug logging.
2017-06-20\T\18:09:34.347 [ERROR] 
2017-06-20\T\18:09:34.347 [ERROR] For more information about the errors and possible solutions,
please read the following articles:
2017-06-20\T\18:09:34.347 [ERROR] [Help 1] http://cwiki.apache.org/confluence/display/MAVEN/MojoFailureException
2017-06-20\T\18:09:34.347 [ERROR] 
2017-06-20\T\18:09:34.347 [ERROR] After correcting the problems, you can resume the build
with the command
2017-06-20\T\18:09:34.347 [ERROR]   mvn <goals> -rf :beam-sdks-java-io-hbase
Build step 'Invoke top-level Maven targets' marked build as failure
Not sending mail to unregistered user aljoscha.krettek@gmail.com
Not sending mail to unregistered user hepei.hp@alibaba-inc.com
Not sending mail to unregistered user klk@google.com
Not sending mail to unregistered user ccy@google.com
Not sending mail to unregistered user kirpichov@google.com

Mime
View raw message