beam-commits mailing list archives

Site index · List index
Message view « Date » · « Thread »
Top « Date » · « Thread »
From Apache Jenkins Server <jenk...@builds.apache.org>
Subject Build failed in Jenkins: beam_PostCommit_Java_JDK_Versions_Test » JDK 1.7 (latest),beam #69
Date Sat, 10 Jun 2017 18:30:22 GMT
See <https://builds.apache.org/job/beam_PostCommit_Java_JDK_Versions_Test/jdk=JDK%201.7%20(latest),label=beam/69/display/redirect>

------------------------------------------
[...truncated 1.60 MB...]
  [javadoc] <https://builds.apache.org/job/beam_PostCommit_Java_JDK_Versions_Test/jdk=JDK%201.7%20(latest),label=beam/ws/sdks/java/javadoc/target/collected/org/apache/beam/sdk/testing/SourceTestUtils.java>:145:
warning - Tag @link: reference not found: Source.Reader
  [javadoc] <https://builds.apache.org/job/beam_PostCommit_Java_JDK_Versions_Test/jdk=JDK%201.7%20(latest),label=beam/ws/sdks/java/javadoc/target/collected/org/apache/beam/sdk/testing/SourceTestUtils.java>:168:
warning - Tag @link: reference not found: Source.Reader
  [javadoc] <https://builds.apache.org/job/beam_PostCommit_Java_JDK_Versions_Test/jdk=JDK%201.7%20(latest),label=beam/ws/sdks/java/javadoc/target/collected/org/apache/beam/sdk/testing/SourceTestUtils.java>:168:
warning - Tag @link: reference not found: Source.Reader#start
  [javadoc] <https://builds.apache.org/job/beam_PostCommit_Java_JDK_Versions_Test/jdk=JDK%201.7%20(latest),label=beam/ws/sdks/java/javadoc/target/collected/org/apache/beam/sdk/testing/SourceTestUtils.java>:159:
warning - Tag @link: reference not found: Source.Reader
  [javadoc] <https://builds.apache.org/job/beam_PostCommit_Java_JDK_Versions_Test/jdk=JDK%201.7%20(latest),label=beam/ws/sdks/java/javadoc/target/collected/org/apache/beam/sdk/testing/SourceTestUtils.java>:200:
warning - Tag @link: reference not found: Source.Reader
  [javadoc] <https://builds.apache.org/job/beam_PostCommit_Java_JDK_Versions_Test/jdk=JDK%201.7%20(latest),label=beam/ws/sdks/java/javadoc/target/collected/org/apache/beam/sdk/io/CompressedSource.java>:534:
warning - Tag @link: reference not found: FileBasedReader#startReading(ReadableByteChannel)
  [javadoc] <https://builds.apache.org/job/beam_PostCommit_Java_JDK_Versions_Test/jdk=JDK%201.7%20(latest),label=beam/ws/sdks/java/javadoc/target/collected/org/apache/beam/sdk/io/cassandra/CassandraServiceImpl.java>:376:
warning - Tag @link: reference not found: Mapper
  [javadoc] <https://builds.apache.org/job/beam_PostCommit_Java_JDK_Versions_Test/jdk=JDK%201.7%20(latest),label=beam/ws/sdks/java/javadoc/target/collected/org/apache/beam/sdk/io/cassandra/CassandraServiceImpl.java>:376:
warning - Tag @link: reference not found: MappingManager
  [javadoc] Building index for all classes...
  [javadoc] Generating <https://builds.apache.org/job/beam_PostCommit_Java_JDK_Versions_Test/jdk=JDK%201.7%20(latest),label=beam/ws/sdks/java/target/site/javadoc/help-doc.html...>
  [javadoc] 15 errors
  [javadoc] 188 warnings
2017-06-10\T\18:30:10.074 [INFO] ------------------------------------------------------------------------
2017-06-10\T\18:30:10.074 [INFO] Reactor Summary:
2017-06-10\T\18:30:10.074 [INFO] 
2017-06-10\T\18:30:10.075 [INFO] Apache Beam :: Parent .............................. SUCCESS
[ 20.696 s]
2017-06-10\T\18:30:10.075 [INFO] Apache Beam :: SDKs :: Java :: Build Tools ......... SUCCESS
[  5.935 s]
2017-06-10\T\18:30:10.075 [INFO] Apache Beam :: SDKs ................................ SUCCESS
[  0.597 s]
2017-06-10\T\18:30:10.075 [INFO] Apache Beam :: SDKs :: Common ...................... SUCCESS
[  0.511 s]
2017-06-10\T\18:30:10.075 [INFO] Apache Beam :: SDKs :: Common :: Runner API ........ SUCCESS
[  7.571 s]
2017-06-10\T\18:30:10.075 [INFO] Apache Beam :: SDKs :: Common :: Fn API ............ SUCCESS
[  5.423 s]
2017-06-10\T\18:30:10.075 [INFO] Apache Beam :: SDKs :: Java ........................ SUCCESS
[  0.434 s]
2017-06-10\T\18:30:10.075 [INFO] Apache Beam :: SDKs :: Java :: Core ................ SUCCESS
[01:18 min]
2017-06-10\T\18:30:10.075 [INFO] Apache Beam :: Runners ............................. SUCCESS
[  0.434 s]
2017-06-10\T\18:30:10.075 [INFO] Apache Beam :: Runners :: Core Construction Java ... SUCCESS
[ 12.414 s]
2017-06-10\T\18:30:10.075 [INFO] Apache Beam :: Runners :: Core Java ................ SUCCESS
[ 25.665 s]
2017-06-10\T\18:30:10.075 [INFO] Apache Beam :: Runners :: Direct Java .............. SUCCESS
[02:58 min]
2017-06-10\T\18:30:10.075 [INFO] Apache Beam :: SDKs :: Java :: IO .................. SUCCESS
[  0.401 s]
2017-06-10\T\18:30:10.075 [INFO] Apache Beam :: SDKs :: Java :: IO :: Common ........ SUCCESS
[  2.702 s]
2017-06-10\T\18:30:10.075 [INFO] Apache Beam :: SDKs :: Java :: IO :: Cassandra ..... SUCCESS
[ 14.595 s]
2017-06-10\T\18:30:10.075 [INFO] Apache Beam :: SDKs :: Java :: IO :: Elasticsearch . SUCCESS
[ 23.301 s]
2017-06-10\T\18:30:10.075 [INFO] Apache Beam :: SDKs :: Java :: Extensions .......... SUCCESS
[  0.428 s]
2017-06-10\T\18:30:10.075 [INFO] Apache Beam :: SDKs :: Java :: Extensions :: Google Cloud
Platform Core SUCCESS [ 23.653 s]
2017-06-10\T\18:30:10.075 [INFO] Apache Beam :: SDKs :: Java :: Extensions :: Protobuf SUCCESS
[  8.463 s]
2017-06-10\T\18:30:10.075 [INFO] Apache Beam :: SDKs :: Java :: IO :: Google Cloud Platform
SUCCESS [ 51.832 s]
2017-06-10\T\18:30:10.075 [INFO] Apache Beam :: SDKs :: Java :: IO :: Hadoop Common . SUCCESS
[ 10.998 s]
2017-06-10\T\18:30:10.075 [INFO] Apache Beam :: SDKs :: Java :: IO :: Hadoop File System SUCCESS
[ 22.260 s]
2017-06-10\T\18:30:10.075 [INFO] Apache Beam :: SDKs :: Java :: IO :: Hadoop ........ SUCCESS
[  2.979 s]
2017-06-10\T\18:30:10.075 [INFO] Apache Beam :: SDKs :: Java :: IO :: Hadoop :: input-format
SUCCESS [  9.576 s]
2017-06-10\T\18:30:10.075 [INFO] Apache Beam :: SDKs :: Java :: IO :: HBase ......... SUCCESS
[ 50.659 s]
2017-06-10\T\18:30:10.075 [INFO] Apache Beam :: SDKs :: Java :: IO :: HCatalog ...... SUCCESS
[ 48.856 s]
2017-06-10\T\18:30:10.075 [INFO] Apache Beam :: Runners :: Google Cloud Dataflow .... SUCCESS
[05:34 min]
2017-06-10\T\18:30:10.075 [INFO] Apache Beam :: SDKs :: Java :: IO :: JDBC .......... SUCCESS
[ 18.695 s]
2017-06-10\T\18:30:10.075 [INFO] Apache Beam :: SDKs :: Java :: IO :: JMS ........... SUCCESS
[ 10.502 s]
2017-06-10\T\18:30:10.075 [INFO] Apache Beam :: SDKs :: Java :: IO :: Kafka ......... SUCCESS
[ 24.328 s]
2017-06-10\T\18:30:10.075 [INFO] Apache Beam :: SDKs :: Java :: IO :: Kinesis ....... SUCCESS
[ 11.763 s]
2017-06-10\T\18:30:10.075 [INFO] Apache Beam :: SDKs :: Java :: IO :: MongoDB ....... SUCCESS
[ 20.428 s]
2017-06-10\T\18:30:10.075 [INFO] Apache Beam :: SDKs :: Java :: IO :: MQTT .......... SUCCESS
[ 10.298 s]
2017-06-10\T\18:30:10.075 [INFO] Apache Beam :: SDKs :: Java :: IO :: XML ........... SUCCESS
[ 13.351 s]
2017-06-10\T\18:30:10.075 [INFO] Apache Beam :: SDKs :: Java :: Maven Archetypes .... SUCCESS
[  0.397 s]
2017-06-10\T\18:30:10.075 [INFO] Apache Beam :: SDKs :: Java :: Maven Archetypes :: Starter
SUCCESS [ 11.063 s]
2017-06-10\T\18:30:10.075 [INFO] Apache Beam :: Examples ............................ SUCCESS
[  0.410 s]
2017-06-10\T\18:30:10.075 [INFO] Apache Beam :: Examples :: Java .................... SUCCESS
[06:45 min]
2017-06-10\T\18:30:10.075 [INFO] Apache Beam :: SDKs :: Java :: Maven Archetypes :: Examples
SUCCESS [ 25.176 s]
2017-06-10\T\18:30:10.075 [INFO] Apache Beam :: SDKs :: Java :: Extensions :: Jackson SUCCESS
[  7.155 s]
2017-06-10\T\18:30:10.075 [INFO] Apache Beam :: SDKs :: Java :: Extensions :: Join library
SUCCESS [  9.120 s]
2017-06-10\T\18:30:10.075 [INFO] Apache Beam :: SDKs :: Java :: Extensions :: Sorter  SUCCESS
[ 21.340 s]
2017-06-10\T\18:30:10.075 [INFO] Apache Beam :: Runners :: Flink .................... SUCCESS
[ 19.474 s]
2017-06-10\T\18:30:10.075 [INFO] Apache Beam :: Runners :: Spark .................... SUCCESS
[02:39 min]
2017-06-10\T\18:30:10.076 [INFO] Apache Beam :: SDKs :: Java :: Aggregated Javadoc .. FAILURE
[ 29.554 s]
2017-06-10\T\18:30:10.076 [INFO] ------------------------------------------------------------------------
2017-06-10\T\18:30:10.076 [INFO] BUILD FAILURE
2017-06-10\T\18:30:10.076 [INFO] ------------------------------------------------------------------------
2017-06-10\T\18:30:10.076 [INFO] Total time: 29:03 min
2017-06-10\T\18:30:10.076 [INFO] Finished at: 2017-06-10T18:30:10+00:00
2017-06-10\T\18:30:10.625 [INFO] Final Memory: 198M/2081M
2017-06-10\T\18:30:10.625 [INFO] ------------------------------------------------------------------------
2017-06-10\T\18:30:10.626 [ERROR] Failed to execute goal org.apache.maven.plugins:maven-antrun-plugin:1.8:run
(document) on project beam-sdks-java-javadoc: An Ant BuildException has occured: The following
error occurred while executing this line:
2017-06-10\T\18:30:10.626 [ERROR] java.lang.OutOfMemoryError: PermGen space
2017-06-10\T\18:30:10.626 [ERROR] around Ant part ...<ant antfile="<https://builds.apache.org/job/beam_PostCommit_Java_JDK_Versions_Test/jdk=JDK%201.7%20(latest),label=beam/ws/sdks/java/javadoc/ant.xml">...>
@ 8:153 in <https://builds.apache.org/job/beam_PostCommit_Java_JDK_Versions_Test/jdk=JDK%201.7%20(latest),label=beam/ws/sdks/java/javadoc/target/antrun/build-main.xml>
2017-06-10\T\18:30:10.626 [ERROR] -> [Help 1]
org.apache.maven.lifecycle.LifecycleExecutionException: Failed to execute goal org.apache.maven.plugins:maven-antrun-plugin:1.8:run
(document) on project beam-sdks-java-javadoc: An Ant BuildException has occured: The following
error occurred while executing this line:
java.lang.OutOfMemoryError: PermGen space
around Ant part ...<ant antfile="<https://builds.apache.org/job/beam_PostCommit_Java_JDK_Versions_Test/jdk=JDK%201.7%20(latest),label=beam/ws/sdks/java/javadoc/ant.xml">...>
@ 8:153 in <https://builds.apache.org/job/beam_PostCommit_Java_JDK_Versions_Test/jdk=JDK%201.7%20(latest),label=beam/ws/sdks/java/javadoc/target/antrun/build-main.xml>
	at org.apache.maven.lifecycle.internal.MojoExecutor.execute(MojoExecutor.java:216)
	at org.apache.maven.lifecycle.internal.MojoExecutor.execute(MojoExecutor.java:153)
	at org.apache.maven.lifecycle.internal.MojoExecutor.execute(MojoExecutor.java:145)
	at org.apache.maven.lifecycle.internal.LifecycleModuleBuilder.buildProject(LifecycleModuleBuilder.java:116)
	at org.apache.maven.lifecycle.internal.LifecycleModuleBuilder.buildProject(LifecycleModuleBuilder.java:80)
	at org.apache.maven.lifecycle.internal.builder.singlethreaded.SingleThreadedBuilder.build(SingleThreadedBuilder.java:51)
	at org.apache.maven.lifecycle.internal.LifecycleStarter.execute(LifecycleStarter.java:128)
	at org.apache.maven.DefaultMaven.doExecute(DefaultMaven.java:307)
	at org.apache.maven.DefaultMaven.doExecute(DefaultMaven.java:193)
	at org.apache.maven.DefaultMaven.execute(DefaultMaven.java:106)
	at org.apache.maven.cli.MavenCli.execute(MavenCli.java:862)
	at org.apache.maven.cli.MavenCli.doMain(MavenCli.java:286)
	at org.apache.maven.cli.MavenCli.main(MavenCli.java:197)
	at sun.reflect.NativeMethodAccessorImpl.invoke0(Native Method)
	at sun.reflect.NativeMethodAccessorImpl.invoke(NativeMethodAccessorImpl.java:57)
	at sun.reflect.DelegatingMethodAccessorImpl.invoke(DelegatingMethodAccessorImpl.java:43)
	at java.lang.reflect.Method.invoke(Method.java:606)
	at org.codehaus.plexus.classworlds.launcher.Launcher.launchEnhanced(Launcher.java:289)
	at org.codehaus.plexus.classworlds.launcher.Launcher.launch(Launcher.java:229)
	at org.codehaus.plexus.classworlds.launcher.Launcher.mainWithExitCode(Launcher.java:415)
	at org.codehaus.plexus.classworlds.launcher.Launcher.main(Launcher.java:356)
Caused by: org.apache.maven.plugin.MojoExecutionException: An Ant BuildException has occured:
The following error occurred while executing this line:
java.lang.OutOfMemoryError: PermGen space
around Ant part ...<ant antfile="<https://builds.apache.org/job/beam_PostCommit_Java_JDK_Versions_Test/jdk=JDK%201.7%20(latest),label=beam/ws/sdks/java/javadoc/ant.xml">...>
@ 8:153 in <https://builds.apache.org/job/beam_PostCommit_Java_JDK_Versions_Test/jdk=JDK%201.7%20(latest),label=beam/ws/sdks/java/javadoc/target/antrun/build-main.xml>
	at org.apache.maven.plugin.antrun.AntRunMojo.execute(AntRunMojo.java:342)
	at org.apache.maven.plugin.DefaultBuildPluginManager.executeMojo(DefaultBuildPluginManager.java:134)
	at org.apache.maven.lifecycle.internal.MojoExecutor.execute(MojoExecutor.java:208)
	... 20 more
Caused by: <https://builds.apache.org/job/beam_PostCommit_Java_JDK_Versions_Test/jdk=JDK%201.7%20(latest),label=beam/ws/sdks/java/javadoc/target/antrun/build-main.xml>:8:
The following error occurred while executing this line:
java.lang.OutOfMemoryError: PermGen space
	at org.apache.tools.ant.ProjectHelper.addLocationToBuildException(ProjectHelper.java:568)
	at org.apache.tools.ant.taskdefs.Ant.execute(Ant.java:443)
	at org.apache.tools.ant.UnknownElement.execute(UnknownElement.java:292)
	at sun.reflect.NativeMethodAccessorImpl.invoke0(Native Method)
	at sun.reflect.NativeMethodAccessorImpl.invoke(NativeMethodAccessorImpl.java:57)
	at sun.reflect.DelegatingMethodAccessorImpl.invoke(DelegatingMethodAccessorImpl.java:43)
	at java.lang.reflect.Method.invoke(Method.java:606)
	at org.apache.tools.ant.dispatch.DispatchUtils.execute(DispatchUtils.java:106)
	at org.apache.tools.ant.Task.perform(Task.java:348)
	at org.apache.tools.ant.Target.execute(Target.java:435)
	at org.apache.tools.ant.Target.performTasks(Target.java:456)
	at org.apache.tools.ant.Project.executeSortedTargets(Project.java:1393)
	at org.apache.tools.ant.Project.executeTarget(Project.java:1364)
	at org.apache.maven.plugin.antrun.AntRunMojo.execute(AntRunMojo.java:313)
	... 22 more
Caused by: java.lang.OutOfMemoryError: PermGen space
	at org.apache.tools.ant.Project.executeSortedTargets(Project.java:1402)
	at org.apache.tools.ant.helper.SingleCheckExecutor.executeTargets(SingleCheckExecutor.java:38)
	at org.apache.tools.ant.Project.executeTargets(Project.java:1248)
	at org.apache.tools.ant.taskdefs.Ant.execute(Ant.java:441)
	... 34 more
Caused by: java.lang.OutOfMemoryError: PermGen space
	at java.lang.ClassLoader.defineClass1(Native Method)
	at java.lang.ClassLoader.defineClass(ClassLoader.java:800)
	at java.security.SecureClassLoader.defineClass(SecureClassLoader.java:142)
	at java.net.URLClassLoader.defineClass(URLClassLoader.java:449)
	at java.net.URLClassLoader.access$100(URLClassLoader.java:71)
	at java.net.URLClassLoader$1.run(URLClassLoader.java:361)
	at java.net.URLClassLoader$1.run(URLClassLoader.java:355)
	at java.security.AccessController.doPrivileged(Native Method)
	at java.net.URLClassLoader.findClass(URLClassLoader.java:354)
	at org.codehaus.plexus.classworlds.realm.ClassRealm.loadClassFromSelf(ClassRealm.java:401)
	at org.codehaus.plexus.classworlds.strategy.SelfFirstStrategy.loadClass(SelfFirstStrategy.java:42)
	at org.codehaus.plexus.classworlds.realm.ClassRealm.unsynchronizedLoadClass(ClassRealm.java:271)
	at org.codehaus.plexus.classworlds.realm.ClassRealm.loadClass(ClassRealm.java:247)
	at org.codehaus.plexus.classworlds.realm.ClassRealm.loadClass(ClassRealm.java:239)
	at java.lang.Class.forName0(Native Method)
	at java.lang.Class.forName(Class.java:195)
	at org.apache.tools.ant.AntTypeDefinition.innerGetTypeClass(AntTypeDefinition.java:192)
	at org.apache.tools.ant.AntTypeDefinition.getTypeClass(AntTypeDefinition.java:168)
	at org.apache.tools.ant.AntTypeDefinition.icreate(AntTypeDefinition.java:215)
	at org.apache.tools.ant.AntTypeDefinition.create(AntTypeDefinition.java:206)
	at org.apache.tools.ant.ComponentHelper.createComponent(ComponentHelper.java:285)
	at org.apache.tools.ant.ComponentHelper.createComponent(ComponentHelper.java:263)
	at org.apache.tools.ant.UnknownElement.makeObject(UnknownElement.java:429)
	at org.apache.tools.ant.UnknownElement.maybeConfigure(UnknownElement.java:163)
	at org.apache.tools.ant.Task.perform(Task.java:347)
	at org.apache.tools.ant.Target.execute(Target.java:435)
	at org.apache.tools.ant.Target.performTasks(Target.java:456)
	at org.apache.tools.ant.Project.executeSortedTargets(Project.java:1393)
	at org.apache.tools.ant.helper.SingleCheckExecutor.executeTargets(SingleCheckExecutor.java:38)
	at org.apache.tools.ant.Project.executeTargets(Project.java:1248)
	at org.apache.tools.ant.taskdefs.Ant.execute(Ant.java:441)
	at org.apache.tools.ant.UnknownElement.execute(UnknownElement.java:292)
2017-06-10\T\18:30:10.628 [ERROR] 
2017-06-10\T\18:30:10.628 [ERROR] Re-run Maven using the -X switch to enable full debug logging.
2017-06-10\T\18:30:10.628 [ERROR] 
2017-06-10\T\18:30:10.628 [ERROR] For more information about the errors and possible solutions,
please read the following articles:
2017-06-10\T\18:30:10.628 [ERROR] [Help 1] http://cwiki.apache.org/confluence/display/MAVEN/MojoExecutionException
2017-06-10\T\18:30:10.628 [ERROR] 
2017-06-10\T\18:30:10.628 [ERROR] After correcting the problems, you can resume the build
with the command
2017-06-10\T\18:30:10.628 [ERROR]   mvn <goals> -rf :beam-sdks-java-javadoc
---------------------------------------------------
constituent[0]: file:/home/jenkins/tools/maven/apache-maven-3.3.3/lib/commons-lang-2.6.jar
constituent[1]: file:/home/jenkins/tools/maven/apache-maven-3.3.3/lib/plexus-interpolation-1.21.jar
constituent[2]: file:/home/jenkins/tools/maven/apache-maven-3.3.3/lib/org.eclipse.sisu.plexus-0.3.0.jar
constituent[3]: file:/home/jenkins/tools/maven/apache-maven-3.3.3/lib/plexus-utils-3.0.20.jar
constituent[4]: file:/home/jenkins/tools/maven/apache-maven-3.3.3/lib/wagon-file-2.9.jar
constituent[5]: file:/home/jenkins/tools/maven/apache-maven-3.3.3/lib/cdi-api-1.0.jar
constituent[6]: file:/home/jenkins/tools/maven/apache-maven-3.3.3/lib/wagon-http-shared-2.9.jar
constituent[7]: file:/home/jenkins/tools/maven/apache-maven-3.3.3/lib/aether-api-1.0.2.v20150114.jar
constituent[8]: file:/home/jenkins/tools/maven/apache-maven-3.3.3/lib/plexus-component-annotations-1.5.5.jar
constituent[9]: file:/home/jenkins/tools/maven/apache-maven-3.3.3/lib/jsoup-1.7.2.jar
constituent[10]: file:/home/jenkins/tools/maven/apache-maven-3.3.3/lib/wagon-http-2.9-shaded.jar
constituent[11]: file:/home/jenkins/tools/maven/apache-maven-3.3.3/lib/plexus-cipher-1.7.jar
constituent[12]: file:/home/jenkins/tools/maven/apache-maven-3.3.3/lib/org.eclipse.sisu.inject-0.3.0.jar
constituent[13]: file:/home/jenkins/tools/maven/apache-maven-3.3.3/lib/aether-spi-1.0.2.v20150114.jar
constituent[14]: file:/home/jenkins/tools/maven/apache-maven-3.3.3/lib/commons-cli-1.2.jar
constituent[15]: file:/home/jenkins/tools/maven/apache-maven-3.3.3/lib/aether-transport-wagon-1.0.2.v20150114.jar
constituent[16]: file:/home/jenkins/tools/maven/apache-maven-3.3.3/lib/javax.inject-1.jar
constituent[17]: file:/home/jenkins/tools/maven/apache-maven-3.3.3/lib/maven-compat-3.3.3.jar
constituent[18]: file:/home/jenkins/tools/maven/apache-maven-3.3.3/lib/maven-model-builder-3.3.3.jar
constituent[19]: file:/home/jenkins/tools/maven/apache-maven-3.3.3/lib/maven-settings-builder-3.3.3.jar
constituent[20]: file:/home/jenkins/tools/maven/apache-maven-3.3.3/lib/jsr250-api-1.0.jar
constituent[21]: file:/home/jenkins/tools/maven/apache-maven-3.3.3/lib/maven-model-3.3.3.jar
constituent[22]: file:/home/jenkins/tools/maven/apache-maven-3.3.3/lib/slf4j-simple-1.7.5.jar
constituent[23]: file:/home/jenkins/tools/maven/apache-maven-3.3.3/lib/wagon-provider-api-2.9.jar
constituent[24]: file:/home/jenkins/tools/maven/apache-maven-3.3.3/lib/maven-plugin-api-3.3.3.jar
constituent[25]: file:/home/jenkins/tools/maven/apache-maven-3.3.3/lib/commons-io-2.2.jar
constituent[26]: file:/home/jenkins/tools/maven/apache-maven-3.3.3/lib/maven-repository-metadata-3.3.3.jar
constituent[27]: file:/home/jenkins/tools/maven/apache-maven-3.3.3/lib/maven-core-3.3.3.jar
constituent[28]: file:/home/jenkins/tools/maven/apache-maven-3.3.3/lib/aether-connector-basic-1.0.2.v20150114.jar
constituent[29]: file:/home/jenkins/tools/maven/apache-maven-3.3.3/lib/sisu-guice-3.2.5-no_aop.jar
constituent[30]: file:/home/jenkins/tools/maven/apache-maven-3.3.3/lib/maven-artifact-3.3.3.jar
constituent[31]: file:/home/jenkins/tools/maven/apache-maven-3.3.3/lib/maven-builder-support-3.3.3.jar
constituent[32]: file:/home/jenkins/tools/maven/apache-maven-3.3.3/lib/aopalliance-1.0.jar
constituent[33]: file:/home/jenkins/tools/maven/apache-maven-3.3.3/lib/aether-impl-1.0.2.v20150114.jar
constituent[34]: file:/home/jenkins/tools/maven/apache-maven-3.3.3/lib/plexus-sec-dispatcher-1.3.jar
constituent[35]: file:/home/jenkins/tools/maven/apache-maven-3.3.3/lib/maven-settings-3.3.3.jar
constituent[36]: file:/home/jenkins/tools/maven/apache-maven-3.3.3/lib/aether-util-1.0.2.v20150114.jar
constituent[37]: file:/home/jenkins/tools/maven/apache-maven-3.3.3/lib/maven-embedder-3.3.3.jar
constituent[38]: file:/home/jenkins/tools/maven/apache-maven-3.3.3/lib/guava-18.0.jar
constituent[39]: file:/home/jenkins/tools/maven/apache-maven-3.3.3/lib/slf4j-api-1.7.5.jar
constituent[40]: file:/home/jenkins/tools/maven/apache-maven-3.3.3/lib/maven-aether-provider-3.3.3.jar
constituent[41]: file:/home/jenkins/tools/maven/apache-maven-3.3.3/conf/logging/
---------------------------------------------------
Exception in thread "main" java.lang.OutOfMemoryError: PermGen space
	at java.lang.ClassLoader.defineClass1(Native Method)
	at java.lang.ClassLoader.defineClass(ClassLoader.java:800)
	at java.security.SecureClassLoader.defineClass(SecureClassLoader.java:142)
	at java.net.URLClassLoader.defineClass(URLClassLoader.java:449)
	at java.net.URLClassLoader.access$100(URLClassLoader.java:71)
	at java.net.URLClassLoader$1.run(URLClassLoader.java:361)
	at java.net.URLClassLoader$1.run(URLClassLoader.java:355)
	at java.security.AccessController.doPrivileged(Native Method)
	at java.net.URLClassLoader.findClass(URLClassLoader.java:354)
	at org.codehaus.plexus.classworlds.realm.ClassRealm.loadClassFromSelf(ClassRealm.java:401)
	at org.codehaus.plexus.classworlds.strategy.SelfFirstStrategy.loadClass(SelfFirstStrategy.java:42)
	at org.codehaus.plexus.classworlds.realm.ClassRealm.unsynchronizedLoadClass(ClassRealm.java:271)
	at org.codehaus.plexus.classworlds.realm.ClassRealm.loadClass(ClassRealm.java:247)
	at org.codehaus.plexus.classworlds.realm.ClassRealm.loadClass(ClassRealm.java:239)
	at org.eclipse.sisu.inject.MildElements.iterator(MildElements.java:74)
	at org.eclipse.sisu.inject.RankedBindings.remove(RankedBindings.java:68)
	at org.eclipse.sisu.inject.InjectorBindings.unsubscribe(InjectorBindings.java:96)
	at org.eclipse.sisu.inject.RankedBindings.remove(RankedBindings.java:117)
	at org.eclipse.sisu.inject.DefaultBeanLocator.remove(DefaultBeanLocator.java:122)
	at org.eclipse.sisu.inject.DefaultBeanLocator.remove(DefaultBeanLocator.java:156)
	at org.eclipse.sisu.plexus.ClassRealmManager.realmDisposed(ClassRealmManager.java:156)
	at org.codehaus.plexus.classworlds.ClassWorld.disposeRealm(ClassWorld.java:100)
	at org.apache.maven.plugin.DefaultExtensionRealmCache.flush(DefaultExtensionRealmCache.java:150)
	at org.apache.maven.plugin.DefaultExtensionRealmCache.dispose(DefaultExtensionRealmCache.java:167)
	at org.eclipse.sisu.plexus.PlexusLifecycleManager.dispose(PlexusLifecycleManager.java:373)
	at org.eclipse.sisu.plexus.PlexusLifecycleManager.unmanage(PlexusLifecycleManager.java:173)
	at org.codehaus.plexus.DefaultPlexusContainer.dispose(DefaultPlexusContainer.java:590)
	at org.apache.maven.cli.MavenCli.doMain(MavenCli.java:313)
	at org.apache.maven.cli.MavenCli.main(MavenCli.java:197)
	at sun.reflect.NativeMethodAccessorImpl.invoke0(Native Method)
	at sun.reflect.NativeMethodAccessorImpl.invoke(NativeMethodAccessorImpl.java:57)
	at sun.reflect.DelegatingMethodAccessorImpl.invoke(DelegatingMethodAccessorImpl.java:43)
Build step 'Invoke top-level Maven targets' marked build as failure
Not sending mail to unregistered user ccy@google.com
Not sending mail to unregistered user kirpichov@google.com
Not sending mail to unregistered user aljoscha.krettek@gmail.com
Not sending mail to unregistered user klk@google.com
Not sending mail to unregistered user hepei.hp@alibaba-inc.com

Mime
View raw message