beam-commits mailing list archives

Site index · List index
Message view « Date » · « Thread »
Top « Date » · « Thread »
From Apache Jenkins Server <jenk...@builds.apache.org>
Subject Build failed in Jenkins: beam_PostCommit_Java_ValidatesRunner_Spark #2891
Date Wed, 23 Aug 2017 12:04:13 GMT
See <https://builds.apache.org/job/beam_PostCommit_Java_ValidatesRunner_Spark/2891/display/redirect>

------------------------------------------
[...truncated 324.84 KB...]
2017-08-23T12:03:57.229 [INFO] Downloading: https://repo.maven.apache.org/maven2/org/slf4j/slf4j-parent/1.7.14/slf4j-parent-1.7.14.pom
2017-08-23T12:03:57.257 [INFO] Downloaded: https://repo.maven.apache.org/maven2/org/slf4j/slf4j-parent/1.7.14/slf4j-parent-1.7.14.pom
(14 KB at 469.4 KB/sec)
2017-08-23T12:03:57.260 [INFO] Downloading: https://repo.maven.apache.org/maven2/net/bytebuddy/byte-buddy/1.6.8/byte-buddy-1.6.8.pom
2017-08-23T12:03:57.287 [INFO] Downloaded: https://repo.maven.apache.org/maven2/net/bytebuddy/byte-buddy/1.6.8/byte-buddy-1.6.8.pom
(12 KB at 426.1 KB/sec)
2017-08-23T12:03:57.288 [INFO] Downloading: https://repo.maven.apache.org/maven2/net/bytebuddy/byte-buddy-parent/1.6.8/byte-buddy-parent-1.6.8.pom
2017-08-23T12:03:57.316 [INFO] Downloaded: https://repo.maven.apache.org/maven2/net/bytebuddy/byte-buddy-parent/1.6.8/byte-buddy-parent-1.6.8.pom
(26 KB at 900.3 KB/sec)
2017-08-23T12:03:57.319 [INFO] Downloading: https://repo.maven.apache.org/maven2/org/apache/avro/avro/1.8.2/avro-1.8.2.pom
2017-08-23T12:03:57.345 [INFO] Downloaded: https://repo.maven.apache.org/maven2/org/apache/avro/avro/1.8.2/avro-1.8.2.pom
(7 KB at 266.2 KB/sec)
2017-08-23T12:03:57.349 [INFO] Downloading: https://repo.maven.apache.org/maven2/org/codehaus/jackson/jackson-core-asl/1.9.13/jackson-core-asl-1.9.13.pom
2017-08-23T12:03:57.374 [INFO] Downloaded: https://repo.maven.apache.org/maven2/org/codehaus/jackson/jackson-core-asl/1.9.13/jackson-core-asl-1.9.13.pom
(2 KB at 50.0 KB/sec)
2017-08-23T12:03:57.376 [INFO] Downloading: https://repo.maven.apache.org/maven2/org/codehaus/jackson/jackson-mapper-asl/1.9.13/jackson-mapper-asl-1.9.13.pom
2017-08-23T12:03:57.402 [INFO] Downloaded: https://repo.maven.apache.org/maven2/org/codehaus/jackson/jackson-mapper-asl/1.9.13/jackson-mapper-asl-1.9.13.pom
(2 KB at 56.6 KB/sec)
2017-08-23T12:03:57.404 [INFO] Downloading: https://repo.maven.apache.org/maven2/com/thoughtworks/paranamer/paranamer/2.7/paranamer-2.7.pom
2017-08-23T12:03:57.432 [INFO] Downloaded: https://repo.maven.apache.org/maven2/com/thoughtworks/paranamer/paranamer/2.7/paranamer-2.7.pom
(6 KB at 183.9 KB/sec)
2017-08-23T12:03:57.434 [INFO] Downloading: https://repo.maven.apache.org/maven2/com/thoughtworks/paranamer/paranamer-parent/2.7/paranamer-parent-2.7.pom
2017-08-23T12:03:57.460 [INFO] Downloaded: https://repo.maven.apache.org/maven2/com/thoughtworks/paranamer/paranamer-parent/2.7/paranamer-parent-2.7.pom
(12 KB at 432.1 KB/sec)
2017-08-23T12:03:57.463 [INFO] Downloading: https://repo.maven.apache.org/maven2/org/xerial/snappy/snappy-java/1.1.4-M3/snappy-java-1.1.4-M3.pom
2017-08-23T12:03:57.490 [INFO] Downloaded: https://repo.maven.apache.org/maven2/org/xerial/snappy/snappy-java/1.1.4-M3/snappy-java-1.1.4-M3.pom
(4 KB at 123.5 KB/sec)
2017-08-23T12:03:57.492 [INFO] Downloading: https://repo.maven.apache.org/maven2/org/apache/commons/commons-compress/1.14/commons-compress-1.14.pom
2017-08-23T12:03:57.518 [INFO] Downloaded: https://repo.maven.apache.org/maven2/org/apache/commons/commons-compress/1.14/commons-compress-1.14.pom
(13 KB at 493.6 KB/sec)
2017-08-23T12:03:57.520 [INFO] Downloading: https://repo.maven.apache.org/maven2/org/apache/commons/commons-parent/42/commons-parent-42.pom
2017-08-23T12:03:57.553 [INFO] Downloaded: https://repo.maven.apache.org/maven2/org/apache/commons/commons-parent/42/commons-parent-42.pom
(67 KB at 2011.0 KB/sec)
2017-08-23T12:03:57.559 [INFO] Downloading: https://repo.maven.apache.org/maven2/org/apache/commons/commons-lang3/3.6/commons-lang3-3.6.pom
2017-08-23T12:03:57.587 [INFO] Downloaded: https://repo.maven.apache.org/maven2/org/apache/commons/commons-lang3/3.6/commons-lang3-3.6.pom
(27 KB at 958.9 KB/sec)
2017-08-23T12:03:57.593 [INFO] Downloading: https://repo.maven.apache.org/maven2/joda-time/joda-time/2.4/joda-time-2.4.pom
2017-08-23T12:03:57.621 [INFO] Downloaded: https://repo.maven.apache.org/maven2/joda-time/joda-time/2.4/joda-time-2.4.pom
(26 KB at 919.3 KB/sec)
2017-08-23T12:03:57.624 [INFO] Downloading: https://repo.maven.apache.org/maven2/com/google/auto/service/auto-service/1.0-rc2/auto-service-1.0-rc2.pom
2017-08-23T12:03:57.651 [INFO] Downloaded: https://repo.maven.apache.org/maven2/com/google/auto/service/auto-service/1.0-rc2/auto-service-1.0-rc2.pom
(3 KB at 99.4 KB/sec)
2017-08-23T12:03:57.653 [INFO] Downloading: https://repo.maven.apache.org/maven2/com/google/auto/auto-parent/2/auto-parent-2.pom
2017-08-23T12:03:57.679 [INFO] Downloaded: https://repo.maven.apache.org/maven2/com/google/auto/auto-parent/2/auto-parent-2.pom
(5 KB at 170.3 KB/sec)
2017-08-23T12:03:57.681 [INFO] Downloading: https://repo.maven.apache.org/maven2/com/google/auto/auto-common/0.3/auto-common-0.3.pom
2017-08-23T12:03:57.707 [INFO] Downloaded: https://repo.maven.apache.org/maven2/com/google/auto/auto-common/0.3/auto-common-0.3.pom
(3 KB at 91.8 KB/sec)
2017-08-23T12:03:57.709 [INFO] Downloading: https://repo.maven.apache.org/maven2/com/google/auto/value/auto-value/1.4.1/auto-value-1.4.1.pom
2017-08-23T12:03:57.736 [INFO] Downloaded: https://repo.maven.apache.org/maven2/com/google/auto/value/auto-value/1.4.1/auto-value-1.4.1.pom
(7 KB at 230.6 KB/sec)
2017-08-23T12:03:57.737 [INFO] Downloading: https://repo.maven.apache.org/maven2/com/google/auto/auto-parent/3/auto-parent-3.pom
2017-08-23T12:03:57.763 [INFO] Downloaded: https://repo.maven.apache.org/maven2/com/google/auto/auto-parent/3/auto-parent-3.pom
(4 KB at 144.2 KB/sec)
2017-08-23T12:03:57.766 [INFO] Downloading: https://repo.maven.apache.org/maven2/com/fasterxml/jackson/dataformat/jackson-dataformat-yaml/2.8.9/jackson-dataformat-yaml-2.8.9.pom
2017-08-23T12:03:57.792 [INFO] Downloaded: https://repo.maven.apache.org/maven2/com/fasterxml/jackson/dataformat/jackson-dataformat-yaml/2.8.9/jackson-dataformat-yaml-2.8.9.pom
(7 KB at 231.5 KB/sec)
2017-08-23T12:03:57.795 [INFO] Downloading: https://repo.maven.apache.org/maven2/org/yaml/snakeyaml/1.17/snakeyaml-1.17.pom
2017-08-23T12:03:57.823 [INFO] Downloaded: https://repo.maven.apache.org/maven2/org/yaml/snakeyaml/1.17/snakeyaml-1.17.pom
(28 KB at 976.7 KB/sec)
2017-08-23T12:03:57.826 [INFO] Downloading: https://repo.maven.apache.org/maven2/org/hamcrest/hamcrest-all/1.3/hamcrest-all-1.3.pom
2017-08-23T12:03:57.851 [INFO] Downloaded: https://repo.maven.apache.org/maven2/org/hamcrest/hamcrest-all/1.3/hamcrest-all-1.3.pom
(650 B at 25.4 KB/sec)
2017-08-23T12:03:57.853 [INFO] Downloading: https://repo.maven.apache.org/maven2/org/slf4j/slf4j-jdk14/1.7.14/slf4j-jdk14-1.7.14.pom
2017-08-23T12:03:57.879 [INFO] Downloaded: https://repo.maven.apache.org/maven2/org/slf4j/slf4j-jdk14/1.7.14/slf4j-jdk14-1.7.14.pom
(1008 B at 37.9 KB/sec)
2017-08-23T12:03:57.882 [INFO] Downloading: https://repo.maven.apache.org/maven2/org/mockito/mockito-all/1.9.5/mockito-all-1.9.5.pom
2017-08-23T12:03:57.910 [INFO] Downloaded: https://repo.maven.apache.org/maven2/org/mockito/mockito-all/1.9.5/mockito-all-1.9.5.pom
(2 KB at 37.6 KB/sec)
2017-08-23T12:03:57.912 [INFO] Downloading: https://repo.maven.apache.org/maven2/com/esotericsoftware/kryo/kryo/2.21/kryo-2.21.pom
2017-08-23T12:03:57.940 [INFO] Downloaded: https://repo.maven.apache.org/maven2/com/esotericsoftware/kryo/kryo/2.21/kryo-2.21.pom
(6 KB at 197.2 KB/sec)
2017-08-23T12:03:57.942 [INFO] Downloading: https://repo.maven.apache.org/maven2/com/esotericsoftware/reflectasm/reflectasm/1.07/reflectasm-1.07.pom
2017-08-23T12:03:57.969 [INFO] Downloaded: https://repo.maven.apache.org/maven2/com/esotericsoftware/reflectasm/reflectasm/1.07/reflectasm-1.07.pom
(4 KB at 111.4 KB/sec)
2017-08-23T12:03:57.971 [INFO] Downloading: https://repo.maven.apache.org/maven2/org/ow2/asm/asm/4.0/asm-4.0.pom
2017-08-23T12:03:57.997 [INFO] Downloaded: https://repo.maven.apache.org/maven2/org/ow2/asm/asm/4.0/asm-4.0.pom
(2 KB at 72.6 KB/sec)
2017-08-23T12:03:57.998 [INFO] Downloading: https://repo.maven.apache.org/maven2/org/ow2/asm/asm-parent/4.0/asm-parent-4.0.pom
2017-08-23T12:03:58.024 [INFO] Downloaded: https://repo.maven.apache.org/maven2/org/ow2/asm/asm-parent/4.0/asm-parent-4.0.pom
(6 KB at 206.3 KB/sec)
2017-08-23T12:03:58.026 [INFO] Downloading: https://repo.maven.apache.org/maven2/com/esotericsoftware/minlog/minlog/1.2/minlog-1.2.pom
2017-08-23T12:03:58.051 [INFO] Downloaded: https://repo.maven.apache.org/maven2/com/esotericsoftware/minlog/minlog/1.2/minlog-1.2.pom
(2 KB at 62.0 KB/sec)
2017-08-23T12:03:58.053 [INFO] Downloading: https://repo.maven.apache.org/maven2/org/objenesis/objenesis/1.2/objenesis-1.2.pom
2017-08-23T12:03:58.079 [INFO] Downloaded: https://repo.maven.apache.org/maven2/org/objenesis/objenesis/1.2/objenesis-1.2.pom
(3 KB at 113.0 KB/sec)
2017-08-23T12:03:58.081 [INFO] Downloading: https://repo.maven.apache.org/maven2/org/objenesis/objenesis-parent/1.2/objenesis-parent-1.2.pom
2017-08-23T12:03:58.109 [INFO] Downloaded: https://repo.maven.apache.org/maven2/org/objenesis/objenesis-parent/1.2/objenesis-parent-1.2.pom
(11 KB at 361.0 KB/sec)
2017-08-23T12:03:58.115 [INFO] Downloading: https://repo.maven.apache.org/maven2/com/google/guava/guava-testlib/20.0/guava-testlib-20.0.jar
2017-08-23T12:03:58.115 [INFO] Downloading: https://repo.maven.apache.org/maven2/com/fasterxml/jackson/core/jackson-core/2.8.9/jackson-core-2.8.9.jar
2017-08-23T12:03:58.115 [INFO] Downloading: https://repo.maven.apache.org/maven2/com/fasterxml/jackson/core/jackson-annotations/2.8.9/jackson-annotations-2.8.9.jar
2017-08-23T12:03:58.116 [INFO] Downloading: https://repo.maven.apache.org/maven2/com/fasterxml/jackson/core/jackson-databind/2.8.9/jackson-databind-2.8.9.jar
2017-08-23T12:03:58.116 [INFO] Downloading: https://repo.maven.apache.org/maven2/org/slf4j/slf4j-api/1.7.14/slf4j-api-1.7.14.jar
[INFO] I/O exception (java.net.SocketException) caught when processing request to {s}->https://repo.maven.apache.org:443:
Connection reset
[INFO] Retrying request to {s}->https://repo.maven.apache.org:443
2017-08-23T12:03:58.147 [INFO] Downloaded: https://repo.maven.apache.org/maven2/org/slf4j/slf4j-api/1.7.14/slf4j-api-1.7.14.jar
(33 KB at 1024.2 KB/sec)
2017-08-23T12:03:58.147 [INFO] Downloading: https://repo.maven.apache.org/maven2/net/bytebuddy/byte-buddy/1.6.8/byte-buddy-1.6.8.jar
2017-08-23T12:03:58.166 [INFO] Downloaded: https://repo.maven.apache.org/maven2/com/fasterxml/jackson/core/jackson-core/2.8.9/jackson-core-2.8.9.jar
(277 KB at 5411.9 KB/sec)
2017-08-23T12:03:58.166 [INFO] Downloading: https://repo.maven.apache.org/maven2/org/apache/avro/avro/1.8.2/avro-1.8.2.jar
2017-08-23T12:03:58.214 [INFO] Downloaded: https://repo.maven.apache.org/maven2/com/google/guava/guava-testlib/20.0/guava-testlib-20.0.jar
(749 KB at 7482.7 KB/sec)
2017-08-23T12:03:58.215 [INFO] Downloading: https://repo.maven.apache.org/maven2/org/codehaus/jackson/jackson-core-asl/1.9.13/jackson-core-asl-1.9.13.jar
2017-08-23T12:03:58.239 [INFO] Downloaded: https://repo.maven.apache.org/maven2/com/fasterxml/jackson/core/jackson-annotations/2.8.9/jackson-annotations-2.8.9.jar
(55 KB at 439.3 KB/sec)
2017-08-23T12:03:58.239 [INFO] Downloading: https://repo.maven.apache.org/maven2/org/codehaus/jackson/jackson-mapper-asl/1.9.13/jackson-mapper-asl-1.9.13.jar
2017-08-23T12:03:58.257 [INFO] Downloaded: https://repo.maven.apache.org/maven2/org/codehaus/jackson/jackson-core-asl/1.9.13/jackson-core-asl-1.9.13.jar
(227 KB at 1608.5 KB/sec)
2017-08-23T12:03:58.257 [INFO] Downloading: https://repo.maven.apache.org/maven2/com/thoughtworks/paranamer/paranamer/2.7/paranamer-2.7.jar
2017-08-23T12:03:58.257 [INFO] Downloaded: https://repo.maven.apache.org/maven2/com/fasterxml/jackson/core/jackson-databind/2.8.9/jackson-databind-2.8.9.jar
(1214 KB at 8544.8 KB/sec)
2017-08-23T12:03:58.257 [INFO] Downloading: https://repo.maven.apache.org/maven2/org/xerial/snappy/snappy-java/1.1.4-M3/snappy-java-1.1.4-M3.jar
2017-08-23T12:03:58.285 [INFO] Downloaded: https://repo.maven.apache.org/maven2/com/thoughtworks/paranamer/paranamer/2.7/paranamer-2.7.jar
(34 KB at 200.0 KB/sec)
2017-08-23T12:03:58.285 [INFO] Downloading: https://repo.maven.apache.org/maven2/org/apache/commons/commons-compress/1.14/commons-compress-1.14.jar
2017-08-23T12:03:58.330 [INFO] Downloaded: https://repo.maven.apache.org/maven2/org/codehaus/jackson/jackson-mapper-asl/1.9.13/jackson-mapper-asl-1.9.13.jar
(763 KB at 3562.5 KB/sec)
2017-08-23T12:03:58.331 [INFO] Downloading: https://repo.maven.apache.org/maven2/joda-time/joda-time/2.4/joda-time-2.4.jar
2017-08-23T12:03:58.331 [INFO] Downloading: https://repo.maven.apache.org/maven2/org/apache/commons/commons-lang3/3.6/commons-lang3-3.6.jar
2017-08-23T12:03:58.357 [INFO] Downloaded: https://repo.maven.apache.org/maven2/org/apache/commons/commons-compress/1.14/commons-compress-1.14.jar
(518 KB at 2147.7 KB/sec)
2017-08-23T12:03:58.357 [INFO] Downloading: https://repo.maven.apache.org/maven2/com/google/auto/service/auto-service/1.0-rc2/auto-service-1.0-rc2.jar
2017-08-23T12:03:58.384 [INFO] Downloaded: https://repo.maven.apache.org/maven2/com/google/auto/service/auto-service/1.0-rc2/auto-service-1.0-rc2.jar
(11 KB at 37.8 KB/sec)
2017-08-23T12:03:58.384 [INFO] Downloading: https://repo.maven.apache.org/maven2/com/google/auto/auto-common/0.3/auto-common-0.3.jar
2017-08-23T12:03:58.400 [INFO] Downloaded: https://repo.maven.apache.org/maven2/joda-time/joda-time/2.4/joda-time-2.4.jar
(573 KB at 2015.7 KB/sec)
2017-08-23T12:03:58.400 [INFO] Downloading: https://repo.maven.apache.org/maven2/com/google/auto/value/auto-value/1.4.1/auto-value-1.4.1.jar
2017-08-23T12:03:58.410 [INFO] Downloaded: https://repo.maven.apache.org/maven2/net/bytebuddy/byte-buddy/1.6.8/byte-buddy-1.6.8.jar
(2706 KB at 9203.4 KB/sec)
2017-08-23T12:03:58.410 [INFO] Downloading: https://repo.maven.apache.org/maven2/com/fasterxml/jackson/dataformat/jackson-dataformat-yaml/2.8.9/jackson-dataformat-yaml-2.8.9.jar
2017-08-23T12:03:58.413 [INFO] Downloaded: https://repo.maven.apache.org/maven2/com/google/auto/auto-common/0.3/auto-common-0.3.jar
(39 KB at 128.2 KB/sec)
2017-08-23T12:03:58.413 [INFO] Downloading: https://repo.maven.apache.org/maven2/org/yaml/snakeyaml/1.17/snakeyaml-1.17.jar
2017-08-23T12:03:58.426 [INFO] Downloaded: https://repo.maven.apache.org/maven2/org/xerial/snappy/snappy-java/1.1.4-M3/snappy-java-1.1.4-M3.jar
(1471 KB at 4743.4 KB/sec)
2017-08-23T12:03:58.427 [INFO] Downloading: https://repo.maven.apache.org/maven2/org/hamcrest/hamcrest-all/1.3/hamcrest-all-1.3.jar
2017-08-23T12:03:58.439 [INFO] Downloaded: https://repo.maven.apache.org/maven2/com/fasterxml/jackson/dataformat/jackson-dataformat-yaml/2.8.9/jackson-dataformat-yaml-2.8.9.jar
(40 KB at 123.6 KB/sec)
2017-08-23T12:03:58.439 [INFO] Downloading: https://repo.maven.apache.org/maven2/org/slf4j/slf4j-jdk14/1.7.14/slf4j-jdk14-1.7.14.jar
2017-08-23T12:03:58.459 [INFO] Downloaded: https://repo.maven.apache.org/maven2/org/yaml/snakeyaml/1.17/snakeyaml-1.17.jar
(268 KB at 779.0 KB/sec)
2017-08-23T12:03:58.459 [INFO] Downloading: https://repo.maven.apache.org/maven2/org/mockito/mockito-all/1.9.5/mockito-all-1.9.5.jar
2017-08-23T12:03:58.465 [INFO] Downloaded: https://repo.maven.apache.org/maven2/org/slf4j/slf4j-jdk14/1.7.14/slf4j-jdk14-1.7.14.jar
(8 KB at 21.9 KB/sec)
2017-08-23T12:03:58.465 [INFO] Downloading: https://repo.maven.apache.org/maven2/com/esotericsoftware/kryo/kryo/2.21/kryo-2.21.jar
2017-08-23T12:03:58.473 [INFO] Downloaded: https://repo.maven.apache.org/maven2/org/hamcrest/hamcrest-all/1.3/hamcrest-all-1.3.jar
(300 KB at 838.6 KB/sec)
2017-08-23T12:03:58.473 [INFO] Downloading: https://repo.maven.apache.org/maven2/com/esotericsoftware/reflectasm/reflectasm/1.07/reflectasm-1.07-shaded.jar
2017-08-23T12:03:58.491 [INFO] Downloaded: https://repo.maven.apache.org/maven2/org/apache/commons/commons-lang3/3.6/commons-lang3-3.6.jar
(484 KB at 1288.7 KB/sec)
2017-08-23T12:03:58.492 [INFO] Downloading: https://repo.maven.apache.org/maven2/org/ow2/asm/asm/4.0/asm-4.0.jar
2017-08-23T12:03:58.503 [INFO] Downloaded: https://repo.maven.apache.org/maven2/com/esotericsoftware/reflectasm/reflectasm/1.07/reflectasm-1.07-shaded.jar
(65 KB at 165.6 KB/sec)
2017-08-23T12:03:58.503 [INFO] Downloading: https://repo.maven.apache.org/maven2/com/esotericsoftware/minlog/minlog/1.2/minlog-1.2.jar
2017-08-23T12:03:58.521 [INFO] Downloaded: https://repo.maven.apache.org/maven2/com/esotericsoftware/kryo/kryo/2.21/kryo-2.21.jar
(355 KB at 876.4 KB/sec)
2017-08-23T12:03:58.521 [INFO] Downloading: https://repo.maven.apache.org/maven2/org/objenesis/objenesis/1.2/objenesis-1.2.jar
2017-08-23T12:03:58.524 [INFO] Downloaded: https://repo.maven.apache.org/maven2/org/ow2/asm/asm/4.0/asm-4.0.jar
(45 KB at 110.2 KB/sec)
2017-08-23T12:03:58.529 [INFO] Downloaded: https://repo.maven.apache.org/maven2/com/esotericsoftware/minlog/minlog/1.2/minlog-1.2.jar
(5 KB at 11.7 KB/sec)
2017-08-23T12:03:58.536 [INFO] Downloaded: https://repo.maven.apache.org/maven2/com/google/auto/value/auto-value/1.4.1/auto-value-1.4.1.jar
(1470 KB at 3498.7 KB/sec)
2017-08-23T12:03:58.549 [INFO] Downloaded: https://repo.maven.apache.org/maven2/org/objenesis/objenesis/1.2/objenesis-1.2.jar
(36 KB at 81.3 KB/sec)
2017-08-23T12:03:58.606 [INFO] Downloaded: https://repo.maven.apache.org/maven2/org/mockito/mockito-all/1.9.5/mockito-all-1.9.5.jar
(1545 KB at 3151.0 KB/sec)
[JENKINS] Archiving disabled
[JENKINS] Archiving disabled
[JENKINS] Archiving disabled
[JENKINS] Archiving disabled
[JENKINS] Archiving disabled
[JENKINS] Archiving disabled
[JENKINS] Archiving disabled
[JENKINS] Archiving disabled
[JENKINS] Archiving disabled
[JENKINS] Archiving disabled
[JENKINS] Archiving disabled
[JENKINS] Archiving disabled
[JENKINS] Archiving disabled
[JENKINS] Archiving disabled
[JENKINS] Archiving disabled
[JENKINS] Archiving disabled
2017-08-23T12:04:06.151 [INFO] ------------------------------------------------------------------------
2017-08-23T12:04:06.151 [INFO] Reactor Summary:
2017-08-23T12:04:06.151 [INFO] 
2017-08-23T12:04:06.151 [INFO] Apache Beam :: Parent .............................. SUCCESS
[ 25.457 s]
2017-08-23T12:04:06.151 [INFO] Apache Beam :: SDKs :: Java :: Build Tools ......... SUCCESS
[ 11.225 s]
2017-08-23T12:04:06.151 [INFO] Apache Beam :: SDKs ................................ SUCCESS
[  3.279 s]
2017-08-23T12:04:06.151 [INFO] Apache Beam :: SDKs :: Common ...................... SUCCESS
[  4.548 s]
2017-08-23T12:04:06.151 [INFO] Apache Beam :: SDKs :: Common :: Runner API ........ SUCCESS
[ 23.364 s]
2017-08-23T12:04:06.151 [INFO] Apache Beam :: SDKs :: Common :: Fn API ............ SUCCESS
[  7.302 s]
2017-08-23T12:04:06.151 [INFO] Apache Beam :: SDKs :: Java ........................ SUCCESS
[  2.281 s]
2017-08-23T12:04:06.151 [INFO] Apache Beam :: SDKs :: Java :: Core ................ FAILURE
[  2.060 s]
2017-08-23T12:04:06.151 [INFO] Apache Beam :: Runners ............................. SKIPPED
2017-08-23T12:04:06.151 [INFO] Apache Beam :: Runners :: Core Construction Java ... SKIPPED
2017-08-23T12:04:06.151 [INFO] Apache Beam :: Runners :: Core Java ................ SKIPPED
2017-08-23T12:04:06.151 [INFO] Apache Beam :: Runners :: Direct Java .............. SKIPPED
2017-08-23T12:04:06.151 [INFO] Apache Beam :: SDKs :: Java :: IO .................. SKIPPED
2017-08-23T12:04:06.151 [INFO] Apache Beam :: SDKs :: Java :: IO :: Kafka ......... SKIPPED
2017-08-23T12:04:06.151 [INFO] Apache Beam :: Runners :: Spark .................... SKIPPED
2017-08-23T12:04:06.151 [INFO] ------------------------------------------------------------------------
2017-08-23T12:04:06.151 [INFO] BUILD FAILURE
2017-08-23T12:04:06.151 [INFO] ------------------------------------------------------------------------
2017-08-23T12:04:06.151 [INFO] Total time: 02:07 min
2017-08-23T12:04:06.151 [INFO] Finished at: 2017-08-23T12:04:06+00:00
2017-08-23T12:04:06.500 [INFO] Final Memory: 91M/1340M
2017-08-23T12:04:06.500 [INFO] ------------------------------------------------------------------------
2017-08-23T12:04:06.501 [WARNING] The requested profile "validates-runner-tests" could not
be activated because it does not exist.
2017-08-23T12:04:06.505 [ERROR] Failed to execute goal on project beam-sdks-java-core: Could
not resolve dependencies for project org.apache.beam:beam-sdks-java-core:jar:2.2.0-SNAPSHOT:
Could not transfer artifact org.apache.avro:avro:jar:1.8.2 from/to central (https://repo.maven.apache.org/maven2):
GET request of: org/apache/avro/avro/1.8.2/avro-1.8.2.jar from central failed: Connection
reset -> [Help 1]
org.apache.maven.lifecycle.LifecycleExecutionException: Failed to execute goal on project
beam-sdks-java-core: Could not resolve dependencies for project org.apache.beam:beam-sdks-java-core:jar:2.2.0-SNAPSHOT:
Could not transfer artifact org.apache.avro:avro:jar:1.8.2 from/to central (https://repo.maven.apache.org/maven2):
GET request of: org/apache/avro/avro/1.8.2/avro-1.8.2.jar from central failed
	at org.apache.maven.lifecycle.internal.LifecycleDependencyResolver.getDependencies(LifecycleDependencyResolver.java:221)
	at org.apache.maven.lifecycle.internal.LifecycleDependencyResolver.resolveProjectDependencies(LifecycleDependencyResolver.java:127)
	at org.apache.maven.lifecycle.internal.MojoExecutor.ensureDependenciesAreResolved(MojoExecutor.java:257)
	at org.apache.maven.lifecycle.internal.MojoExecutor.execute(MojoExecutor.java:200)
	at org.apache.maven.lifecycle.internal.MojoExecutor.execute(MojoExecutor.java:153)
	at org.apache.maven.lifecycle.internal.MojoExecutor.execute(MojoExecutor.java:145)
	at org.apache.maven.lifecycle.internal.LifecycleModuleBuilder.buildProject(LifecycleModuleBuilder.java:116)
	at org.apache.maven.lifecycle.internal.LifecycleModuleBuilder.buildProject(LifecycleModuleBuilder.java:80)
	at org.apache.maven.lifecycle.internal.builder.singlethreaded.SingleThreadedBuilder.build(SingleThreadedBuilder.java:51)
	at org.apache.maven.lifecycle.internal.LifecycleStarter.execute(LifecycleStarter.java:128)
	at org.apache.maven.DefaultMaven.doExecute(DefaultMaven.java:307)
	at org.apache.maven.DefaultMaven.doExecute(DefaultMaven.java:193)
	at org.apache.maven.DefaultMaven.execute(DefaultMaven.java:106)
	at org.jvnet.hudson.maven3.launcher.Maven33Launcher.main(Maven33Launcher.java:129)
	at sun.reflect.NativeMethodAccessorImpl.invoke0(Native Method)
	at sun.reflect.NativeMethodAccessorImpl.invoke(NativeMethodAccessorImpl.java:62)
	at sun.reflect.DelegatingMethodAccessorImpl.invoke(DelegatingMethodAccessorImpl.java:43)
	at java.lang.reflect.Method.invoke(Method.java:498)
	at org.codehaus.plexus.classworlds.launcher.Launcher.launchStandard(Launcher.java:330)
	at org.codehaus.plexus.classworlds.launcher.Launcher.launch(Launcher.java:238)
	at jenkins.maven3.agent.Maven33Main.launch(Maven33Main.java:176)
	at sun.reflect.NativeMethodAccessorImpl.invoke0(Native Method)
	at sun.reflect.NativeMethodAccessorImpl.invoke(NativeMethodAccessorImpl.java:62)
	at sun.reflect.DelegatingMethodAccessorImpl.invoke(DelegatingMethodAccessorImpl.java:43)
	at java.lang.reflect.Method.invoke(Method.java:498)
	at hudson.maven.Maven3Builder.call(Maven3Builder.java:139)
	at hudson.maven.Maven3Builder.call(Maven3Builder.java:70)
	at hudson.remoting.UserRequest.perform(UserRequest.java:153)
	at hudson.remoting.UserRequest.perform(UserRequest.java:50)
	at hudson.remoting.Request$2.run(Request.java:336)
	at hudson.remoting.InterceptingExecutorService$1.call(InterceptingExecutorService.java:68)
	at java.util.concurrent.FutureTask.run(FutureTask.java:266)
	at java.util.concurrent.ThreadPoolExecutor.runWorker(ThreadPoolExecutor.java:1149)
	at java.util.concurrent.ThreadPoolExecutor$Worker.run(ThreadPoolExecutor.java:624)
	at java.lang.Thread.run(Thread.java:748)
Caused by: org.apache.maven.project.DependencyResolutionException: Could not resolve dependencies
for project org.apache.beam:beam-sdks-java-core:jar:2.2.0-SNAPSHOT: Could not transfer artifact
org.apache.avro:avro:jar:1.8.2 from/to central (https://repo.maven.apache.org/maven2): GET
request of: org/apache/avro/avro/1.8.2/avro-1.8.2.jar from central failed
	at org.apache.maven.project.DefaultProjectDependenciesResolver.resolve(DefaultProjectDependenciesResolver.java:211)
	at org.apache.maven.lifecycle.internal.LifecycleDependencyResolver.getDependencies(LifecycleDependencyResolver.java:195)
	... 34 more
Caused by: org.eclipse.aether.resolution.DependencyResolutionException: Could not transfer
artifact org.apache.avro:avro:jar:1.8.2 from/to central (https://repo.maven.apache.org/maven2):
GET request of: org/apache/avro/avro/1.8.2/avro-1.8.2.jar from central failed
	at org.eclipse.aether.internal.impl.DefaultRepositorySystem.resolveDependencies(DefaultRepositorySystem.java:384)
	at org.apache.maven.project.DefaultProjectDependenciesResolver.resolve(DefaultProjectDependenciesResolver.java:205)
	... 35 more
Caused by: org.eclipse.aether.resolution.ArtifactResolutionException: Could not transfer artifact
org.apache.avro:avro:jar:1.8.2 from/to central (https://repo.maven.apache.org/maven2): GET
request of: org/apache/avro/avro/1.8.2/avro-1.8.2.jar from central failed
	at org.eclipse.aether.internal.impl.DefaultArtifactResolver.resolve(DefaultArtifactResolver.java:444)
	at org.eclipse.aether.internal.impl.DefaultArtifactResolver.resolveArtifacts(DefaultArtifactResolver.java:246)
	at org.eclipse.aether.internal.impl.DefaultRepositorySystem.resolveDependencies(DefaultRepositorySystem.java:367)
	... 36 more
Caused by: org.eclipse.aether.transfer.ArtifactTransferException: Could not transfer artifact
org.apache.avro:avro:jar:1.8.2 from/to central (https://repo.maven.apache.org/maven2): GET
request of: org/apache/avro/avro/1.8.2/avro-1.8.2.jar from central failed
	at org.eclipse.aether.connector.basic.ArtifactTransportListener.transferFailed(ArtifactTransportListener.java:43)
	at org.eclipse.aether.connector.basic.BasicRepositoryConnector$TaskRunner.run(BasicRepositoryConnector.java:355)
	at org.eclipse.aether.util.concurrency.RunnableErrorForwarder$1.run(RunnableErrorForwarder.java:67)
	... 3 more
Caused by: org.apache.maven.wagon.TransferFailedException: GET request of: org/apache/avro/avro/1.8.2/avro-1.8.2.jar
from central failed
	at org.apache.maven.wagon.AbstractWagon.getTransfer(AbstractWagon.java:363)
	at org.apache.maven.wagon.AbstractWagon.getTransfer(AbstractWagon.java:316)
	at org.apache.maven.wagon.AbstractWagon.getTransfer(AbstractWagon.java:285)
	at org.apache.maven.wagon.StreamWagon.getIfNewer(StreamWagon.java:97)
	at org.apache.maven.wagon.StreamWagon.get(StreamWagon.java:61)
	at org.eclipse.aether.transport.wagon.WagonTransporter$GetTaskRunner.run(WagonTransporter.java:560)
	at org.eclipse.aether.transport.wagon.WagonTransporter.execute(WagonTransporter.java:427)
	at org.eclipse.aether.transport.wagon.WagonTransporter.get(WagonTransporter.java:404)
	at org.eclipse.aether.connector.basic.BasicRepositoryConnector$GetTaskRunner.runTask(BasicRepositoryConnector.java:447)
	at org.eclipse.aether.connector.basic.BasicRepositoryConnector$TaskRunner.run(BasicRepositoryConnector.java:350)
	... 4 more
Caused by: java.net.SocketException: Connection reset
	at java.net.SocketInputStream.read(SocketInputStream.java:210)
	at java.net.SocketInputStream.read(SocketInputStream.java:141)
	at sun.security.ssl.InputRecord.readFully(InputRecord.java:465)
	at sun.security.ssl.InputRecord.readV3Record(InputRecord.java:593)
	at sun.security.ssl.InputRecord.read(InputRecord.java:532)
	at sun.security.ssl.SSLSocketImpl.readRecord(SSLSocketImpl.java:983)
	at sun.security.ssl.SSLSocketImpl.readDataRecord(SSLSocketImpl.java:940)
	at sun.security.ssl.AppInputStream.read(AppInputStream.java:105)
	at org.apache.maven.wagon.providers.http.httpclient.impl.io.SessionInputBufferImpl.streamRead(SessionInputBufferImpl.java:136)
	at org.apache.maven.wagon.providers.http.httpclient.impl.io.SessionInputBufferImpl.read(SessionInputBufferImpl.java:195)
	at org.apache.maven.wagon.providers.http.httpclient.impl.io.ContentLengthInputStream.read(ContentLengthInputStream.java:178)
	at org.apache.maven.wagon.providers.http.httpclient.conn.EofSensorInputStream.read(EofSensorInputStream.java:137)
	at org.apache.maven.wagon.AbstractWagon.transfer(AbstractWagon.java:531)
	at org.apache.maven.wagon.AbstractWagon.getTransfer(AbstractWagon.java:353)
	... 13 more
2017-08-23T12:04:06.507 [ERROR] 
2017-08-23T12:04:06.507 [ERROR] Re-run Maven using the -X switch to enable full debug logging.
2017-08-23T12:04:06.507 [ERROR] 
2017-08-23T12:04:06.507 [ERROR] For more information about the errors and possible solutions,
please read the following articles:
2017-08-23T12:04:06.507 [ERROR] [Help 1] http://cwiki.apache.org/confluence/display/MAVEN/DependencyResolutionException
2017-08-23T12:04:06.507 [ERROR] 
2017-08-23T12:04:06.507 [ERROR] After correcting the problems, you can resume the build with
the command
2017-08-23T12:04:06.507 [ERROR]   mvn <goals> -rf :beam-sdks-java-core
channel stopped

Mime
View raw message