beam-commits mailing list archives

Site index · List index
Message view « Date » · « Thread »
Top « Date » · « Thread »
From Apache Jenkins Server <jenk...@builds.apache.org>
Subject Build failed in Jenkins: beam_PostCommit_Java_ValidatesRunner_Dataflow #3699
Date Wed, 02 Aug 2017 07:31:37 GMT
See <https://builds.apache.org/job/beam_PostCommit_Java_ValidatesRunner_Dataflow/3699/display/redirect>

------------------------------------------
[...truncated 8.02 MB...]
	at org.junit.runners.model.FrameworkMethod.invokeExplosively(FrameworkMethod.java:47)
	at org.junit.internal.runners.statements.InvokeMethod.evaluate(InvokeMethod.java:17)
	at org.apache.beam.sdk.testing.TestPipeline$1.evaluate(TestPipeline.java:320)
	at org.junit.rules.ExpectedException$ExpectedExceptionStatement.evaluate(ExpectedException.java:239)
	at org.junit.rules.RunRules.evaluate(RunRules.java:20)
	at org.junit.runners.ParentRunner.runLeaf(ParentRunner.java:325)
	at org.junit.runners.BlockJUnit4ClassRunner.runChild(BlockJUnit4ClassRunner.java:78)
	at org.junit.runners.BlockJUnit4ClassRunner.runChild(BlockJUnit4ClassRunner.java:57)
	at org.junit.runners.ParentRunner$3.run(ParentRunner.java:290)
	at org.apache.maven.surefire.junitcore.pc.Scheduler$1.run(Scheduler.java:393)
	at java.util.concurrent.Executors$RunnableAdapter.call(Executors.java:511)
(125d72065d3de84f): java.lang.RuntimeException: org.apache.beam.sdk.util.UserCodeException:
java.lang.AssertionError: Wrong number of elements in output collection: 
Expected: iterable over [<2L>, <1L>] in any order
     but: Not matched: <1L>
	at com.google.cloud.dataflow.worker.runners.worker.GroupAlsoByWindowsParDoFn$1.output(GroupAlsoByWindowsParDoFn.java:146)
	at com.google.cloud.dataflow.worker.runners.worker.GroupAlsoByWindowFnRunner$1.outputWindowedValue(GroupAlsoByWindowFnRunner.java:104)
	at com.google.cloud.dataflow.worker.util.BatchGroupAlsoByWindowViaIteratorsFn.processElement(BatchGroupAlsoByWindowViaIteratorsFn.java:121)
	at com.google.cloud.dataflow.worker.util.BatchGroupAlsoByWindowViaIteratorsFn.processElement(BatchGroupAlsoByWindowViaIteratorsFn.java:53)
	at com.google.cloud.dataflow.worker.runners.worker.GroupAlsoByWindowFnRunner.invokeProcessElement(GroupAlsoByWindowFnRunner.java:117)
	at com.google.cloud.dataflow.worker.runners.worker.GroupAlsoByWindowFnRunner.processElement(GroupAlsoByWindowFnRunner.java:74)
	at com.google.cloud.dataflow.worker.runners.worker.GroupAlsoByWindowsParDoFn.processElement(GroupAlsoByWindowsParDoFn.java:101)
	at com.google.cloud.dataflow.worker.runners.worker.ForwardingParDoFn.processElement(ForwardingParDoFn.java:42)
	at com.google.cloud.dataflow.worker.runners.worker.DataflowWorkerLoggingParDoFn.processElement(DataflowWorkerLoggingParDoFn.java:47)
	at com.google.cloud.dataflow.worker.util.common.worker.ParDoOperation.process(ParDoOperation.java:48)
	at com.google.cloud.dataflow.worker.util.common.worker.OutputReceiver.process(OutputReceiver.java:52)
	at com.google.cloud.dataflow.worker.util.common.worker.ReadOperation.runReadLoop(ReadOperation.java:188)
	at com.google.cloud.dataflow.worker.util.common.worker.ReadOperation.start(ReadOperation.java:149)
	at com.google.cloud.dataflow.worker.util.common.worker.MapTaskExecutor.execute(MapTaskExecutor.java:69)
	at com.google.cloud.dataflow.worker.runners.worker.DataflowWorker.executeWork(DataflowWorker.java:340)
	at com.google.cloud.dataflow.worker.runners.worker.DataflowWorker.doWork(DataflowWorker.java:296)
	at com.google.cloud.dataflow.worker.runners.worker.DataflowWorker.getAndPerformWork(DataflowWorker.java:238)
	at com.google.cloud.dataflow.worker.runners.worker.DataflowBatchWorkerHarness$WorkerThread.doWork(DataflowBatchWorkerHarness.java:135)
	at com.google.cloud.dataflow.worker.runners.worker.DataflowBatchWorkerHarness$WorkerThread.call(DataflowBatchWorkerHarness.java:115)
	at com.google.cloud.dataflow.worker.runners.worker.DataflowBatchWorkerHarness$WorkerThread.call(DataflowBatchWorkerHarness.java:102)
	at java.util.concurrent.FutureTask.run(FutureTask.java:266)
	at java.util.concurrent.ThreadPoolExecutor.runWorker(ThreadPoolExecutor.java:1142)
	at java.util.concurrent.ThreadPoolExecutor$Worker.run(ThreadPoolExecutor.java:617)
	at java.lang.Thread.run(Thread.java:745)
Caused by: org.apache.beam.sdk.util.UserCodeException: java.lang.AssertionError: Wrong number
of elements in output collection: 
Expected: iterable over [<2L>, <1L>] in any order
     but: Not matched: <1L>
	at org.apache.beam.sdk.util.UserCodeException.wrap(UserCodeException.java:36)
	at org.apache.beam.sdk.testing.PAssert$DefaultConcludeFn$DoFnInvoker.invokeProcessElement(Unknown
Source)
	at org.apache.beam.runners.core.SimpleDoFnRunner.invokeProcessElement(SimpleDoFnRunner.java:177)
	at org.apache.beam.runners.core.SimpleDoFnRunner.processElement(SimpleDoFnRunner.java:141)
	at com.google.cloud.dataflow.worker.runners.worker.SimpleParDoFn.processElement(SimpleParDoFn.java:244)
	at com.google.cloud.dataflow.worker.runners.worker.ForwardingParDoFn.processElement(ForwardingParDoFn.java:42)
	at com.google.cloud.dataflow.worker.runners.worker.DataflowWorkerLoggingParDoFn.processElement(DataflowWorkerLoggingParDoFn.java:47)
	at com.google.cloud.dataflow.worker.util.common.worker.ParDoOperation.process(ParDoOperation.java:48)
	at com.google.cloud.dataflow.worker.util.common.worker.OutputReceiver.process(OutputReceiver.java:52)
	at com.google.cloud.dataflow.worker.runners.worker.SimpleParDoFn$1.output(SimpleParDoFn.java:193)
	at org.apache.beam.runners.core.SimpleDoFnRunner.outputWindowedValue(SimpleDoFnRunner.java:211)
	at org.apache.beam.runners.core.SimpleDoFnRunner.access$700(SimpleDoFnRunner.java:66)
	at org.apache.beam.runners.core.SimpleDoFnRunner$DoFnProcessContext.output(SimpleDoFnRunner.java:436)
	at org.apache.beam.runners.core.SimpleDoFnRunner$DoFnProcessContext.output(SimpleDoFnRunner.java:424)
	at org.apache.beam.sdk.testing.PAssert$GroupedValuesCheckerDoFn.processElement(PAssert.java:1228)
	at org.apache.beam.sdk.testing.PAssert$GroupedValuesCheckerDoFn$DoFnInvoker.invokeProcessElement(Unknown
Source)
	at org.apache.beam.runners.core.SimpleDoFnRunner.invokeProcessElement(SimpleDoFnRunner.java:177)
	at org.apache.beam.runners.core.SimpleDoFnRunner.processElement(SimpleDoFnRunner.java:141)
	at com.google.cloud.dataflow.worker.runners.worker.SimpleParDoFn.processElement(SimpleParDoFn.java:244)
	at com.google.cloud.dataflow.worker.runners.worker.ForwardingParDoFn.processElement(ForwardingParDoFn.java:42)
	at com.google.cloud.dataflow.worker.runners.worker.DataflowWorkerLoggingParDoFn.processElement(DataflowWorkerLoggingParDoFn.java:47)
	at com.google.cloud.dataflow.worker.util.common.worker.ParDoOperation.process(ParDoOperation.java:48)
	at com.google.cloud.dataflow.worker.util.common.worker.OutputReceiver.process(OutputReceiver.java:52)
	at com.google.cloud.dataflow.worker.runners.worker.SimpleParDoFn$1.output(SimpleParDoFn.java:193)
	at org.apache.beam.runners.core.SimpleDoFnRunner.outputWindowedValue(SimpleDoFnRunner.java:211)
	at org.apache.beam.runners.core.SimpleDoFnRunner.access$700(SimpleDoFnRunner.java:66)
	at org.apache.beam.runners.core.SimpleDoFnRunner$DoFnProcessContext.output(SimpleDoFnRunner.java:436)
	at org.apache.beam.runners.core.SimpleDoFnRunner$DoFnProcessContext.output(SimpleDoFnRunner.java:424)
	at org.apache.beam.sdk.transforms.MapElements$1.processElement(MapElements.java:122)
	at org.apache.beam.sdk.transforms.MapElements$1$DoFnInvoker.invokeProcessElement(Unknown
Source)
	at org.apache.beam.runners.core.SimpleDoFnRunner.invokeProcessElement(SimpleDoFnRunner.java:177)
	at org.apache.beam.runners.core.SimpleDoFnRunner.processElement(SimpleDoFnRunner.java:141)
	at com.google.cloud.dataflow.worker.runners.worker.SimpleParDoFn.processElement(SimpleParDoFn.java:244)
	at com.google.cloud.dataflow.worker.runners.worker.ForwardingParDoFn.processElement(ForwardingParDoFn.java:42)
	at com.google.cloud.dataflow.worker.runners.worker.DataflowWorkerLoggingParDoFn.processElement(DataflowWorkerLoggingParDoFn.java:47)
	at com.google.cloud.dataflow.worker.util.common.worker.ParDoOperation.process(ParDoOperation.java:48)
	at com.google.cloud.dataflow.worker.util.common.worker.OutputReceiver.process(OutputReceiver.java:52)
	at com.google.cloud.dataflow.worker.runners.worker.SimpleParDoFn$1.output(SimpleParDoFn.java:193)
	at org.apache.beam.runners.core.SimpleDoFnRunner.outputWindowedValue(SimpleDoFnRunner.java:211)
	at org.apache.beam.runners.core.SimpleDoFnRunner.access$700(SimpleDoFnRunner.java:66)
	at org.apache.beam.runners.core.SimpleDoFnRunner$DoFnProcessContext.output(SimpleDoFnRunner.java:436)
	at org.apache.beam.runners.core.SimpleDoFnRunner$DoFnProcessContext.output(SimpleDoFnRunner.java:424)
	at org.apache.beam.sdk.testing.PAssert$ConcatFn.processElement(PAssert.java:1061)
	at org.apache.beam.sdk.testing.PAssert$ConcatFn$DoFnInvoker.invokeProcessElement(Unknown
Source)
	at org.apache.beam.runners.core.SimpleDoFnRunner.invokeProcessElement(SimpleDoFnRunner.java:177)
	at org.apache.beam.runners.core.SimpleDoFnRunner.processElement(SimpleDoFnRunner.java:141)
	at com.google.cloud.dataflow.worker.runners.worker.SimpleParDoFn.processElement(SimpleParDoFn.java:244)
	at com.google.cloud.dataflow.worker.runners.worker.ForwardingParDoFn.processElement(ForwardingParDoFn.java:42)
	at com.google.cloud.dataflow.worker.runners.worker.DataflowWorkerLoggingParDoFn.processElement(DataflowWorkerLoggingParDoFn.java:47)
	at com.google.cloud.dataflow.worker.util.common.worker.ParDoOperation.process(ParDoOperation.java:48)
	at com.google.cloud.dataflow.worker.util.common.worker.OutputReceiver.process(OutputReceiver.java:52)
	at com.google.cloud.dataflow.worker.runners.worker.SimpleParDoFn$1.output(SimpleParDoFn.java:193)
	at org.apache.beam.runners.core.SimpleDoFnRunner.outputWindowedValue(SimpleDoFnRunner.java:211)
	at org.apache.beam.runners.core.SimpleDoFnRunner.access$700(SimpleDoFnRunner.java:66)
	at org.apache.beam.runners.core.SimpleDoFnRunner$DoFnProcessContext.output(SimpleDoFnRunner.java:436)
	at org.apache.beam.runners.core.SimpleDoFnRunner$DoFnProcessContext.output(SimpleDoFnRunner.java:424)
	at org.apache.beam.sdk.transforms.MapElements$1.processElement(MapElements.java:122)
	at org.apache.beam.sdk.transforms.MapElements$1$DoFnInvoker.invokeProcessElement(Unknown
Source)
	at org.apache.beam.runners.core.SimpleDoFnRunner.invokeProcessElement(SimpleDoFnRunner.java:177)
	at org.apache.beam.runners.core.SimpleDoFnRunner.processElement(SimpleDoFnRunner.java:141)
	at com.google.cloud.dataflow.worker.runners.worker.SimpleParDoFn.processElement(SimpleParDoFn.java:244)
	at com.google.cloud.dataflow.worker.runners.worker.ForwardingParDoFn.processElement(ForwardingParDoFn.java:42)
	at com.google.cloud.dataflow.worker.runners.worker.DataflowWorkerLoggingParDoFn.processElement(DataflowWorkerLoggingParDoFn.java:47)
	at com.google.cloud.dataflow.worker.util.common.worker.ParDoOperation.process(ParDoOperation.java:48)
	at com.google.cloud.dataflow.worker.util.common.worker.OutputReceiver.process(OutputReceiver.java:52)
	at com.google.cloud.dataflow.worker.runners.worker.GroupAlsoByWindowsParDoFn$1.output(GroupAlsoByWindowsParDoFn.java:144)
	... 23 more
Caused by: java.lang.AssertionError: Wrong number of elements in output collection: 
Expected: iterable over [<2L>, <1L>] in any order
     but: Not matched: <1L>
	at org.apache.beam.sdk.testing.PAssert$PAssertionSite.capture(PAssert.java:170)
	at org.apache.beam.sdk.testing.PAssert.that(PAssert.java:366)
	at org.apache.beam.sdk.transforms.windowing.WindowTest.testMergingCustomWindowsKeyedCollection(WindowTest.java:625)
	at sun.reflect.NativeMethodAccessorImpl.invoke0(Native Method)
	at sun.reflect.NativeMethodAccessorImpl.invoke(NativeMethodAccessorImpl.java:62)
	at sun.reflect.DelegatingMethodAccessorImpl.invoke(DelegatingMethodAccessorImpl.java:43)
	at java.lang.reflect.Method.invoke(Method.java:498)
	at org.junit.runners.model.FrameworkMethod$1.runReflectiveCall(FrameworkMethod.java:50)
	at org.junit.internal.runners.model.ReflectiveCallable.run(ReflectiveCallable.java:12)
	at org.junit.runners.model.FrameworkMethod.invokeExplosively(FrameworkMethod.java:47)
	at org.junit.internal.runners.statements.InvokeMethod.evaluate(InvokeMethod.java:17)
	at org.apache.beam.sdk.testing.TestPipeline$1.evaluate(TestPipeline.java:320)
	at org.junit.rules.ExpectedException$ExpectedExceptionStatement.evaluate(ExpectedException.java:239)
	at org.junit.rules.RunRules.evaluate(RunRules.java:20)
	at org.junit.runners.ParentRunner.runLeaf(ParentRunner.java:325)
	at org.junit.runners.BlockJUnit4ClassRunner.runChild(BlockJUnit4ClassRunner.java:78)
	at org.junit.runners.BlockJUnit4ClassRunner.runChild(BlockJUnit4ClassRunner.java:57)
	at org.junit.runners.ParentRunner$3.run(ParentRunner.java:290)
	at org.apache.maven.surefire.junitcore.pc.Scheduler$1.run(Scheduler.java:393)
	at java.util.concurrent.Executors$RunnableAdapter.call(Executors.java:511)
(df8df07f02ea522c): Workflow failed. Causes: (df8df07f02ea5d47): S11:PAssert$313/GroupGlobally/GroupDummyAndContents/Read+PAssert$313/GroupGlobally/GroupDummyAndContents/GroupByWindow+PAssert$313/GroupGlobally/Values/Values/Map+PAssert$313/GroupGlobally/ParDo(Concat)+PAssert$313/GetPane/Map+PAssert$313/RunChecks+PAssert$313/VerifyAssertions/ParDo(DefaultConclude)
failed., (125d72065d3defbb): A work item was attempted 4 times without success. Each time
the worker eventually lost contact with the service. The work item was attempted on: 
  windowtest0testmergingcus-08020023-5dc1-harness-p0c4,
  windowtest0testmergingcus-08020023-5dc1-harness-p0c4,
  windowtest0testmergingcus-08020023-5dc1-harness-p0c4,
  windowtest0testmergingcus-08020023-5dc1-harness-p0c4
	at org.apache.beam.runners.dataflow.TestDataflowRunner.run(TestDataflowRunner.java:133)
	at org.apache.beam.runners.dataflow.TestDataflowRunner.run(TestDataflowRunner.java:89)
	at org.apache.beam.runners.dataflow.TestDataflowRunner.run(TestDataflowRunner.java:54)
	at org.apache.beam.sdk.Pipeline.run(Pipeline.java:303)
	at org.apache.beam.sdk.testing.TestPipeline.run(TestPipeline.java:344)
	at org.apache.beam.sdk.testing.TestPipeline.run(TestPipeline.java:331)
	at org.apache.beam.sdk.transforms.windowing.WindowTest.testMergingCustomWindowsKeyedCollection(WindowTest.java:626)
	at sun.reflect.NativeMethodAccessorImpl.invoke0(Native Method)
	at sun.reflect.NativeMethodAccessorImpl.invoke(NativeMethodAccessorImpl.java:62)
	at sun.reflect.DelegatingMethodAccessorImpl.invoke(DelegatingMethodAccessorImpl.java:43)
	at java.lang.reflect.Method.invoke(Method.java:498)
	at org.junit.runners.model.FrameworkMethod$1.runReflectiveCall(FrameworkMethod.java:50)
	at org.junit.internal.runners.model.ReflectiveCallable.run(ReflectiveCallable.java:12)
	at org.junit.runners.model.FrameworkMethod.invokeExplosively(FrameworkMethod.java:47)
	at org.junit.internal.runners.statements.InvokeMethod.evaluate(InvokeMethod.java:17)
	at org.apache.beam.sdk.testing.TestPipeline$1.evaluate(TestPipeline.java:320)
	at org.junit.rules.ExpectedException$ExpectedExceptionStatement.evaluate(ExpectedException.java:239)
	at org.junit.rules.RunRules.evaluate(RunRules.java:20)
	at org.junit.runners.ParentRunner.runLeaf(ParentRunner.java:325)
	at org.junit.runners.BlockJUnit4ClassRunner.runChild(BlockJUnit4ClassRunner.java:78)
	at org.junit.runners.BlockJUnit4ClassRunner.runChild(BlockJUnit4ClassRunner.java:57)
	at org.junit.runners.ParentRunner$3.run(ParentRunner.java:290)
	at org.apache.maven.surefire.junitcore.pc.Scheduler$1.run(Scheduler.java:393)
	at java.util.concurrent.Executors$RunnableAdapter.call(Executors.java:511)
	at java.util.concurrent.FutureTask.run(FutureTask.java:266)
	at java.util.concurrent.ThreadPoolExecutor.runWorker(ThreadPoolExecutor.java:1149)
	at java.util.concurrent.ThreadPoolExecutor$Worker.run(ThreadPoolExecutor.java:624)
	at java.lang.Thread.run(Thread.java:748)

2017-08-02T07:30:33.139 [INFO] 
2017-08-02T07:30:33.140 [INFO] Results:
2017-08-02T07:30:33.140 [INFO] 
2017-08-02T07:30:33.140 [ERROR] Failures: 
2017-08-02T07:30:33.143 [ERROR]   MetricsTest.testAttemptedCounterMetrics:169->assertCounterMetrics:257

Expected: a collection containing MetricResult{inNamespace="org.apache.beam.sdk.metrics.MetricsTest",
name="count", step="MyStep1", attempted=<3L>}
     but: MetricResult{step: "MyStep1" != "MyStep2"attempted: <3L> != null}, MetricResult{attempted:
<3L> != null}
2017-08-02T07:30:33.143 [ERROR]   MetricsTest.testBoundedSourceMetrics:305 
Expected: a collection containing MetricResult{inNamespace="source", name="elements_read",
step="Read(BoundedCountingSource)", attempted=<1000L>}
     but: MetricResult{attempted: <1000L> != null}
2017-08-02T07:30:33.144 [ERROR]   MetricsTest.testUnboundedSourceMetrics:333 
Expected: a collection containing MetricResult{inNamespace="source", name="elements_read",
step="Read(UnboundedCountingSource)", attempted=<1000L>}
     but: MetricResult{attempted: <1000L> != null}
2017-08-02T07:30:33.144 [ERROR] Errors: 
2017-08-02T07:30:33.144 [ERROR]   SplittableDoFnTest.testOutputAfterCheckpoint:259 » Runtime
(c8b3c4c6ebd1a91d):...
2017-08-02T07:30:33.145 [ERROR]   SplittableDoFnTest.testPairWithIndexBasic:149 » Runtime
(e0da9e844ff07485): ja...
2017-08-02T07:30:33.145 [ERROR]   SplittableDoFnTest.testPairWithIndexWindowedTimestamped:207
» Runtime (12f2391...
2017-08-02T07:30:33.145 [ERROR]   WindowTest.testMergingCustomWindows:601 » Runtime (dd5dd4fcdf42b119):
java.lan...
2017-08-02T07:30:33.145 [ERROR]   WindowTest.testMergingCustomWindowsKeyedCollection:626 »
Runtime (125d72065d3d...
2017-08-02T07:30:33.145 [INFO] 
2017-08-02T07:30:33.145 [ERROR] Tests run: 259, Failures: 3, Errors: 5, Skipped: 1
2017-08-02T07:30:33.145 [INFO] 
2017-08-02T07:30:33.520 [ERROR] There are test failures.

Please refer to <https://builds.apache.org/job/beam_PostCommit_Java_ValidatesRunner_Dataflow/ws/runners/google-cloud-dataflow-java/target/surefire-reports>
for the individual test results.
Please refer to dump files (if any exist) [date]-jvmRun[N].dump, [date].dumpstream and [date]-jvmRun[N].dumpstream.
[JENKINS] Recording test results
2017-08-02T07:30:39.268 [INFO] 
2017-08-02T07:30:39.268 [INFO] --- maven-dependency-plugin:3.0.1:analyze-only (default) @
beam-runners-google-cloud-dataflow-java ---
2017-08-02T07:30:39.417 [INFO] No dependency problems found
[JENKINS] Archiving disabled
[JENKINS] Archiving disabled
[JENKINS] Archiving disabled
[JENKINS] Archiving disabled
[JENKINS] Archiving disabled
[JENKINS] Archiving disabled
[JENKINS] Archiving disabled
[JENKINS] Archiving disabled
[JENKINS] Archiving disabled
[JENKINS] Archiving disabled
[JENKINS] Archiving disabled
[JENKINS] Archiving disabled
[JENKINS] Archiving disabled
[JENKINS] Archiving disabled
[JENKINS] Archiving disabled
[JENKINS] Archiving disabled
[JENKINS] Archiving disabled
[JENKINS] Archiving disabled
[JENKINS] Archiving disabled
2017-08-02T07:30:54.484 [INFO] ------------------------------------------------------------------------
2017-08-02T07:30:54.484 [INFO] Reactor Summary:
2017-08-02T07:30:54.484 [INFO] 
2017-08-02T07:30:54.485 [INFO] Apache Beam :: Parent .............................. SUCCESS
[ 21.559 s]
2017-08-02T07:30:54.485 [INFO] Apache Beam :: SDKs :: Java :: Build Tools ......... SUCCESS
[ 10.344 s]
2017-08-02T07:30:54.485 [INFO] Apache Beam :: SDKs ................................ SUCCESS
[  2.728 s]
2017-08-02T07:30:54.485 [INFO] Apache Beam :: SDKs :: Common ...................... SUCCESS
[  2.393 s]
2017-08-02T07:30:54.485 [INFO] Apache Beam :: SDKs :: Common :: Runner API ........ SUCCESS
[ 10.700 s]
2017-08-02T07:30:54.485 [INFO] Apache Beam :: SDKs :: Common :: Fn API ............ SUCCESS
[  8.145 s]
2017-08-02T07:30:54.485 [INFO] Apache Beam :: SDKs :: Java ........................ SUCCESS
[  2.437 s]
2017-08-02T07:30:54.485 [INFO] Apache Beam :: SDKs :: Java :: Core ................ SUCCESS
[02:12 min]
2017-08-02T07:30:54.485 [INFO] Apache Beam :: Runners ............................. SUCCESS
[  2.656 s]
2017-08-02T07:30:54.485 [INFO] Apache Beam :: Runners :: Core Construction Java ... SUCCESS
[ 15.936 s]
2017-08-02T07:30:54.485 [INFO] Apache Beam :: Runners :: Core Java ................ SUCCESS
[ 32.081 s]
2017-08-02T07:30:54.485 [INFO] Apache Beam :: Runners :: Direct Java .............. SUCCESS
[05:50 min]
2017-08-02T07:30:54.485 [INFO] Apache Beam :: SDKs :: Java :: IO .................. SUCCESS
[  2.416 s]
2017-08-02T07:30:54.485 [INFO] Apache Beam :: SDKs :: Java :: Extensions .......... SUCCESS
[  2.210 s]
2017-08-02T07:30:54.485 [INFO] Apache Beam :: SDKs :: Java :: Extensions :: Google Cloud Platform
Core SUCCESS [ 17.197 s]
2017-08-02T07:30:54.485 [INFO] Apache Beam :: SDKs :: Java :: Extensions :: Protobuf SUCCESS
[ 16.881 s]
2017-08-02T07:30:54.485 [INFO] Apache Beam :: SDKs :: Java :: IO :: Google Cloud Platform
SUCCESS [01:15 min]
2017-08-02T07:30:54.485 [INFO] Apache Beam :: Runners :: Google Cloud Dataflow .... SUCCESS
[  01:17 h]
2017-08-02T07:30:54.485 [INFO] ------------------------------------------------------------------------
2017-08-02T07:30:54.486 [INFO] BUILD SUCCESS
2017-08-02T07:30:54.486 [INFO] ------------------------------------------------------------------------
2017-08-02T07:30:54.486 [INFO] Total time: 01:29 h
2017-08-02T07:30:54.486 [INFO] Finished at: 2017-08-02T07:30:54+00:00
2017-08-02T07:30:55.853 [INFO] Final Memory: 314M/2537M
2017-08-02T07:30:55.854 [INFO] ------------------------------------------------------------------------
channel stopped
Not sending mail to unregistered user kirpichov@google.com
Not sending mail to unregistered user sourabhbajaj@google.com
Not sending mail to unregistered user fipsy@google.com
Not sending mail to unregistered user aljoscha.krettek@gmail.com
Not sending mail to unregistered user klk@google.com
Not sending mail to unregistered user alex-filatov@users.noreply.github.com

Mime
View raw message