beam-commits mailing list archives

Site index · List index
Message view « Date » · « Thread »
Top « Date » · « Thread »
From Apache Jenkins Server <jenk...@builds.apache.org>
Subject Build failed in Jenkins: beam_PostCommit_Java_MavenInstall #4600
Date Sat, 19 Aug 2017 08:01:06 GMT
See <https://builds.apache.org/job/beam_PostCommit_Java_MavenInstall/4600/display/redirect>

------------------------------------------
[...truncated 3.67 MB...]
2017-08-19T07:59:00.822 [INFO] Downloaded: https://repo.maven.apache.org/maven2/org/sonatype/sisu/sisu-guice/2.9.2/sisu-guice-2.9.2.pom
(8 KB at 265.8 KB/sec)
2017-08-19T07:59:00.824 [INFO] Downloading: https://repo.maven.apache.org/maven2/org/sonatype/sisu/inject/guice-parent/2.9.2/guice-parent-2.9.2.pom
2017-08-19T07:59:00.850 [INFO] Downloaded: https://repo.maven.apache.org/maven2/org/sonatype/sisu/inject/guice-parent/2.9.2/guice-parent-2.9.2.pom
(12 KB at 459.9 KB/sec)
2017-08-19T07:59:00.854 [INFO] Downloading: https://repo.maven.apache.org/maven2/org/slf4j/jcl-over-slf4j/1.7.21/jcl-over-slf4j-1.7.21.pom
2017-08-19T07:59:00.880 [INFO] Downloaded: https://repo.maven.apache.org/maven2/org/slf4j/jcl-over-slf4j/1.7.21/jcl-over-slf4j-1.7.21.pom
(963 B at 36.2 KB/sec)
2017-08-19T07:59:00.885 [INFO] Downloading: https://repo.maven.apache.org/maven2/org/apache/httpcomponents/httpmime/4.5.2/httpmime-4.5.2.jar
2017-08-19T07:59:00.885 [INFO] Downloading: https://repo.maven.apache.org/maven2/com/fasterxml/jackson/core/jackson-core/2.8.3/jackson-core-2.8.3.jar
2017-08-19T07:59:00.886 [INFO] Downloading: https://repo.maven.apache.org/maven2/com/fasterxml/jackson/core/jackson-annotations/2.8.3/jackson-annotations-2.8.3.jar
2017-08-19T07:59:00.886 [INFO] Downloading: https://repo.maven.apache.org/maven2/com/fasterxml/jackson/core/jackson-databind/2.8.3/jackson-databind-2.8.3.jar
2017-08-19T07:59:00.886 [INFO] Downloading: https://repo.maven.apache.org/maven2/org/eclipse/jgit/org.eclipse.jgit/4.5.0.201609210915-r/org.eclipse.jgit-4.5.0.201609210915-r.jar
2017-08-19T07:59:00.917 [INFO] Downloaded: https://repo.maven.apache.org/maven2/org/apache/httpcomponents/httpmime/4.5.2/httpmime-4.5.2.jar
(41 KB at 1252.1 KB/sec)
2017-08-19T07:59:00.917 [INFO] Downloading: https://repo.maven.apache.org/maven2/com/jcraft/jsch/0.1.53/jsch-0.1.53.jar
2017-08-19T07:59:00.919 [INFO] Downloaded: https://repo.maven.apache.org/maven2/com/fasterxml/jackson/core/jackson-annotations/2.8.3/jackson-annotations-2.8.3.jar
(55 KB at 1598.4 KB/sec)
2017-08-19T07:59:00.919 [INFO] Downloading: https://repo.maven.apache.org/maven2/com/googlecode/javaewah/JavaEWAH/0.7.9/JavaEWAH-0.7.9.jar
2017-08-19T07:59:00.937 [INFO] Downloaded: https://repo.maven.apache.org/maven2/com/fasterxml/jackson/core/jackson-core/2.8.3/jackson-core-2.8.3.jar
(275 KB at 5278.7 KB/sec)
2017-08-19T07:59:00.937 [INFO] Downloading: https://repo.maven.apache.org/maven2/org/codehaus/plexus/plexus-utils/2.0.7/plexus-utils-2.0.7.jar
2017-08-19T07:59:00.974 [INFO] Downloaded: https://repo.maven.apache.org/maven2/com/jcraft/jsch/0.1.53/jsch-0.1.53.jar
(274 KB at 3109.5 KB/sec)
2017-08-19T07:59:00.974 [INFO] Downloading: https://repo.maven.apache.org/maven2/org/sonatype/sisu/sisu-inject-plexus/1.4.3.2/sisu-inject-plexus-1.4.3.2.jar
2017-08-19T07:59:00.975 [INFO] Downloaded: https://repo.maven.apache.org/maven2/com/googlecode/javaewah/JavaEWAH/0.7.9/JavaEWAH-0.7.9.jar
(123 KB at 1373.2 KB/sec)
2017-08-19T07:59:00.975 [INFO] Downloading: https://repo.maven.apache.org/maven2/org/sonatype/sisu/sisu-inject-bean/1.4.3.2/sisu-inject-bean-1.4.3.2.jar
2017-08-19T07:59:00.992 [INFO] Downloaded: https://repo.maven.apache.org/maven2/org/codehaus/plexus/plexus-utils/2.0.7/plexus-utils-2.0.7.jar
(219 KB at 2063.2 KB/sec)
2017-08-19T07:59:00.992 [INFO] Downloading: https://repo.maven.apache.org/maven2/org/sonatype/sisu/sisu-guice/2.9.2/sisu-guice-2.9.2-no_aop.jar
2017-08-19T07:59:01.025 [INFO] Downloaded: https://repo.maven.apache.org/maven2/org/sonatype/sisu/sisu-inject-bean/1.4.3.2/sisu-inject-bean-1.4.3.2.jar
(157 KB at 1127.1 KB/sec)
2017-08-19T07:59:01.026 [INFO] Downloading: https://repo.maven.apache.org/maven2/org/slf4j/slf4j-api/1.7.21/slf4j-api-1.7.21.jar
2017-08-19T07:59:01.026 [INFO] Downloaded: https://repo.maven.apache.org/maven2/org/sonatype/sisu/sisu-inject-plexus/1.4.3.2/sisu-inject-plexus-1.4.3.2.jar
(201 KB at 1429.1 KB/sec)
2017-08-19T07:59:01.026 [INFO] Downloading: https://repo.maven.apache.org/maven2/org/slf4j/jcl-over-slf4j/1.7.21/jcl-over-slf4j-1.7.21.jar
2017-08-19T07:59:01.037 [INFO] Downloaded: https://repo.maven.apache.org/maven2/com/fasterxml/jackson/core/jackson-databind/2.8.3/jackson-databind-2.8.3.jar
(1205 KB at 7978.7 KB/sec)
2017-08-19T07:59:01.054 [INFO] Downloaded: https://repo.maven.apache.org/maven2/org/slf4j/jcl-over-slf4j/1.7.21/jcl-over-slf4j-1.7.21.jar
(17 KB at 95.5 KB/sec)
2017-08-19T07:59:01.071 [INFO] Downloaded: https://repo.maven.apache.org/maven2/org/sonatype/sisu/sisu-guice/2.9.2/sisu-guice-2.9.2-no_aop.jar
(469 KB at 2532.9 KB/sec)
2017-08-19T07:59:01.073 [INFO] Downloaded: https://repo.maven.apache.org/maven2/org/slf4j/slf4j-api/1.7.21/slf4j-api-1.7.21.jar
(41 KB at 215.6 KB/sec)
2017-08-19T07:59:01.145 [INFO] Downloaded: https://repo.maven.apache.org/maven2/org/eclipse/jgit/org.eclipse.jgit/4.5.0.201609210915-r/org.eclipse.jgit-4.5.0.201609210915-r.jar
(2324 KB at 8970.5 KB/sec)
2017-08-19T07:59:01.629 [INFO] Starting Coveralls job for jenkins (4600 / https://builds.apache.org/job/beam_PostCommit_Java_MavenInstall/4600/)
2017-08-19T07:59:01.629 [INFO] Using repository token <secret>
2017-08-19T07:59:01.629 [INFO] Git commit 95cd37f in master
2017-08-19T07:59:01.629 [INFO] Writing Coveralls data to <https://builds.apache.org/job/beam_PostCommit_Java_MavenInstall/ws/target/coveralls.json...>
2017-08-19T07:59:01.680 [INFO] Processing coverage report from <https://builds.apache.org/job/beam_PostCommit_Java_MavenInstall/ws/sdks/java/core/target/site/jacoco/jacoco.xml>
2017-08-19T07:59:01.972 [INFO] Processing coverage report from <https://builds.apache.org/job/beam_PostCommit_Java_MavenInstall/ws/sdks/java/extensions/google-cloud-platform-core/target/site/jacoco/jacoco.xml>
2017-08-19T07:59:01.991 [INFO] Processing coverage report from <https://builds.apache.org/job/beam_PostCommit_Java_MavenInstall/ws/sdks/java/extensions/protobuf/target/site/jacoco/jacoco.xml>
2017-08-19T07:59:01.995 [INFO] Processing coverage report from <https://builds.apache.org/job/beam_PostCommit_Java_MavenInstall/ws/sdks/java/java8tests/target/site/jacoco/jacoco.xml>
2017-08-19T07:59:01.996 [INFO] Processing coverage report from <https://builds.apache.org/job/beam_PostCommit_Java_MavenInstall/ws/runners/core-java/target/site/jacoco/jacoco.xml>
2017-08-19T07:59:02.143 [INFO] Processing coverage report from <https://builds.apache.org/job/beam_PostCommit_Java_MavenInstall/ws/runners/direct-java/target/site/jacoco/jacoco.xml>
2017-08-19T07:59:02.270 [INFO] Processing coverage report from <https://builds.apache.org/job/beam_PostCommit_Java_MavenInstall/ws/runners/google-cloud-dataflow-java/target/site/jacoco/jacoco.xml>
2017-08-19T07:59:02.381 [INFO] Processing coverage report from <https://builds.apache.org/job/beam_PostCommit_Java_MavenInstall/ws/examples/java/target/site/jacoco/jacoco.xml>
2017-08-19T07:59:02.433 [INFO] Processing coverage report from <https://builds.apache.org/job/beam_PostCommit_Java_MavenInstall/ws/examples/java8/target/site/jacoco/jacoco.xml>
2017-08-19T07:59:02.489 [INFO] Successfully wrote Coveralls data in 860ms
2017-08-19T07:59:02.490 [INFO] Gathered code coverage metrics for 526 source files with 119418
lines of code:
2017-08-19T07:59:02.490 [INFO] - 30317 relevant lines
2017-08-19T07:59:02.490 [INFO] - 21212 covered lines
2017-08-19T07:59:02.490 [INFO] - 9105 missed lines
2017-08-19T07:59:02.490 [INFO] Submitting Coveralls data to API
2017-08-19T08:00:02.745 [ERROR] Submission failed in 60255ms while handling I/O operations
[JENKINS] Archiving disabled
[JENKINS] Archiving disabled
[JENKINS] Archiving disabled
[JENKINS] Archiving disabled
[JENKINS] Archiving disabled
[JENKINS] Archiving disabled
[JENKINS] Archiving disabled
[JENKINS] Archiving disabled
[JENKINS] Archiving disabled
[JENKINS] Archiving disabled
[JENKINS] Archiving disabled
[JENKINS] Archiving disabled
[JENKINS] Archiving disabled
[JENKINS] Archiving disabled
[JENKINS] Archiving disabled
[JENKINS] Archiving disabled
[JENKINS] Archiving disabled
[JENKINS] Archiving disabled
[JENKINS] Archiving disabled
[JENKINS] Archiving disabled
[JENKINS] Archiving disabled
[JENKINS] Archiving disabled
[JENKINS] Archiving disabled
[JENKINS] Archiving disabled
[JENKINS] Archiving disabled
[JENKINS] Archiving disabled
[JENKINS] Archiving disabled
[JENKINS] Archiving disabled
[JENKINS] Archiving disabled
[JENKINS] Archiving disabled
[JENKINS] Archiving disabled
[JENKINS] Archiving disabled
[JENKINS] Archiving disabled
[JENKINS] Archiving disabled
[JENKINS] Archiving disabled
[JENKINS] Archiving disabled
[JENKINS] Archiving disabled
[JENKINS] Archiving disabled
[JENKINS] Archiving disabled
[JENKINS] Archiving disabled
[JENKINS] Archiving disabled
[JENKINS] Archiving disabled
[JENKINS] Archiving disabled
[JENKINS] Archiving disabled
[JENKINS] Archiving disabled
[JENKINS] Archiving disabled
[JENKINS] Archiving disabled
[JENKINS] Archiving disabled
[JENKINS] Archiving disabled
[JENKINS] Archiving disabled
[JENKINS] Archiving disabled
[JENKINS] Archiving disabled
[JENKINS] Archiving disabled
[JENKINS] Archiving disabled
[JENKINS] Archiving disabled
[JENKINS] Archiving disabled2017-08-19T08:00:59.150 [INFO] ------------------------------------------------------------------------
2017-08-19T08:00:59.150 [INFO] Reactor Summary:
2017-08-19T08:00:59.150 [INFO] 
2017-08-19T08:00:59.150 [INFO] Apache Beam :: Parent .............................. FAILURE
[01:07 min]
2017-08-19T08:00:59.150 [INFO] Apache Beam :: SDKs :: Java :: Build Tools ......... SUCCESS
[ 20.640 s]
2017-08-19T08:00:59.150 [INFO] Apache Beam :: SDKs ................................ SUCCESS
[  5.481 s]
2017-08-19T08:00:59.150 [INFO] Apache Beam :: SDKs :: Common ...................... SUCCESS
[  3.126 s]
2017-08-19T08:00:59.150 [INFO] Apache Beam :: SDKs :: Common :: Runner API ........ SUCCESS
[ 29.784 s]
2017-08-19T08:00:59.150 [INFO] Apache Beam :: SDKs :: Common :: Fn API ............ SUCCESS
[ 15.264 s]
2017-08-19T08:00:59.150 [INFO] Apache Beam :: SDKs :: Java ........................ SUCCESS
[  2.959 s]
2017-08-19T08:00:59.150 [INFO] Apache Beam :: SDKs :: Java :: Core ................ SUCCESS
[02:38 min]
2017-08-19T08:00:59.150 [INFO] Apache Beam :: Runners ............................. SUCCESS
[  3.076 s]
2017-08-19T08:00:59.150 [INFO] Apache Beam :: Runners :: Core Construction Java ... SUCCESS
[ 48.954 s]
2017-08-19T08:00:59.150 [INFO] Apache Beam :: Runners :: Core Java ................ SUCCESS
[ 47.027 s]
2017-08-19T08:00:59.150 [INFO] Apache Beam :: Runners :: Direct Java .............. SUCCESS
[04:34 min]
2017-08-19T08:00:59.150 [INFO] Apache Beam :: SDKs :: Java :: IO .................. SUCCESS
[  3.004 s]
2017-08-19T08:00:59.150 [INFO] Apache Beam :: SDKs :: Java :: IO :: AMQP .......... SUCCESS
[ 43.757 s]
2017-08-19T08:00:59.150 [INFO] Apache Beam :: SDKs :: Java :: IO :: Common ........ SUCCESS
[  6.482 s]
2017-08-19T08:00:59.150 [INFO] Apache Beam :: SDKs :: Java :: IO :: Cassandra ..... SUCCESS
[ 46.589 s]
2017-08-19T08:00:59.150 [INFO] Apache Beam :: SDKs :: Java :: IO :: Elasticsearch . SUCCESS
[ 41.820 s]
2017-08-19T08:00:59.150 [INFO] Apache Beam :: SDKs :: Java :: Extensions .......... SUCCESS
[  2.987 s]
2017-08-19T08:00:59.150 [INFO] Apache Beam :: SDKs :: Java :: Extensions :: Google Cloud Platform
Core SUCCESS [ 31.214 s]
2017-08-19T08:00:59.150 [INFO] Apache Beam :: SDKs :: Java :: Extensions :: Protobuf SUCCESS
[ 21.463 s]
2017-08-19T08:00:59.150 [INFO] Apache Beam :: SDKs :: Java :: IO :: Google Cloud Platform
SUCCESS [01:35 min]
2017-08-19T08:00:59.150 [INFO] Apache Beam :: SDKs :: Java :: IO :: Hadoop Common . SUCCESS
[ 25.075 s]
2017-08-19T08:00:59.150 [INFO] Apache Beam :: SDKs :: Java :: IO :: Hadoop File System SUCCESS
[ 50.735 s]
2017-08-19T08:00:59.150 [INFO] Apache Beam :: SDKs :: Java :: IO :: Hadoop ........ SUCCESS
[  5.470 s]
2017-08-19T08:00:59.150 [INFO] Apache Beam :: SDKs :: Java :: IO :: Hadoop :: input-format
SUCCESS [ 26.678 s]
2017-08-19T08:00:59.150 [INFO] Apache Beam :: Runners :: Google Cloud Dataflow .... SUCCESS
[08:37 min]
2017-08-19T08:00:59.150 [INFO] Apache Beam :: SDKs :: Java :: IO :: Hadoop :: jdk1.8-tests
SUCCESS [01:37 min]
2017-08-19T08:00:59.150 [INFO] Apache Beam :: SDKs :: Java :: IO :: HBase ......... SUCCESS
[01:07 min]
2017-08-19T08:00:59.151 [INFO] Apache Beam :: SDKs :: Java :: IO :: HCatalog ...... SUCCESS
[01:21 min]
2017-08-19T08:00:59.151 [INFO] Apache Beam :: SDKs :: Java :: IO :: JDBC .......... SUCCESS
[ 44.160 s]
2017-08-19T08:00:59.151 [INFO] Apache Beam :: SDKs :: Java :: IO :: JMS ........... SUCCESS
[ 25.457 s]
2017-08-19T08:00:59.151 [INFO] Apache Beam :: SDKs :: Java :: IO :: Kafka ......... SUCCESS
[ 54.904 s]
2017-08-19T08:00:59.151 [INFO] Apache Beam :: SDKs :: Java :: IO :: Kinesis ....... SUCCESS
[ 25.392 s]
2017-08-19T08:00:59.151 [INFO] Apache Beam :: SDKs :: Java :: IO :: MongoDB ....... SUCCESS
[ 43.313 s]
2017-08-19T08:00:59.151 [INFO] Apache Beam :: SDKs :: Java :: IO :: MQTT .......... SUCCESS
[ 25.899 s]
2017-08-19T08:00:59.151 [INFO] Apache Beam :: SDKs :: Java :: IO :: Solr .......... SUCCESS
[ 46.983 s]
2017-08-19T08:00:59.151 [INFO] Apache Beam :: SDKs :: Java :: IO :: XML ........... SUCCESS
[ 32.695 s]
2017-08-19T08:00:59.151 [INFO] Apache Beam :: SDKs :: Java :: Maven Archetypes .... SUCCESS
[  2.497 s]
2017-08-19T08:00:59.151 [INFO] Apache Beam :: SDKs :: Java :: Maven Archetypes :: Starter
SUCCESS [ 29.998 s]
2017-08-19T08:00:59.151 [INFO] Apache Beam :: Examples ............................ SUCCESS
[  3.315 s]
2017-08-19T08:00:59.151 [INFO] Apache Beam :: Examples :: Java .................... SUCCESS
[07:00 min]
2017-08-19T08:00:59.151 [INFO] Apache Beam :: SDKs :: Java :: Maven Archetypes :: Examples
SUCCESS [ 41.462 s]
2017-08-19T08:00:59.151 [INFO] Apache Beam :: Examples :: Java 8 .................. SUCCESS
[ 31.403 s]
2017-08-19T08:00:59.151 [INFO] Apache Beam :: SDKs :: Java :: Maven Archetypes :: Examples
- Java 8 SUCCESS [ 44.850 s]
2017-08-19T08:00:59.151 [INFO] Apache Beam :: SDKs :: Java :: Extensions :: Jackson SUCCESS
[ 33.214 s]
2017-08-19T08:00:59.151 [INFO] Apache Beam :: SDKs :: Java :: Extensions :: Join library SUCCESS
[ 26.211 s]
2017-08-19T08:00:59.151 [INFO] Apache Beam :: SDKs :: Java :: Extensions :: Sorter  SUCCESS
[ 45.600 s]
2017-08-19T08:00:59.151 [INFO] Apache Beam :: SDKs :: Java :: Harness ............. SUCCESS
[ 42.722 s]
2017-08-19T08:00:59.151 [INFO] Apache Beam :: SDKs :: Java :: Java 8 Tests ........ SUCCESS
[ 20.922 s]
2017-08-19T08:00:59.151 [INFO] Apache Beam :: SDKs :: Python ...................... SUCCESS
[30:05 min]
2017-08-19T08:00:59.151 [INFO] Apache Beam :: Runners :: Flink .................... SUCCESS
[ 49.905 s]
2017-08-19T08:00:59.151 [INFO] Apache Beam :: Runners :: Spark .................... SUCCESS
[02:38 min]
2017-08-19T08:00:59.151 [INFO] Apache Beam :: Runners :: Apex ..................... SUCCESS
[01:08 min]
2017-08-19T08:00:59.151 [INFO] Apache Beam :: Runners :: Gearpump ................. SUCCESS
[ 39.149 s]
2017-08-19T08:00:59.151 [INFO] Apache Beam :: SDKs :: Java :: Aggregated Javadoc .. SUCCESS
[ 26.241 s]
2017-08-19T08:00:59.151 [INFO] ------------------------------------------------------------------------
2017-08-19T08:00:59.151 [INFO] BUILD FAILURE
2017-08-19T08:00:59.151 [INFO] ------------------------------------------------------------------------
2017-08-19T08:00:59.151 [INFO] Total time: 01:26 h
2017-08-19T08:00:59.151 [INFO] Finished at: 2017-08-19T08:00:59+00:00

2017-08-19T08:00:59.887 [INFO] Final Memory: 312M/1833M
2017-08-19T08:00:59.887 [INFO] ------------------------------------------------------------------------
2017-08-19T08:00:59.898 [ERROR] Failed to execute goal org.eluder.coveralls:coveralls-maven-plugin:4.3.0:report
(default-cli) on project beam-parent: I/O operation failed: Read timed out -> [Help 1]
org.apache.maven.lifecycle.LifecycleExecutionException: Failed to execute goal org.eluder.coveralls:coveralls-maven-plugin:4.3.0:report
(default-cli) on project beam-parent: I/O operation failed
	at org.apache.maven.lifecycle.internal.MojoExecutor.execute(MojoExecutor.java:212)
	at org.apache.maven.lifecycle.internal.MojoExecutor.execute(MojoExecutor.java:153)
	at org.apache.maven.lifecycle.internal.MojoExecutor.execute(MojoExecutor.java:145)
	at org.apache.maven.lifecycle.internal.LifecycleModuleBuilder.buildProject(LifecycleModuleBuilder.java:116)
	at org.apache.maven.lifecycle.internal.LifecycleModuleBuilder.buildProject(LifecycleModuleBuilder.java:80)
	at org.apache.maven.lifecycle.internal.builder.singlethreaded.SingleThreadedBuilder.build(SingleThreadedBuilder.java:51)
	at org.apache.maven.lifecycle.internal.LifecycleStarter.execute(LifecycleStarter.java:128)
	at org.apache.maven.DefaultMaven.doExecute(DefaultMaven.java:307)
	at org.apache.maven.DefaultMaven.doExecute(DefaultMaven.java:193)
	at org.apache.maven.DefaultMaven.execute(DefaultMaven.java:106)
	at org.jvnet.hudson.maven3.launcher.Maven33Launcher.main(Maven33Launcher.java:129)
	at sun.reflect.NativeMethodAccessorImpl.invoke0(Native Method)
	at sun.reflect.NativeMethodAccessorImpl.invoke(NativeMethodAccessorImpl.java:62)
	at sun.reflect.DelegatingMethodAccessorImpl.invoke(DelegatingMethodAccessorImpl.java:43)
	at java.lang.reflect.Method.invoke(Method.java:498)
	at org.codehaus.plexus.classworlds.launcher.Launcher.launchStandard(Launcher.java:330)
	at org.codehaus.plexus.classworlds.launcher.Launcher.launch(Launcher.java:238)
	at jenkins.maven3.agent.Maven33Main.launch(Maven33Main.java:176)
	at sun.reflect.NativeMethodAccessorImpl.invoke0(Native Method)
	at sun.reflect.NativeMethodAccessorImpl.invoke(NativeMethodAccessorImpl.java:62)
	at sun.reflect.DelegatingMethodAccessorImpl.invoke(DelegatingMethodAccessorImpl.java:43)
	at java.lang.reflect.Method.invoke(Method.java:498)
	at hudson.maven.Maven3Builder.call(Maven3Builder.java:139)
	at hudson.maven.Maven3Builder.call(Maven3Builder.java:70)
	at hudson.remoting.UserRequest.perform(UserRequest.java:153)
	at hudson.remoting.UserRequest.perform(UserRequest.java:50)
	at hudson.remoting.Request$2.run(Request.java:336)
	at hudson.remoting.InterceptingExecutorService$1.call(InterceptingExecutorService.java:68)
	at java.util.concurrent.FutureTask.run(FutureTask.java:266)
	at java.util.concurrent.ThreadPoolExecutor.runWorker(ThreadPoolExecutor.java:1149)
	at java.util.concurrent.ThreadPoolExecutor$Worker.run(ThreadPoolExecutor.java:624)
	at java.lang.Thread.run(Thread.java:748)
Caused by: org.apache.maven.plugin.MojoFailureException: I/O operation failed
	at org.eluder.coveralls.maven.plugin.CoverallsReportMojo.execute(CoverallsReportMojo.java:259)
	at org.apache.maven.plugin.DefaultBuildPluginManager.executeMojo(DefaultBuildPluginManager.java:134)
	at org.apache.maven.lifecycle.internal.MojoExecutor.execute(MojoExecutor.java:208)
	... 31 more
Caused by: java.net.SocketTimeoutException: Read timed out
	at java.net.SocketInputStream.socketRead0(Native Method)
	at java.net.SocketInputStream.socketRead(SocketInputStream.java:116)
	at java.net.SocketInputStream.read(SocketInputStream.java:171)
	at java.net.SocketInputStream.read(SocketInputStream.java:141)
	at sun.security.ssl.InputRecord.readFully(InputRecord.java:465)
	at sun.security.ssl.InputRecord.read(InputRecord.java:503)
	at sun.security.ssl.SSLSocketImpl.readRecord(SSLSocketImpl.java:983)
	at sun.security.ssl.SSLSocketImpl.readDataRecord(SSLSocketImpl.java:940)
	at sun.security.ssl.AppInputStream.read(AppInputStream.java:105)
	at org.apache.http.impl.io.SessionInputBufferImpl.streamRead(SessionInputBufferImpl.java:139)
	at org.apache.http.impl.io.SessionInputBufferImpl.fillBuffer(SessionInputBufferImpl.java:155)
	at org.apache.http.impl.io.SessionInputBufferImpl.readLine(SessionInputBufferImpl.java:284)
	at org.apache.http.impl.conn.DefaultHttpResponseParser.parseHead(DefaultHttpResponseParser.java:140)
	at org.apache.http.impl.conn.DefaultHttpResponseParser.parseHead(DefaultHttpResponseParser.java:57)
	at org.apache.http.impl.io.AbstractMessageParser.parse(AbstractMessageParser.java:261)
	at org.apache.http.impl.DefaultBHttpClientConnection.receiveResponseHeader(DefaultBHttpClientConnection.java:165)
	at org.apache.http.impl.conn.CPoolProxy.receiveResponseHeader(CPoolProxy.java:167)
	at org.apache.http.protocol.HttpRequestExecutor.doReceiveResponse(HttpRequestExecutor.java:272)
	at org.apache.http.protocol.HttpRequestExecutor.execute(HttpRequestExecutor.java:124)
	at org.apache.http.impl.execchain.MainClientExec.execute(MainClientExec.java:271)
	at org.apache.http.impl.execchain.ProtocolExec.execute(ProtocolExec.java:184)
	at org.apache.http.impl.execchain.RetryExec.execute(RetryExec.java:88)
	at org.apache.http.impl.execchain.RedirectExec.execute(RedirectExec.java:110)
	at org.apache.http.impl.client.InternalHttpClient.doExecute(InternalHttpClient.java:184)
	at org.apache.http.impl.client.CloseableHttpClient.execute(CloseableHttpClient.java:82)
	at org.apache.http.impl.client.CloseableHttpClient.execute(CloseableHttpClient.java:107)
	at org.apache.http.impl.client.CloseableHttpClient.execute(CloseableHttpClient.java:55)
	at org.eluder.coveralls.maven.plugin.httpclient.CoverallsClient.submit(CoverallsClient.java:84)
	at org.eluder.coveralls.maven.plugin.CoverallsReportMojo.submitData(CoverallsReportMojo.java:400)
	at org.eluder.coveralls.maven.plugin.CoverallsReportMojo.execute(CoverallsReportMojo.java:254)
	... 33 more
2017-08-19T08:00:59.899 [ERROR] 
2017-08-19T08:00:59.899 [ERROR] Re-run Maven using the -X switch to enable full debug logging.
2017-08-19T08:00:59.899 [ERROR] 
2017-08-19T08:00:59.899 [ERROR] For more information about the errors and possible solutions,
please read the following articles:
2017-08-19T08:00:59.899 [ERROR] [Help 1] http://cwiki.apache.org/confluence/display/MAVEN/MojoFailureException
channel stopped

Mime
View raw message