beam-commits mailing list archives

Site index · List index
Message view « Date » · « Thread »
Top « Date » · « Thread »
From Apache Jenkins Server <jenk...@builds.apache.org>
Subject Build failed in Jenkins: beam_PostCommit_Java_ValidatesRunner_Spark #2849
Date Fri, 18 Aug 2017 06:11:41 GMT
See <https://builds.apache.org/job/beam_PostCommit_Java_ValidatesRunner_Spark/2849/display/redirect>

------------------------------------------
[...truncated 597.03 KB...]
2017-08-18T06:10:51.628 [INFO] Downloading: https://repo.maven.apache.org/maven2/org/apache/spark/spark-network-common_2.10/1.6.3/spark-network-common_2.10-1.6.3.jar
2017-08-18T06:10:51.629 [INFO] Downloaded: https://repo.maven.apache.org/maven2/net/sf/py4j/py4j/0.9/py4j-0.9.jar
(83 KB at 67.7 KB/sec)
2017-08-18T06:10:51.629 [INFO] Downloading: https://repo.maven.apache.org/maven2/org/apache/hadoop/hadoop-common/2.7.3/hadoop-common-2.7.3.jar
2017-08-18T06:10:51.661 [INFO] Downloaded: https://repo.maven.apache.org/maven2/net/razorvine/pyrolite/4.9/pyrolite-4.9.jar
(92 KB at 72.9 KB/sec)
2017-08-18T06:10:51.661 [INFO] Downloading: https://repo.maven.apache.org/maven2/org/apache/hadoop/hadoop-annotations/2.7.3/hadoop-annotations-2.7.3.jar
2017-08-18T06:10:51.694 [INFO] Downloaded: https://repo.maven.apache.org/maven2/org/apache/hadoop/hadoop-annotations/2.7.3/hadoop-annotations-2.7.3.jar
(40 KB at 31.1 KB/sec)
2017-08-18T06:10:51.694 [INFO] Downloading: https://repo.maven.apache.org/maven2/xmlenc/xmlenc/0.52/xmlenc-0.52.jar
2017-08-18T06:10:51.723 [INFO] Downloaded: https://repo.maven.apache.org/maven2/xmlenc/xmlenc/0.52/xmlenc-0.52.jar
(15 KB at 11.2 KB/sec)
2017-08-18T06:10:51.723 [INFO] Downloading: https://repo.maven.apache.org/maven2/commons-codec/commons-codec/1.4/commons-codec-1.4.jar
2017-08-18T06:10:51.759 [INFO] Downloaded: https://repo.maven.apache.org/maven2/commons-codec/commons-codec/1.4/commons-codec-1.4.jar
(57 KB at 42.1 KB/sec)
2017-08-18T06:10:51.759 [INFO] Downloading: https://repo.maven.apache.org/maven2/org/mortbay/jetty/jetty/6.1.26/jetty-6.1.26.jar
2017-08-18T06:10:51.837 [INFO] Downloaded: https://repo.maven.apache.org/maven2/org/apache/spark/spark-network-common_2.10/1.6.3/spark-network-common_2.10-1.6.3.jar
(2298 KB at 1610.0 KB/sec)
2017-08-18T06:10:51.837 [INFO] Downloading: https://repo.maven.apache.org/maven2/org/mortbay/jetty/jetty-util/6.1.26/jetty-util-6.1.26.jar
2017-08-18T06:10:51.874 [INFO] Downloaded: https://repo.maven.apache.org/maven2/org/mortbay/jetty/jetty/6.1.26/jetty-6.1.26.jar
(528 KB at 360.1 KB/sec)
2017-08-18T06:10:51.874 [INFO] Downloading: https://repo.maven.apache.org/maven2/javax/servlet/jsp/jsp-api/2.1/jsp-api-2.1.jar
2017-08-18T06:10:51.875 [INFO] Downloaded: https://repo.maven.apache.org/maven2/org/mortbay/jetty/jetty-util/6.1.26/jetty-util-6.1.26.jar
(173 KB at 118.1 KB/sec)
2017-08-18T06:10:51.875 [INFO] Downloading: https://repo.maven.apache.org/maven2/com/sun/jersey/jersey-json/1.9/jersey-json-1.9.jar
2017-08-18T06:10:51.889 [INFO] Downloaded: https://repo.maven.apache.org/maven2/org/apache/hadoop/hadoop-common/2.7.3/hadoop-common-2.7.3.jar
(3398 KB at 2297.3 KB/sec)
2017-08-18T06:10:51.889 [INFO] Downloading: https://repo.maven.apache.org/maven2/org/codehaus/jettison/jettison/1.1/jettison-1.1.jar
2017-08-18T06:10:51.903 [INFO] Downloaded: https://repo.maven.apache.org/maven2/org/apache/spark/spark-streaming_2.10/1.6.3/spark-streaming_2.10-1.6.3.jar
(2005 KB at 1342.5 KB/sec)
2017-08-18T06:10:51.903 [INFO] Downloading: https://repo.maven.apache.org/maven2/com/sun/xml/bind/jaxb-impl/2.2.3-1/jaxb-impl-2.2.3-1.jar
2017-08-18T06:10:51.912 [INFO] Downloaded: https://repo.maven.apache.org/maven2/javax/servlet/jsp/jsp-api/2.1/jsp-api-2.1.jar
(99 KB at 65.4 KB/sec)
2017-08-18T06:10:51.912 [INFO] Downloading: https://repo.maven.apache.org/maven2/org/codehaus/jackson/jackson-jaxrs/1.8.3/jackson-jaxrs-1.8.3.jar
2017-08-18T06:10:51.913 [INFO] Downloaded: https://repo.maven.apache.org/maven2/com/sun/jersey/jersey-json/1.9/jersey-json-1.9.jar
(145 KB at 96.1 KB/sec)
2017-08-18T06:10:51.913 [INFO] Downloading: https://repo.maven.apache.org/maven2/org/codehaus/jackson/jackson-xc/1.8.3/jackson-xc-1.8.3.jar
2017-08-18T06:10:51.918 [INFO] Downloaded: https://repo.maven.apache.org/maven2/org/codehaus/jettison/jettison/1.1/jettison-1.1.jar
(67 KB at 43.9 KB/sec)
2017-08-18T06:10:51.919 [INFO] Downloading: https://repo.maven.apache.org/maven2/commons-logging/commons-logging/1.1.3/commons-logging-1.1.3.jar
2017-08-18T06:10:51.939 [INFO] Downloaded: https://repo.maven.apache.org/maven2/org/codehaus/jackson/jackson-jaxrs/1.8.3/jackson-jaxrs-1.8.3.jar
(18 KB at 11.4 KB/sec)
2017-08-18T06:10:51.939 [INFO] Downloading: https://repo.maven.apache.org/maven2/commons-configuration/commons-configuration/1.6/commons-configuration-1.6.jar
2017-08-18T06:10:51.940 [INFO] Downloaded: https://repo.maven.apache.org/maven2/org/codehaus/jackson/jackson-xc/1.8.3/jackson-xc-1.8.3.jar
(32 KB at 20.6 KB/sec)
2017-08-18T06:10:51.940 [INFO] Downloading: https://repo.maven.apache.org/maven2/commons-beanutils/commons-beanutils-core/1.8.0/commons-beanutils-core-1.8.0.jar
2017-08-18T06:10:51.947 [INFO] Downloaded: https://repo.maven.apache.org/maven2/commons-logging/commons-logging/1.1.3/commons-logging-1.1.3.jar
(61 KB at 39.4 KB/sec)
2017-08-18T06:10:51.947 [INFO] Downloading: https://repo.maven.apache.org/maven2/com/google/code/gson/gson/2.2.4/gson-2.2.4.jar
2017-08-18T06:10:51.982 [INFO] Downloaded: https://repo.maven.apache.org/maven2/commons-beanutils/commons-beanutils-core/1.8.0/commons-beanutils-core-1.8.0.jar
(202 KB at 128.1 KB/sec)
2017-08-18T06:10:51.982 [INFO] Downloading: https://repo.maven.apache.org/maven2/org/apache/hadoop/hadoop-auth/2.7.3/hadoop-auth-2.7.3.jar
2017-08-18T06:10:51.986 [INFO] Downloaded: https://repo.maven.apache.org/maven2/com/google/code/gson/gson/2.2.4/gson-2.2.4.jar
(186 KB at 118.0 KB/sec)
2017-08-18T06:10:51.986 [INFO] Downloading: https://repo.maven.apache.org/maven2/org/apache/httpcomponents/httpclient/4.2.5/httpclient-4.2.5.jar
2017-08-18T06:10:51.995 [INFO] Downloaded: https://repo.maven.apache.org/maven2/com/sun/xml/bind/jaxb-impl/2.2.3-1/jaxb-impl-2.2.3-1.jar
(870 KB at 548.5 KB/sec)
2017-08-18T06:10:51.995 [INFO] Downloading: https://repo.maven.apache.org/maven2/org/apache/httpcomponents/httpcore/4.2.4/httpcore-4.2.4.jar
2017-08-18T06:10:52.004 [INFO] Downloaded: https://repo.maven.apache.org/maven2/commons-configuration/commons-configuration/1.6/commons-configuration-1.6.jar
(292 KB at 183.1 KB/sec)
2017-08-18T06:10:52.004 [INFO] Downloading: https://repo.maven.apache.org/maven2/org/apache/directory/server/apacheds-kerberos-codec/2.0.0-M15/apacheds-kerberos-codec-2.0.0-M15.jar
2017-08-18T06:10:52.015 [INFO] Downloaded: https://repo.maven.apache.org/maven2/org/apache/hadoop/hadoop-auth/2.7.3/hadoop-auth-2.7.3.jar
(92 KB at 57.3 KB/sec)
2017-08-18T06:10:52.015 [INFO] Downloading: https://repo.maven.apache.org/maven2/org/apache/directory/server/apacheds-i18n/2.0.0-M15/apacheds-i18n-2.0.0-M15.jar
2017-08-18T06:10:52.037 [INFO] Downloaded: https://repo.maven.apache.org/maven2/org/apache/httpcomponents/httpcore/4.2.4/httpcore-4.2.4.jar
(222 KB at 136.4 KB/sec)
2017-08-18T06:10:52.037 [INFO] Downloading: https://repo.maven.apache.org/maven2/org/apache/directory/api/api-asn1-api/1.0.0-M20/api-asn1-api-1.0.0-M20.jar
2017-08-18T06:10:52.043 [INFO] Downloaded: https://repo.maven.apache.org/maven2/org/apache/directory/server/apacheds-i18n/2.0.0-M15/apacheds-i18n-2.0.0-M15.jar
(44 KB at 26.9 KB/sec)
2017-08-18T06:10:52.043 [INFO] Downloading: https://repo.maven.apache.org/maven2/org/apache/directory/api/api-util/1.0.0-M20/api-util-1.0.0-M20.jar
2017-08-18T06:10:52.043 [INFO] Downloaded: https://repo.maven.apache.org/maven2/org/apache/httpcomponents/httpclient/4.2.5/httpclient-4.2.5.jar
(424 KB at 259.2 KB/sec)
2017-08-18T06:10:52.043 [INFO] Downloading: https://repo.maven.apache.org/maven2/com/jcraft/jsch/0.1.42/jsch-0.1.42.jar
2017-08-18T06:10:52.081 [INFO] Downloaded: https://repo.maven.apache.org/maven2/org/apache/directory/api/api-asn1-api/1.0.0-M20/api-asn1-api-1.0.0-M20.jar
(17 KB at 9.7 KB/sec)
2017-08-18T06:10:52.081 [INFO] Downloading: https://repo.maven.apache.org/maven2/org/apache/curator/curator-client/2.7.1/curator-client-2.7.1.jar
2017-08-18T06:10:52.093 [INFO] Downloaded: https://repo.maven.apache.org/maven2/org/apache/directory/api/api-util/1.0.0-M20/api-util-1.0.0-M20.jar
(79 KB at 46.4 KB/sec)
2017-08-18T06:10:52.093 [INFO] Downloading: https://repo.maven.apache.org/maven2/org/apache/htrace/htrace-core/3.1.0-incubating/htrace-core-3.1.0-incubating.jar
2017-08-18T06:10:52.100 [INFO] Downloaded: https://repo.maven.apache.org/maven2/com/jcraft/jsch/0.1.42/jsch-0.1.42.jar
(182 KB at 107.3 KB/sec)
2017-08-18T06:10:52.100 [INFO] Downloading: https://repo.maven.apache.org/maven2/org/apache/hadoop/hadoop-mapreduce-client-core/2.7.3/hadoop-mapreduce-client-core-2.7.3.jar
2017-08-18T06:10:52.111 [INFO] Downloaded: https://repo.maven.apache.org/maven2/org/apache/curator/curator-client/2.7.1/curator-client-2.7.1.jar
(68 KB at 39.9 KB/sec)
2017-08-18T06:10:52.111 [INFO] Downloading: https://repo.maven.apache.org/maven2/org/apache/hadoop/hadoop-yarn-common/2.7.3/hadoop-yarn-common-2.7.3.jar
2017-08-18T06:10:52.118 [INFO] Downloaded: https://repo.maven.apache.org/maven2/org/apache/directory/server/apacheds-kerberos-codec/2.0.0-M15/apacheds-kerberos-codec-2.0.0-M15.jar
(676 KB at 395.4 KB/sec)
2017-08-18T06:10:52.118 [INFO] Downloading: https://repo.maven.apache.org/maven2/javax/xml/bind/jaxb-api/2.2.2/jaxb-api-2.2.2.jar
2017-08-18T06:10:52.158 [INFO] Downloaded: https://repo.maven.apache.org/maven2/javax/xml/bind/jaxb-api/2.2.2/jaxb-api-2.2.2.jar
(103 KB at 58.7 KB/sec)
2017-08-18T06:10:52.158 [INFO] Downloading: https://repo.maven.apache.org/maven2/javax/xml/stream/stax-api/1.0-2/stax-api-1.0-2.jar
2017-08-18T06:10:52.185 [INFO] Downloaded: https://repo.maven.apache.org/maven2/javax/xml/stream/stax-api/1.0-2/stax-api-1.0-2.jar
(23 KB at 12.9 KB/sec)
2017-08-18T06:10:52.185 [INFO] Downloading: https://repo.maven.apache.org/maven2/javax/activation/activation/1.1/activation-1.1.jar
2017-08-18T06:10:52.215 [INFO] Downloaded: https://repo.maven.apache.org/maven2/javax/activation/activation/1.1/activation-1.1.jar
(62 KB at 34.1 KB/sec)
2017-08-18T06:10:52.216 [INFO] Downloading: https://repo.maven.apache.org/maven2/com/sun/jersey/jersey-client/1.9/jersey-client-1.9.jar
2017-08-18T06:10:52.220 [INFO] Downloaded: https://repo.maven.apache.org/maven2/org/apache/htrace/htrace-core/3.1.0-incubating/htrace-core-3.1.0-incubating.jar
(1442 KB at 796.3 KB/sec)
2017-08-18T06:10:52.220 [INFO] Downloading: https://repo.maven.apache.org/maven2/com/google/inject/guice/3.0/guice-3.0.jar
2017-08-18T06:10:52.232 [INFO] Downloaded: https://repo.maven.apache.org/maven2/org/apache/hadoop/hadoop-mapreduce-client-core/2.7.3/hadoop-mapreduce-client-core-2.7.3.jar
(1521 KB at 834.3 KB/sec)
2017-08-18T06:10:52.232 [INFO] Downloading: https://repo.maven.apache.org/maven2/com/sun/jersey/contribs/jersey-guice/1.9/jersey-guice-1.9.jar
2017-08-18T06:10:52.253 [INFO] Downloaded: https://repo.maven.apache.org/maven2/com/sun/jersey/jersey-client/1.9/jersey-client-1.9.jar
(128 KB at 69.2 KB/sec)
2017-08-18T06:10:52.253 [INFO] Downloading: https://repo.maven.apache.org/maven2/com/google/inject/extensions/guice-servlet/3.0/guice-servlet-3.0.jar
2017-08-18T06:10:52.258 [INFO] Downloaded: https://repo.maven.apache.org/maven2/org/scala-lang/scala-compiler/2.10.0/scala-compiler-2.10.0.jar
(13818 KB at 7473.1 KB/sec)
2017-08-18T06:10:52.258 [INFO] Downloading: https://repo.maven.apache.org/maven2/io/netty/netty/3.6.2.Final/netty-3.6.2.Final.jar
2017-08-18T06:10:52.258 [INFO] Downloaded: https://repo.maven.apache.org/maven2/com/sun/jersey/contribs/jersey-guice/1.9/jersey-guice-1.9.jar
(15 KB at 7.8 KB/sec)
2017-08-18T06:10:52.258 [INFO] Downloading: https://repo.maven.apache.org/maven2/org/apache/commons/commons-text/1.1/commons-text-1.1.jar
2017-08-18T06:10:52.279 [INFO] Downloaded: https://repo.maven.apache.org/maven2/org/apache/hadoop/hadoop-yarn-common/2.7.3/hadoop-yarn-common-2.7.3.jar
(1640 KB at 877.1 KB/sec)
2017-08-18T06:10:52.280 [INFO] Downloading: https://repo.maven.apache.org/maven2/org/apache/zookeeper/zookeeper/3.4.6/zookeeper-3.4.6.jar
2017-08-18T06:10:52.282 [INFO] Downloaded: https://repo.maven.apache.org/maven2/com/google/inject/extensions/guice-servlet/3.0/guice-servlet-3.0.jar
(64 KB at 33.9 KB/sec)
2017-08-18T06:10:52.282 [INFO] Downloading: https://repo.maven.apache.org/maven2/jline/jline/0.9.94/jline-0.9.94.jar
2017-08-18T06:10:52.294 [INFO] Downloaded: https://repo.maven.apache.org/maven2/com/google/inject/guice/3.0/guice-3.0.jar
(694 KB at 368.5 KB/sec)
2017-08-18T06:10:52.294 [INFO] Downloading: https://repo.maven.apache.org/maven2/org/scala-lang/scala-library/2.10.5/scala-library-2.10.5.jar
2017-08-18T06:10:52.295 [INFO] Downloaded: https://repo.maven.apache.org/maven2/org/apache/commons/commons-text/1.1/commons-text-1.1.jar
(127 KB at 66.9 KB/sec)
2017-08-18T06:10:52.299 [INFO] Downloading: https://repo.maven.apache.org/maven2/io/dropwizard/metrics/metrics-core/3.1.2/metrics-core-3.1.2.jar
2017-08-18T06:10:52.315 [INFO] Downloaded: https://repo.maven.apache.org/maven2/jline/jline/0.9.94/jline-0.9.94.jar
(86 KB at 44.8 KB/sec)
2017-08-18T06:10:52.316 [INFO] Downloading: https://repo.maven.apache.org/maven2/org/apache/kafka/kafka-clients/0.9.0.1/kafka-clients-0.9.0.1.jar
2017-08-18T06:10:52.332 [INFO] Downloaded: https://repo.maven.apache.org/maven2/io/dropwizard/metrics/metrics-core/3.1.2/metrics-core-3.1.2.jar
(110 KB at 57.2 KB/sec)
2017-08-18T06:10:52.333 [INFO] Downloading: https://repo.maven.apache.org/maven2/org/apache/kafka/kafka_2.10/0.9.0.1/kafka_2.10-0.9.0.1.jar
2017-08-18T06:10:52.366 [INFO] Downloaded: https://repo.maven.apache.org/maven2/io/netty/netty/3.6.2.Final/netty-3.6.2.Final.jar
(1172 KB at 599.2 KB/sec)
2017-08-18T06:10:52.366 [INFO] Downloading: https://repo.maven.apache.org/maven2/com/101tec/zkclient/0.7/zkclient-0.7.jar
2017-08-18T06:10:52.371 [INFO] Downloaded: https://repo.maven.apache.org/maven2/org/apache/zookeeper/zookeeper/3.4.6/zookeeper-3.4.6.jar
(775 KB at 395.1 KB/sec)
2017-08-18T06:10:52.371 [INFO] Downloading: https://repo.maven.apache.org/maven2/com/yammer/metrics/metrics-core/2.2.0/metrics-core-2.2.0.jar
2017-08-18T06:10:52.396 [INFO] Downloaded: https://repo.maven.apache.org/maven2/org/apache/kafka/kafka-clients/0.9.0.1/kafka-clients-0.9.0.1.jar
(627 KB at 315.6 KB/sec)
2017-08-18T06:10:52.396 [INFO] Downloading: https://repo.maven.apache.org/maven2/net/sf/jopt-simple/jopt-simple/3.2/jopt-simple-3.2.jar
2017-08-18T06:10:52.398 [INFO] Downloaded: https://repo.maven.apache.org/maven2/com/101tec/zkclient/0.7/zkclient-0.7.jar
(73 KB at 36.2 KB/sec)
2017-08-18T06:10:52.403 [INFO] Downloaded: https://repo.maven.apache.org/maven2/com/yammer/metrics/metrics-core/2.2.0/metrics-core-2.2.0.jar
(81 KB at 40.3 KB/sec)
2017-08-18T06:10:52.427 [INFO] Downloaded: https://repo.maven.apache.org/maven2/net/sf/jopt-simple/jopt-simple/3.2/jopt-simple-3.2.jar
(52 KB at 25.8 KB/sec)
2017-08-18T06:10:52.699 [INFO] Downloaded: https://repo.maven.apache.org/maven2/org/apache/kafka/kafka_2.10/0.9.0.1/kafka_2.10-0.9.0.1.jar
(4859 KB at 2123.3 KB/sec)
2017-08-18T06:10:52.794 [INFO] Downloaded: https://repo.maven.apache.org/maven2/org/scala-lang/scala-library/2.10.5/scala-library-2.10.5.jar
(6964 KB at 2922.2 KB/sec)
2017-08-18T06:10:52.820 [INFO] Downloading: https://repository.apache.org/content/repositories/releases/org/scala-lang/scala-reflect/2.10.6/scala-reflect-2.10.6.jar
2017-08-18T06:10:52.820 [INFO] Downloading: https://repository.apache.org/content/repositories/releases/org/tachyonproject/tachyon-client/0.8.2/tachyon-client-0.8.2.jar
2017-08-18T06:10:53.024 [INFO] Downloading: https://repository.jboss.org/nexus/content/repositories/releases/org/scala-lang/scala-reflect/2.10.6/scala-reflect-2.10.6.jar
2017-08-18T06:10:53.024 [INFO] Downloading: https://repository.jboss.org/nexus/content/repositories/releases/org/tachyonproject/tachyon-client/0.8.2/tachyon-client-0.8.2.jar
2017-08-18T06:10:53.495 [INFO] Downloading: https://repo.eclipse.org/content/repositories/paho-releases/org/scala-lang/scala-reflect/2.10.6/scala-reflect-2.10.6.jar
2017-08-18T06:10:53.495 [INFO] Downloading: https://repo.eclipse.org/content/repositories/paho-releases/org/tachyonproject/tachyon-client/0.8.2/tachyon-client-0.8.2.jar
2017-08-18T06:10:53.663 [INFO] Downloading: https://repository.cloudera.com/artifactory/cloudera-repos/org/scala-lang/scala-reflect/2.10.6/scala-reflect-2.10.6.jar
2017-08-18T06:10:53.663 [INFO] Downloading: https://repository.cloudera.com/artifactory/cloudera-repos/org/tachyonproject/tachyon-client/0.8.2/tachyon-client-0.8.2.jar
2017-08-18T06:10:53.876 [INFO] Downloading: https://oss.sonatype.org/content/repositories/orgspark-project-1113/org/scala-lang/scala-reflect/2.10.6/scala-reflect-2.10.6.jar
2017-08-18T06:10:53.876 [INFO] Downloading: https://oss.sonatype.org/content/repositories/orgspark-project-1113/org/tachyonproject/tachyon-client/0.8.2/tachyon-client-0.8.2.jar
2017-08-18T06:10:54.048 [INFO] Downloading: http://repository.mapr.com/maven/org/scala-lang/scala-reflect/2.10.6/scala-reflect-2.10.6.jar
2017-08-18T06:10:54.048 [INFO] Downloading: http://repository.mapr.com/maven/org/tachyonproject/tachyon-client/0.8.2/tachyon-client-0.8.2.jar
2017-08-18T06:10:54.146 [INFO] Downloading: http://maven.twttr.com/org/scala-lang/scala-reflect/2.10.6/scala-reflect-2.10.6.jar
2017-08-18T06:10:54.146 [INFO] Downloading: http://maven.twttr.com/org/tachyonproject/tachyon-client/0.8.2/tachyon-client-0.8.2.jar
[JENKINS] Archiving disabled
[JENKINS] Archiving disabled
[JENKINS] Archiving disabled
[JENKINS] Archiving disabled
[JENKINS] Archiving disabled
[JENKINS] Archiving disabled
[JENKINS] Archiving disabled
[JENKINS] Archiving disabled
[JENKINS] Archiving disabled
[JENKINS] Archiving disabled
[JENKINS] Archiving disabled
[JENKINS] Archiving disabled
[JENKINS] Archiving disabled
[JENKINS] Archiving disabled
[JENKINS] Archiving disabled
[JENKINS] Archiving disabled
2017-08-18T06:11:16.236 [INFO] ------------------------------------------------------------------------
2017-08-18T06:11:16.236 [INFO] Reactor Summary:
2017-08-18T06:11:16.236 [INFO] 
2017-08-18T06:11:16.236 [INFO] Apache Beam :: Parent .............................. SUCCESS
[ 22.868 s]
2017-08-18T06:11:16.236 [INFO] Apache Beam :: SDKs :: Java :: Build Tools ......... SUCCESS
[  9.333 s]
2017-08-18T06:11:16.236 [INFO] Apache Beam :: SDKs ................................ SUCCESS
[  2.512 s]
2017-08-18T06:11:16.236 [INFO] Apache Beam :: SDKs :: Common ...................... SUCCESS
[  5.024 s]
2017-08-18T06:11:16.237 [INFO] Apache Beam :: SDKs :: Common :: Runner API ........ SUCCESS
[ 21.980 s]
2017-08-18T06:11:16.237 [INFO] Apache Beam :: SDKs :: Common :: Fn API ............ SUCCESS
[  7.925 s]
2017-08-18T06:11:16.237 [INFO] Apache Beam :: SDKs :: Java ........................ SUCCESS
[  2.039 s]
2017-08-18T06:11:16.237 [INFO] Apache Beam :: SDKs :: Java :: Core ................ SUCCESS
[01:43 min]
2017-08-18T06:11:16.237 [INFO] Apache Beam :: Runners ............................. SUCCESS
[  2.092 s]
2017-08-18T06:11:16.237 [INFO] Apache Beam :: Runners :: Core Construction Java ... SUCCESS
[ 14.325 s]
2017-08-18T06:11:16.237 [INFO] Apache Beam :: Runners :: Core Java ................ SUCCESS
[ 28.410 s]
2017-08-18T06:11:16.237 [INFO] Apache Beam :: Runners :: Direct Java .............. SUCCESS
[04:19 min]
2017-08-18T06:11:16.237 [INFO] Apache Beam :: SDKs :: Java :: IO .................. SUCCESS
[  2.410 s]
2017-08-18T06:11:16.237 [INFO] Apache Beam :: SDKs :: Java :: IO :: Kafka ......... SUCCESS
[ 36.961 s]
2017-08-18T06:11:16.237 [INFO] Apache Beam :: Runners :: Spark .................... FAILURE
[ 10.010 s]
2017-08-18T06:11:16.237 [INFO] ------------------------------------------------------------------------
2017-08-18T06:11:16.237 [INFO] BUILD FAILURE
2017-08-18T06:11:16.237 [INFO] ------------------------------------------------------------------------
2017-08-18T06:11:16.237 [INFO] Total time: 09:55 min
2017-08-18T06:11:16.237 [INFO] Finished at: 2017-08-18T06:11:16+00:00
2017-08-18T06:11:16.736 [INFO] Final Memory: 127M/1576M
2017-08-18T06:11:16.736 [INFO] ------------------------------------------------------------------------
2017-08-18T06:11:16.737 [WARNING] The requested profile "validates-runner-tests" could not
be activated because it does not exist.
2017-08-18T06:11:16.741 [ERROR] Failed to execute goal on project beam-runners-spark: Could
not resolve dependencies for project org.apache.beam:beam-runners-spark:jar:2.2.0-SNAPSHOT:
The following artifacts could not be resolved: org.scala-lang:scala-reflect:jar:2.10.6, org.tachyonproject:tachyon-client:jar:0.8.2:
Could not transfer artifact org.scala-lang:scala-reflect:jar:2.10.6 from/to central (https://repo.maven.apache.org/maven2):
GET request of: org/scala-lang/scala-reflect/2.10.6/scala-reflect-2.10.6.jar from central
failed: Connection reset -> [Help 1]
org.apache.maven.lifecycle.LifecycleExecutionException: Failed to execute goal on project
beam-runners-spark: Could not resolve dependencies for project org.apache.beam:beam-runners-spark:jar:2.2.0-SNAPSHOT:
The following artifacts could not be resolved: org.scala-lang:scala-reflect:jar:2.10.6, org.tachyonproject:tachyon-client:jar:0.8.2:
Could not transfer artifact org.scala-lang:scala-reflect:jar:2.10.6 from/to central (https://repo.maven.apache.org/maven2):
GET request of: org/scala-lang/scala-reflect/2.10.6/scala-reflect-2.10.6.jar from central
failed
	at org.apache.maven.lifecycle.internal.LifecycleDependencyResolver.getDependencies(LifecycleDependencyResolver.java:221)
	at org.apache.maven.lifecycle.internal.LifecycleDependencyResolver.resolveProjectDependencies(LifecycleDependencyResolver.java:127)
	at org.apache.maven.lifecycle.internal.MojoExecutor.ensureDependenciesAreResolved(MojoExecutor.java:257)
	at org.apache.maven.lifecycle.internal.MojoExecutor.execute(MojoExecutor.java:200)
	at org.apache.maven.lifecycle.internal.MojoExecutor.execute(MojoExecutor.java:153)
	at org.apache.maven.lifecycle.internal.MojoExecutor.execute(MojoExecutor.java:145)
	at org.apache.maven.lifecycle.internal.LifecycleModuleBuilder.buildProject(LifecycleModuleBuilder.java:116)
	at org.apache.maven.lifecycle.internal.LifecycleModuleBuilder.buildProject(LifecycleModuleBuilder.java:80)
	at org.apache.maven.lifecycle.internal.builder.singlethreaded.SingleThreadedBuilder.build(SingleThreadedBuilder.java:51)
	at org.apache.maven.lifecycle.internal.LifecycleStarter.execute(LifecycleStarter.java:128)
	at org.apache.maven.DefaultMaven.doExecute(DefaultMaven.java:307)
	at org.apache.maven.DefaultMaven.doExecute(DefaultMaven.java:193)
	at org.apache.maven.DefaultMaven.execute(DefaultMaven.java:106)
	at org.jvnet.hudson.maven3.launcher.Maven33Launcher.main(Maven33Launcher.java:129)
	at sun.reflect.NativeMethodAccessorImpl.invoke0(Native Method)
	at sun.reflect.NativeMethodAccessorImpl.invoke(NativeMethodAccessorImpl.java:62)
	at sun.reflect.DelegatingMethodAccessorImpl.invoke(DelegatingMethodAccessorImpl.java:43)
	at java.lang.reflect.Method.invoke(Method.java:498)
	at org.codehaus.plexus.classworlds.launcher.Launcher.launchStandard(Launcher.java:330)
	at org.codehaus.plexus.classworlds.launcher.Launcher.launch(Launcher.java:238)
	at jenkins.maven3.agent.Maven33Main.launch(Maven33Main.java:176)
	at sun.reflect.NativeMethodAccessorImpl.invoke0(Native Method)
	at sun.reflect.NativeMethodAccessorImpl.invoke(NativeMethodAccessorImpl.java:62)
	at sun.reflect.DelegatingMethodAccessorImpl.invoke(DelegatingMethodAccessorImpl.java:43)
	at java.lang.reflect.Method.invoke(Method.java:498)
	at hudson.maven.Maven3Builder.call(Maven3Builder.java:139)
	at hudson.maven.Maven3Builder.call(Maven3Builder.java:70)
	at hudson.remoting.UserRequest.perform(UserRequest.java:153)
	at hudson.remoting.UserRequest.perform(UserRequest.java:50)
	at hudson.remoting.Request$2.run(Request.java:336)
	at hudson.remoting.InterceptingExecutorService$1.call(InterceptingExecutorService.java:68)
	at java.util.concurrent.FutureTask.run(FutureTask.java:266)
	at java.util.concurrent.ThreadPoolExecutor.runWorker(ThreadPoolExecutor.java:1149)
	at java.util.concurrent.ThreadPoolExecutor$Worker.run(ThreadPoolExecutor.java:624)
	at java.lang.Thread.run(Thread.java:748)
Caused by: org.apache.maven.project.DependencyResolutionException: Could not resolve dependencies
for project org.apache.beam:beam-runners-spark:jar:2.2.0-SNAPSHOT: The following artifacts
could not be resolved: org.scala-lang:scala-reflect:jar:2.10.6, org.tachyonproject:tachyon-client:jar:0.8.2:
Could not transfer artifact org.scala-lang:scala-reflect:jar:2.10.6 from/to central (https://repo.maven.apache.org/maven2):
GET request of: org/scala-lang/scala-reflect/2.10.6/scala-reflect-2.10.6.jar from central
failed
	at org.apache.maven.project.DefaultProjectDependenciesResolver.resolve(DefaultProjectDependenciesResolver.java:211)
	at org.apache.maven.lifecycle.internal.LifecycleDependencyResolver.getDependencies(LifecycleDependencyResolver.java:195)
	... 34 more
Caused by: org.eclipse.aether.resolution.DependencyResolutionException: The following artifacts
could not be resolved: org.scala-lang:scala-reflect:jar:2.10.6, org.tachyonproject:tachyon-client:jar:0.8.2:
Could not transfer artifact org.scala-lang:scala-reflect:jar:2.10.6 from/to central (https://repo.maven.apache.org/maven2):
GET request of: org/scala-lang/scala-reflect/2.10.6/scala-reflect-2.10.6.jar from central
failed
	at org.eclipse.aether.internal.impl.DefaultRepositorySystem.resolveDependencies(DefaultRepositorySystem.java:384)
	at org.apache.maven.project.DefaultProjectDependenciesResolver.resolve(DefaultProjectDependenciesResolver.java:205)
	... 35 more
Caused by: org.eclipse.aether.resolution.ArtifactResolutionException: The following artifacts
could not be resolved: org.scala-lang:scala-reflect:jar:2.10.6, org.tachyonproject:tachyon-client:jar:0.8.2:
Could not transfer artifact org.scala-lang:scala-reflect:jar:2.10.6 from/to central (https://repo.maven.apache.org/maven2):
GET request of: org/scala-lang/scala-reflect/2.10.6/scala-reflect-2.10.6.jar from central
failed
	at org.eclipse.aether.internal.impl.DefaultArtifactResolver.resolve(DefaultArtifactResolver.java:444)
	at org.eclipse.aether.internal.impl.DefaultArtifactResolver.resolveArtifacts(DefaultArtifactResolver.java:246)
	at org.eclipse.aether.internal.impl.DefaultRepositorySystem.resolveDependencies(DefaultRepositorySystem.java:367)
	... 36 more
Caused by: org.eclipse.aether.transfer.ArtifactTransferException: Could not transfer artifact
org.scala-lang:scala-reflect:jar:2.10.6 from/to central (https://repo.maven.apache.org/maven2):
GET request of: org/scala-lang/scala-reflect/2.10.6/scala-reflect-2.10.6.jar from central
failed
	at org.eclipse.aether.connector.basic.ArtifactTransportListener.transferFailed(ArtifactTransportListener.java:43)
	at org.eclipse.aether.connector.basic.BasicRepositoryConnector$TaskRunner.run(BasicRepositoryConnector.java:355)
	at org.eclipse.aether.util.concurrency.RunnableErrorForwarder$1.run(RunnableErrorForwarder.java:67)
	... 3 more
Caused by: org.apache.maven.wagon.TransferFailedException: GET request of: org/scala-lang/scala-reflect/2.10.6/scala-reflect-2.10.6.jar
from central failed
	at org.apache.maven.wagon.AbstractWagon.getTransfer(AbstractWagon.java:363)
	at org.apache.maven.wagon.AbstractWagon.getTransfer(AbstractWagon.java:316)
	at org.apache.maven.wagon.AbstractWagon.getTransfer(AbstractWagon.java:285)
	at org.apache.maven.wagon.StreamWagon.getIfNewer(StreamWagon.java:97)
	at org.apache.maven.wagon.StreamWagon.get(StreamWagon.java:61)
	at org.eclipse.aether.transport.wagon.WagonTransporter$GetTaskRunner.run(WagonTransporter.java:560)
	at org.eclipse.aether.transport.wagon.WagonTransporter.execute(WagonTransporter.java:427)
	at org.eclipse.aether.transport.wagon.WagonTransporter.get(WagonTransporter.java:404)
	at org.eclipse.aether.connector.basic.BasicRepositoryConnector$GetTaskRunner.runTask(BasicRepositoryConnector.java:447)
	at org.eclipse.aether.connector.basic.BasicRepositoryConnector$TaskRunner.run(BasicRepositoryConnector.java:350)
	... 4 more
Caused by: java.net.SocketException: Connection reset
	at java.net.SocketInputStream.read(SocketInputStream.java:210)
	at java.net.SocketInputStream.read(SocketInputStream.java:141)
	at sun.security.ssl.InputRecord.readFully(InputRecord.java:465)
	at sun.security.ssl.InputRecord.readV3Record(InputRecord.java:593)
	at sun.security.ssl.InputRecord.read(InputRecord.java:532)
	at sun.security.ssl.SSLSocketImpl.readRecord(SSLSocketImpl.java:983)
	at sun.security.ssl.SSLSocketImpl.readDataRecord(SSLSocketImpl.java:940)
	at sun.security.ssl.AppInputStream.read(AppInputStream.java:105)
	at org.apache.maven.wagon.providers.http.httpclient.impl.io.SessionInputBufferImpl.streamRead(SessionInputBufferImpl.java:136)
	at org.apache.maven.wagon.providers.http.httpclient.impl.io.SessionInputBufferImpl.read(SessionInputBufferImpl.java:195)
	at org.apache.maven.wagon.providers.http.httpclient.impl.io.ContentLengthInputStream.read(ContentLengthInputStream.java:178)
	at org.apache.maven.wagon.providers.http.httpclient.conn.EofSensorInputStream.read(EofSensorInputStream.java:137)
	at org.apache.maven.wagon.AbstractWagon.transfer(AbstractWagon.java:531)
	at org.apache.maven.wagon.AbstractWagon.getTransfer(AbstractWagon.java:353)
	... 13 more
2017-08-18T06:11:16.743 [ERROR] 
2017-08-18T06:11:16.743 [ERROR] Re-run Maven using the -X switch to enable full debug logging.
2017-08-18T06:11:16.743 [ERROR] 
2017-08-18T06:11:16.743 [ERROR] For more information about the errors and possible solutions,
please read the following articles:
2017-08-18T06:11:16.743 [ERROR] [Help 1] http://cwiki.apache.org/confluence/display/MAVEN/DependencyResolutionException
2017-08-18T06:11:16.743 [ERROR] 
2017-08-18T06:11:16.743 [ERROR] After correcting the problems, you can resume the build with
the command
2017-08-18T06:11:16.743 [ERROR]   mvn <goals> -rf :beam-runners-spark
channel stopped
Not sending mail to unregistered user kirpichov@google.com
Not sending mail to unregistered user echauchot@gmail.com+jbonofre@apache.org
Not sending mail to unregistered user relax@relax-macbookpro.roam.corp.google.com

Mime
View raw message