beam-commits mailing list archives

Site index · List index
Message view « Date » · « Thread »
Top « Date » · « Thread »
From Apache Jenkins Server <jenk...@builds.apache.org>
Subject Build failed in Jenkins: beam_PostCommit_Java_MavenInstall #4723
Date Tue, 05 Sep 2017 18:31:54 GMT
See <https://builds.apache.org/job/beam_PostCommit_Java_MavenInstall/4723/display/redirect>

------------------------------------------
[...truncated 1.12 MB...]
2017-09-05T18:31:06.164 [INFO] Downloading: https://repo.maven.apache.org/maven2/com/github/ben-manes/caffeine/caffeine/2.2.6/caffeine-2.2.6.jar
2017-09-05T18:31:06.263 [INFO] Downloaded: https://repo.maven.apache.org/maven2/io/netty/netty-all/4.0.39.Final/netty-all-4.0.39.Final.jar
(2219 KB at 366.4 KB/sec)
2017-09-05T18:31:06.263 [INFO] Downloading: https://repo.maven.apache.org/maven2/com/datastax/cassandra/cassandra-driver-core/3.1.1/cassandra-driver-core-3.1.1.jar
2017-09-05T18:31:06.387 [INFO] Downloaded: https://repo.maven.apache.org/maven2/org/eclipse/jdt/core/compiler/ecj/4.4.2/ecj-4.4.2.jar
(2257 KB at 365.2 KB/sec)
2017-09-05T18:31:06.405 [INFO] Downloaded: https://repo.maven.apache.org/maven2/com/github/ben-manes/caffeine/caffeine/2.2.6/caffeine-2.2.6.jar
(926 KB at 149.4 KB/sec)
2017-09-05T18:31:06.458 [INFO] Downloaded: https://repo.maven.apache.org/maven2/com/datastax/cassandra/cassandra-driver-core/3.1.1/cassandra-driver-core-3.1.1.jar
(1029 KB at 164.5 KB/sec)
2017-09-05T18:31:07.644 [INFO] Downloaded: https://repo.maven.apache.org/maven2/it/unimi/dsi/fastutil/6.5.7/fastutil-6.5.7.jar
(16508 KB at 2220.2 KB/sec)
2017-09-05T18:31:07.673 [INFO] Downloaded: https://repo.maven.apache.org/maven2/org/apache/storm/storm-core/1.0.1/storm-core-1.0.1.jar
(19650 KB at 2632.2 KB/sec)
2017-09-05T18:31:07.720 [INFO] Downloading: http://conjars.org/repo/org/pentaho/pentaho-aggdesigner-algorithm/5.1.5-jhyde/pentaho-aggdesigner-algorithm-5.1.5-jhyde.jar
2017-09-05T18:31:07.720 [INFO] Downloading: http://conjars.org/repo/org/scala-lang/scala-library/2.10.5/scala-library-2.10.5.jar
2017-09-05T18:31:07.720 [INFO] Downloading: http://conjars.org/repo/cascading/cascading-hadoop/2.6.3/cascading-hadoop-2.6.3.jar
2017-09-05T18:31:07.721 [INFO] Downloading: http://conjars.org/repo/riffle/riffle/0.1-dev/riffle-0.1-dev.jar
2017-09-05T18:31:07.721 [INFO] Downloading: http://conjars.org/repo/cascading/cascading-core/2.6.3/cascading-core-2.6.3.jar
2017-09-05T18:31:07.777 [INFO] Downloading: http://conjars.org/repo/thirdparty/jgrapht-jdk1.6/0.8.1/jgrapht-jdk1.6-0.8.1.jar
2017-09-05T18:31:07.835 [INFO] Downloaded: http://conjars.org/repo/riffle/riffle/0.1-dev/riffle-0.1-dev.jar
(12 KB at 96.4 KB/sec)
2017-09-05T18:31:07.835 [INFO] Downloading: http://conjars.org/repo/cascading/cascading-local/2.6.3/cascading-local-2.6.3.jar
2017-09-05T18:31:07.890 [INFO] Downloaded: http://conjars.org/repo/org/pentaho/pentaho-aggdesigner-algorithm/5.1.5-jhyde/pentaho-aggdesigner-algorithm-5.1.5-jhyde.jar
(48 KB at 278.9 KB/sec)
2017-09-05T18:31:08.006 [INFO] Downloaded: http://conjars.org/repo/cascading/cascading-local/2.6.3/cascading-local-2.6.3.jar
(43 KB at 148.5 KB/sec)
2017-09-05T18:31:08.107 [INFO] Downloaded: http://conjars.org/repo/cascading/cascading-hadoop/2.6.3/cascading-hadoop-2.6.3.jar
(246 KB at 635.4 KB/sec)
2017-09-05T18:31:08.173 [INFO] Downloaded: http://conjars.org/repo/thirdparty/jgrapht-jdk1.6/0.8.1/jgrapht-jdk1.6-0.8.1.jar
(230 KB at 507.2 KB/sec)
2017-09-05T18:31:08.366 [INFO] Downloaded: http://conjars.org/repo/cascading/cascading-core/2.6.3/cascading-core-2.6.3.jar
(680 KB at 1051.8 KB/sec)
2017-09-05T18:31:08.368 [INFO] Downloading: http://clojars.org/repo/org/scala-lang/scala-library/2.10.5/scala-library-2.10.5.jar
2017-09-05T18:31:08.437 [INFO] Downloading: https://repository.apache.org/content/repositories/releases/org/scala-lang/scala-library/2.10.5/scala-library-2.10.5.jar
2017-09-05T18:31:08.643 [INFO] Downloading: https://repository.jboss.org/nexus/content/repositories/releases/org/scala-lang/scala-library/2.10.5/scala-library-2.10.5.jar
2017-09-05T18:31:08.998 [INFO] Downloading: https://repo.eclipse.org/content/repositories/paho-releases/org/scala-lang/scala-library/2.10.5/scala-library-2.10.5.jar
2017-09-05T18:31:09.229 [INFO] Downloading: https://repository.cloudera.com/artifactory/cloudera-repos/org/scala-lang/scala-library/2.10.5/scala-library-2.10.5.jar
2017-09-05T18:31:09.379 [INFO] Downloading: https://oss.sonatype.org/content/repositories/orgspark-project-1113/org/scala-lang/scala-library/2.10.5/scala-library-2.10.5.jar
2017-09-05T18:31:09.531 [INFO] Downloading: http://repository.mapr.com/maven/org/scala-lang/scala-library/2.10.5/scala-library-2.10.5.jar
2017-09-05T18:31:09.616 [INFO] Downloading: http://maven.twttr.com/org/scala-lang/scala-library/2.10.5/scala-library-2.10.5.jar
[JENKINS] Archiving disabled
2017-09-05T18:31:10.561 [INFO]                                                           
             
2017-09-05T18:31:10.561 [INFO] ------------------------------------------------------------------------
2017-09-05T18:31:10.561 [INFO] Skipping Apache Beam :: Parent
2017-09-05T18:31:10.561 [INFO] This project has been banned from the build due to previous
failures.
2017-09-05T18:31:10.561 [INFO] ------------------------------------------------------------------------
[JENKINS] Archiving disabled
[JENKINS] Archiving disabled
[JENKINS] Archiving disabled
[JENKINS] Archiving disabled
[JENKINS] Archiving disabled
[JENKINS] Archiving disabled
[JENKINS] Archiving disabled
[JENKINS] Archiving disabled
[JENKINS] Archiving disabled
[JENKINS] Archiving disabled
[JENKINS] Archiving disabled
[JENKINS] Archiving disabled
[JENKINS] Archiving disabled
[JENKINS] Archiving disabled
[JENKINS] Archiving disabled
[JENKINS] Archiving disabled
[JENKINS] Archiving disabled
[JENKINS] Archiving disabled
[JENKINS] Archiving disabled
[JENKINS] Archiving disabled
[JENKINS] Archiving disabled
[JENKINS] Archiving disabled
[JENKINS] Archiving disabled
[JENKINS] Archiving disabled
[JENKINS] Archiving disabled
[JENKINS] Archiving disabled
[JENKINS] Archiving disabled
[JENKINS] Archiving disabled
[JENKINS] Archiving disabled
[JENKINS] Archiving disabled
[JENKINS] Archiving disabled
[JENKINS] Archiving disabled
[JENKINS] Archiving disabled
[JENKINS] Archiving disabled
[JENKINS] Archiving disabled
[JENKINS] Archiving disabled
[JENKINS] Archiving disabled
[JENKINS] Archiving disabled
[JENKINS] Archiving disabled
[JENKINS] Archiving disabled
[JENKINS] Archiving disabled
[JENKINS] Archiving disabled
[JENKINS] Archiving disabled
[JENKINS] Archiving disabled
[JENKINS] Archiving disabled
[JENKINS] Archiving disabled
[JENKINS] Archiving disabled
[JENKINS] Archiving disabled
[JENKINS] Archiving disabled
[JENKINS] Archiving disabled
[JENKINS] Archiving disabled
[JENKINS] Archiving disabled
[JENKINS] Archiving disabled
[JENKINS] Archiving disabled
[JENKINS] Archiving disabled
[JENKINS] Archiving disabled2017-09-05T18:31:43.241 [INFO] ------------------------------------------------------------------------
2017-09-05T18:31:43.241 [INFO] Reactor Summary:
2017-09-05T18:31:43.241 [INFO] 
2017-09-05T18:31:43.241 [INFO] Apache Beam :: Parent .............................. SUCCESS
[ 29.223 s]
2017-09-05T18:31:43.241 [INFO] Apache Beam :: SDKs :: Java :: Build Tools ......... SUCCESS
[ 22.712 s]
2017-09-05T18:31:43.241 [INFO] Apache Beam :: SDKs ................................ SUCCESS
[  5.773 s]
2017-09-05T18:31:43.241 [INFO] Apache Beam :: SDKs :: Common ...................... SUCCESS
[  3.135 s]
2017-09-05T18:31:43.241 [INFO] Apache Beam :: SDKs :: Common :: Runner API ........ SUCCESS
[ 30.067 s]
2017-09-05T18:31:43.241 [INFO] Apache Beam :: SDKs :: Common :: Fn API ............ SUCCESS
[ 21.673 s]
2017-09-05T18:31:43.241 [INFO] Apache Beam :: SDKs :: Java ........................ SUCCESS
[  3.247 s]
2017-09-05T18:31:43.241 [INFO] Apache Beam :: SDKs :: Java :: Core ................ SUCCESS
[02:41 min]
2017-09-05T18:31:43.241 [INFO] Apache Beam :: Runners ............................. SUCCESS
[  3.524 s]
2017-09-05T18:31:43.241 [INFO] Apache Beam :: Runners :: Core Construction Java ... SUCCESS
[ 39.606 s]
2017-09-05T18:31:43.241 [INFO] Apache Beam :: Runners :: Core Java ................ SUCCESS
[ 59.468 s]
2017-09-05T18:31:43.241 [INFO] Apache Beam :: Runners :: Direct Java .............. SUCCESS
[05:27 min]
2017-09-05T18:31:43.241 [INFO] Apache Beam :: SDKs :: Java :: IO .................. SUCCESS
[  3.108 s]
2017-09-05T18:31:43.241 [INFO] Apache Beam :: SDKs :: Java :: IO :: AMQP .......... SUCCESS
[ 34.721 s]
2017-09-05T18:31:43.241 [INFO] Apache Beam :: SDKs :: Java :: IO :: Common ........ SUCCESS
[  8.449 s]
2017-09-05T18:31:43.241 [INFO] Apache Beam :: SDKs :: Java :: IO :: Cassandra ..... SUCCESS
[ 38.399 s]
2017-09-05T18:31:43.241 [INFO] Apache Beam :: SDKs :: Java :: IO :: Elasticsearch . SUCCESS
[ 43.571 s]
2017-09-05T18:31:43.241 [INFO] Apache Beam :: SDKs :: Java :: Extensions .......... SUCCESS
[  3.251 s]
2017-09-05T18:31:43.241 [INFO] Apache Beam :: SDKs :: Java :: Extensions :: Google Cloud Platform
Core SUCCESS [ 32.339 s]
2017-09-05T18:31:43.241 [INFO] Apache Beam :: SDKs :: Java :: Extensions :: Protobuf SUCCESS
[ 23.673 s]
2017-09-05T18:31:43.241 [INFO] Apache Beam :: SDKs :: Java :: IO :: Google Cloud Platform
SUCCESS [01:54 min]
2017-09-05T18:31:43.241 [INFO] Apache Beam :: SDKs :: Java :: IO :: Hadoop Common . SUCCESS
[ 25.853 s]
2017-09-05T18:31:43.241 [INFO] Apache Beam :: SDKs :: Java :: IO :: Hadoop File System SUCCESS
[ 48.514 s]
2017-09-05T18:31:43.241 [INFO] Apache Beam :: SDKs :: Java :: IO :: Hadoop ........ SUCCESS
[  5.946 s]
2017-09-05T18:31:43.241 [INFO] Apache Beam :: SDKs :: Java :: IO :: Hadoop :: input-format
SUCCESS [ 36.042 s]
2017-09-05T18:31:43.241 [INFO] Apache Beam :: Runners :: Google Cloud Dataflow .... SUCCESS
[09:09 min]
2017-09-05T18:31:43.242 [INFO] Apache Beam :: SDKs :: Java :: IO :: Hadoop :: jdk1.8-tests
FAILURE [ 21.326 s]
2017-09-05T18:31:43.242 [INFO] Apache Beam :: SDKs :: Java :: IO :: HBase ......... SKIPPED
2017-09-05T18:31:43.242 [INFO] Apache Beam :: SDKs :: Java :: IO :: HCatalog ...... SKIPPED
2017-09-05T18:31:43.242 [INFO] Apache Beam :: SDKs :: Java :: IO :: JDBC .......... SKIPPED
2017-09-05T18:31:43.242 [INFO] Apache Beam :: SDKs :: Java :: IO :: JMS ........... SKIPPED
2017-09-05T18:31:43.242 [INFO] Apache Beam :: SDKs :: Java :: IO :: Kafka ......... SKIPPED
2017-09-05T18:31:43.242 [INFO] Apache Beam :: SDKs :: Java :: IO :: Kinesis ....... SKIPPED
2017-09-05T18:31:43.242 [INFO] Apache Beam :: SDKs :: Java :: IO :: MongoDB ....... SKIPPED
2017-09-05T18:31:43.242 [INFO] Apache Beam :: SDKs :: Java :: IO :: MQTT .......... SKIPPED
2017-09-05T18:31:43.242 [INFO] Apache Beam :: SDKs :: Java :: IO :: Solr .......... SKIPPED
2017-09-05T18:31:43.242 [INFO] Apache Beam :: SDKs :: Java :: IO :: XML ........... SKIPPED
2017-09-05T18:31:43.242 [INFO] Apache Beam :: SDKs :: Java :: Maven Archetypes .... SKIPPED
2017-09-05T18:31:43.242 [INFO] Apache Beam :: SDKs :: Java :: Maven Archetypes :: Starter
SKIPPED
2017-09-05T18:31:43.242 [INFO] Apache Beam :: Examples ............................ SKIPPED
2017-09-05T18:31:43.242 [INFO] Apache Beam :: Examples :: Java .................... SKIPPED
2017-09-05T18:31:43.242 [INFO] Apache Beam :: SDKs :: Java :: Maven Archetypes :: Examples
SKIPPED
2017-09-05T18:31:43.242 [INFO] Apache Beam :: Examples :: Java 8 .................. SKIPPED
2017-09-05T18:31:43.242 [INFO] Apache Beam :: SDKs :: Java :: Maven Archetypes :: Examples
- Java 8 SKIPPED
2017-09-05T18:31:43.242 [INFO] Apache Beam :: SDKs :: Java :: Extensions :: Jackson SKIPPED
2017-09-05T18:31:43.242 [INFO] Apache Beam :: SDKs :: Java :: Extensions :: Join library SKIPPED
2017-09-05T18:31:43.242 [INFO] Apache Beam :: SDKs :: Java :: Extensions :: Sorter  SKIPPED
2017-09-05T18:31:43.242 [INFO] Apache Beam :: SDKs :: Java :: Nexmark ............. SKIPPED
2017-09-05T18:31:43.242 [INFO] Apache Beam :: SDKs :: Java :: Harness ............. SKIPPED
2017-09-05T18:31:43.242 [INFO] Apache Beam :: SDKs :: Java :: Java 8 Tests ........ SKIPPED
2017-09-05T18:31:43.242 [INFO] Apache Beam :: SDKs :: Python ...................... SKIPPED
2017-09-05T18:31:43.242 [INFO] Apache Beam :: Runners :: Flink .................... SKIPPED
2017-09-05T18:31:43.242 [INFO] Apache Beam :: Runners :: Spark .................... SKIPPED
2017-09-05T18:31:43.242 [INFO] Apache Beam :: Runners :: Apex ..................... SKIPPED
2017-09-05T18:31:43.242 [INFO] Apache Beam :: Runners :: Gearpump ................. SKIPPED
2017-09-05T18:31:43.242 [INFO] Apache Beam :: SDKs :: Java :: Aggregated Javadoc .. SKIPPED
2017-09-05T18:31:43.242 [INFO] ------------------------------------------------------------------------
2017-09-05T18:31:43.242 [INFO] BUILD FAILURE
2017-09-05T18:31:43.242 [INFO] ------------------------------------------------------------------------
2017-09-05T18:31:43.242 [INFO] Total time: 29:45 min
2017-09-05T18:31:43.242 [INFO] Finished at: 2017-09-05T18:31:43+00:00

2017-09-05T18:31:43.978 [INFO] Final Memory: 193M/1413M
2017-09-05T18:31:43.978 [INFO] ------------------------------------------------------------------------
2017-09-05T18:31:43.988 [ERROR] Failed to execute goal on project beam-sdks-java-io-hadoop-jdk1.8-tests:
Could not resolve dependencies for project org.apache.beam:beam-sdks-java-io-hadoop-jdk1.8-tests:jar:2.2.0-SNAPSHOT:
Could not transfer artifact org.scala-lang:scala-library:jar:2.10.5 from/to central (https://repo.maven.apache.org/maven2):
GET request of: org/scala-lang/scala-library/2.10.5/scala-library-2.10.5.jar from central
failed: Connection reset -> [Help 1]
org.apache.maven.lifecycle.LifecycleExecutionException: Failed to execute goal on project
beam-sdks-java-io-hadoop-jdk1.8-tests: Could not resolve dependencies for project org.apache.beam:beam-sdks-java-io-hadoop-jdk1.8-tests:jar:2.2.0-SNAPSHOT:
Could not transfer artifact org.scala-lang:scala-library:jar:2.10.5 from/to central (https://repo.maven.apache.org/maven2):
GET request of: org/scala-lang/scala-library/2.10.5/scala-library-2.10.5.jar from central
failed
	at org.apache.maven.lifecycle.internal.LifecycleDependencyResolver.getDependencies(LifecycleDependencyResolver.java:221)
	at org.apache.maven.lifecycle.internal.LifecycleDependencyResolver.resolveProjectDependencies(LifecycleDependencyResolver.java:127)
	at org.apache.maven.lifecycle.internal.MojoExecutor.ensureDependenciesAreResolved(MojoExecutor.java:257)
	at org.apache.maven.lifecycle.internal.MojoExecutor.execute(MojoExecutor.java:200)
	at org.apache.maven.lifecycle.internal.MojoExecutor.execute(MojoExecutor.java:153)
	at org.apache.maven.lifecycle.internal.MojoExecutor.execute(MojoExecutor.java:145)
	at org.apache.maven.lifecycle.internal.LifecycleModuleBuilder.buildProject(LifecycleModuleBuilder.java:116)
	at org.apache.maven.lifecycle.internal.LifecycleModuleBuilder.buildProject(LifecycleModuleBuilder.java:80)
	at org.apache.maven.lifecycle.internal.builder.singlethreaded.SingleThreadedBuilder.build(SingleThreadedBuilder.java:51)
	at org.apache.maven.lifecycle.internal.LifecycleStarter.execute(LifecycleStarter.java:128)
	at org.apache.maven.DefaultMaven.doExecute(DefaultMaven.java:307)
	at org.apache.maven.DefaultMaven.doExecute(DefaultMaven.java:193)
	at org.apache.maven.DefaultMaven.execute(DefaultMaven.java:106)
	at org.jvnet.hudson.maven3.launcher.Maven33Launcher.main(Maven33Launcher.java:129)
	at sun.reflect.NativeMethodAccessorImpl.invoke0(Native Method)
	at sun.reflect.NativeMethodAccessorImpl.invoke(NativeMethodAccessorImpl.java:62)
	at sun.reflect.DelegatingMethodAccessorImpl.invoke(DelegatingMethodAccessorImpl.java:43)
	at java.lang.reflect.Method.invoke(Method.java:498)
	at org.codehaus.plexus.classworlds.launcher.Launcher.launchStandard(Launcher.java:330)
	at org.codehaus.plexus.classworlds.launcher.Launcher.launch(Launcher.java:238)
	at jenkins.maven3.agent.Maven33Main.launch(Maven33Main.java:176)
	at sun.reflect.NativeMethodAccessorImpl.invoke0(Native Method)
	at sun.reflect.NativeMethodAccessorImpl.invoke(NativeMethodAccessorImpl.java:62)
	at sun.reflect.DelegatingMethodAccessorImpl.invoke(DelegatingMethodAccessorImpl.java:43)
	at java.lang.reflect.Method.invoke(Method.java:498)
	at hudson.maven.Maven3Builder.call(Maven3Builder.java:139)
	at hudson.maven.Maven3Builder.call(Maven3Builder.java:70)
	at hudson.remoting.UserRequest.perform(UserRequest.java:153)
	at hudson.remoting.UserRequest.perform(UserRequest.java:50)
	at hudson.remoting.Request$2.run(Request.java:336)
	at hudson.remoting.InterceptingExecutorService$1.call(InterceptingExecutorService.java:68)
	at java.util.concurrent.FutureTask.run(FutureTask.java:266)
	at java.util.concurrent.ThreadPoolExecutor.runWorker(ThreadPoolExecutor.java:1149)
	at java.util.concurrent.ThreadPoolExecutor$Worker.run(ThreadPoolExecutor.java:624)
	at java.lang.Thread.run(Thread.java:748)
Caused by: org.apache.maven.project.DependencyResolutionException: Could not resolve dependencies
for project org.apache.beam:beam-sdks-java-io-hadoop-jdk1.8-tests:jar:2.2.0-SNAPSHOT: Could
not transfer artifact org.scala-lang:scala-library:jar:2.10.5 from/to central (https://repo.maven.apache.org/maven2):
GET request of: org/scala-lang/scala-library/2.10.5/scala-library-2.10.5.jar from central
failed
	at org.apache.maven.project.DefaultProjectDependenciesResolver.resolve(DefaultProjectDependenciesResolver.java:211)
	at org.apache.maven.lifecycle.internal.LifecycleDependencyResolver.getDependencies(LifecycleDependencyResolver.java:195)
	... 34 more
Caused by: org.eclipse.aether.resolution.DependencyResolutionException: Could not transfer
artifact org.scala-lang:scala-library:jar:2.10.5 from/to central (https://repo.maven.apache.org/maven2):
GET request of: org/scala-lang/scala-library/2.10.5/scala-library-2.10.5.jar from central
failed
	at org.eclipse.aether.internal.impl.DefaultRepositorySystem.resolveDependencies(DefaultRepositorySystem.java:384)
	at org.apache.maven.project.DefaultProjectDependenciesResolver.resolve(DefaultProjectDependenciesResolver.java:205)
	... 35 more
Caused by: org.eclipse.aether.resolution.ArtifactResolutionException: Could not transfer artifact
org.scala-lang:scala-library:jar:2.10.5 from/to central (https://repo.maven.apache.org/maven2):
GET request of: org/scala-lang/scala-library/2.10.5/scala-library-2.10.5.jar from central
failed
	at org.eclipse.aether.internal.impl.DefaultArtifactResolver.resolve(DefaultArtifactResolver.java:444)
	at org.eclipse.aether.internal.impl.DefaultArtifactResolver.resolveArtifacts(DefaultArtifactResolver.java:246)
	at org.eclipse.aether.internal.impl.DefaultRepositorySystem.resolveDependencies(DefaultRepositorySystem.java:367)
	... 36 more
Caused by: org.eclipse.aether.transfer.ArtifactTransferException: Could not transfer artifact
org.scala-lang:scala-library:jar:2.10.5 from/to central (https://repo.maven.apache.org/maven2):
GET request of: org/scala-lang/scala-library/2.10.5/scala-library-2.10.5.jar from central
failed
	at org.eclipse.aether.connector.basic.ArtifactTransportListener.transferFailed(ArtifactTransportListener.java:43)
	at org.eclipse.aether.connector.basic.BasicRepositoryConnector$TaskRunner.run(BasicRepositoryConnector.java:355)
	at org.eclipse.aether.util.concurrency.RunnableErrorForwarder$1.run(RunnableErrorForwarder.java:67)
	... 3 more
Caused by: org.apache.maven.wagon.TransferFailedException: GET request of: org/scala-lang/scala-library/2.10.5/scala-library-2.10.5.jar
from central failed
	at org.apache.maven.wagon.AbstractWagon.getTransfer(AbstractWagon.java:363)
	at org.apache.maven.wagon.AbstractWagon.getTransfer(AbstractWagon.java:316)
	at org.apache.maven.wagon.AbstractWagon.getTransfer(AbstractWagon.java:285)
	at org.apache.maven.wagon.StreamWagon.getIfNewer(StreamWagon.java:97)
	at org.apache.maven.wagon.StreamWagon.get(StreamWagon.java:61)
	at org.eclipse.aether.transport.wagon.WagonTransporter$GetTaskRunner.run(WagonTransporter.java:560)
	at org.eclipse.aether.transport.wagon.WagonTransporter.execute(WagonTransporter.java:427)
	at org.eclipse.aether.transport.wagon.WagonTransporter.get(WagonTransporter.java:404)
	at org.eclipse.aether.connector.basic.BasicRepositoryConnector$GetTaskRunner.runTask(BasicRepositoryConnector.java:447)
	at org.eclipse.aether.connector.basic.BasicRepositoryConnector$TaskRunner.run(BasicRepositoryConnector.java:350)
	... 4 more
Caused by: java.net.SocketException: Connection reset
	at java.net.SocketInputStream.read(SocketInputStream.java:210)
	at java.net.SocketInputStream.read(SocketInputStream.java:141)
	at sun.security.ssl.InputRecord.readFully(InputRecord.java:465)
	at sun.security.ssl.InputRecord.readV3Record(InputRecord.java:593)
	at sun.security.ssl.InputRecord.read(InputRecord.java:532)
	at sun.security.ssl.SSLSocketImpl.readRecord(SSLSocketImpl.java:983)
	at sun.security.ssl.SSLSocketImpl.readDataRecord(SSLSocketImpl.java:940)
	at sun.security.ssl.AppInputStream.read(AppInputStream.java:105)
	at org.apache.maven.wagon.providers.http.httpclient.impl.io.SessionInputBufferImpl.streamRead(SessionInputBufferImpl.java:136)
	at org.apache.maven.wagon.providers.http.httpclient.impl.io.SessionInputBufferImpl.read(SessionInputBufferImpl.java:195)
	at org.apache.maven.wagon.providers.http.httpclient.impl.io.ContentLengthInputStream.read(ContentLengthInputStream.java:178)
	at org.apache.maven.wagon.providers.http.httpclient.conn.EofSensorInputStream.read(EofSensorInputStream.java:137)
	at org.apache.maven.wagon.AbstractWagon.transfer(AbstractWagon.java:531)
	at org.apache.maven.wagon.AbstractWagon.getTransfer(AbstractWagon.java:353)
	... 13 more
2017-09-05T18:31:43.991 [ERROR] 
2017-09-05T18:31:43.992 [ERROR] Re-run Maven using the -X switch to enable full debug logging.
2017-09-05T18:31:43.992 [ERROR] 
2017-09-05T18:31:43.992 [ERROR] For more information about the errors and possible solutions,
please read the following articles:
2017-09-05T18:31:43.992 [ERROR] [Help 1] http://cwiki.apache.org/confluence/display/MAVEN/DependencyResolutionException
2017-09-05T18:31:43.992 [ERROR] 
2017-09-05T18:31:43.992 [ERROR] After correcting the problems, you can resume the build with
the command
2017-09-05T18:31:43.992 [ERROR]   mvn <goals> -rf :beam-sdks-java-io-hadoop-jdk1.8-tests
channel stopped

Mime
View raw message