beam-commits mailing list archives

Site index · List index
Message view « Date » · « Thread »
Top « Date » · « Thread »
From Apache Jenkins Server <jenk...@builds.apache.org>
Subject Build failed in Jenkins: beam_PostCommit_Python_Verify #3565
Date Fri, 17 Nov 2017 15:33:24 GMT
See <https://builds.apache.org/job/beam_PostCommit_Python_Verify/3565/display/redirect>

------------------------------------------
[...truncated 883.25 KB...]
test_getitem_param_must_be_tuple (apache_beam.typehints.typehints_test.KVHintTestCase) ...
ok
test_getitem_param_must_have_length_2 (apache_beam.typehints.typehints_test.KVHintTestCase)
... ok
test_getitem_proxy_to_tuple (apache_beam.typehints.typehints_test.KVHintTestCase) ... ok
test_enforce_list_type_constraint_invalid_composite_type (apache_beam.typehints.typehints_test.ListHintTestCase)
... ok
test_enforce_list_type_constraint_invalid_simple_type (apache_beam.typehints.typehints_test.ListHintTestCase)
... ok
test_enforce_list_type_constraint_valid_composite_type (apache_beam.typehints.typehints_test.ListHintTestCase)
... ok
test_enforce_list_type_constraint_valid_simple_type (apache_beam.typehints.typehints_test.ListHintTestCase)
... ok
test_getitem_invalid_composite_type_param (apache_beam.typehints.typehints_test.ListHintTestCase)
... ok
test_list_constraint_compatibility (apache_beam.typehints.typehints_test.ListHintTestCase)
... ok
test_list_repr (apache_beam.typehints.typehints_test.ListHintTestCase) ... ok
test_getitem_proxy_to_union (apache_beam.typehints.typehints_test.OptionalHintTestCase) ...
ok
test_getitem_sequence_not_allowed (apache_beam.typehints.typehints_test.OptionalHintTestCase)
... ok
test_any_return_type_hint (apache_beam.typehints.typehints_test.ReturnsDecoratorTestCase)
... ok
test_must_be_primitive_type_or_type_constraint (apache_beam.typehints.typehints_test.ReturnsDecoratorTestCase)
... ok
test_must_be_single_return_type (apache_beam.typehints.typehints_test.ReturnsDecoratorTestCase)
... ok
test_no_kwargs_accepted (apache_beam.typehints.typehints_test.ReturnsDecoratorTestCase) ...
ok
test_type_check_composite_type (apache_beam.typehints.typehints_test.ReturnsDecoratorTestCase)
... ok
test_type_check_simple_type (apache_beam.typehints.typehints_test.ReturnsDecoratorTestCase)
... ok
test_type_check_violation (apache_beam.typehints.typehints_test.ReturnsDecoratorTestCase)
... ok
test_compatibility (apache_beam.typehints.typehints_test.SetHintTestCase) ... ok
test_getitem_invalid_composite_type_param (apache_beam.typehints.typehints_test.SetHintTestCase)
... ok
test_repr (apache_beam.typehints.typehints_test.SetHintTestCase) ... ok
test_type_check_invalid_elem_type (apache_beam.typehints.typehints_test.SetHintTestCase) ...
ok
test_type_check_must_be_set (apache_beam.typehints.typehints_test.SetHintTestCase) ... ok
test_type_check_valid_elem_composite_type (apache_beam.typehints.typehints_test.SetHintTestCase)
... ok
test_type_check_valid_elem_simple_type (apache_beam.typehints.typehints_test.SetHintTestCase)
... ok
test_any_argument_type_hint (apache_beam.typehints.typehints_test.TakesDecoratorTestCase)
... ok
test_basic_type_assertion (apache_beam.typehints.typehints_test.TakesDecoratorTestCase) ...
ok
test_composite_type_assertion (apache_beam.typehints.typehints_test.TakesDecoratorTestCase)
... ok
test_invalid_only_positional_arguments (apache_beam.typehints.typehints_test.TakesDecoratorTestCase)
... ok
test_must_be_primitive_type_or_constraint (apache_beam.typehints.typehints_test.TakesDecoratorTestCase)
... ok
test_valid_mix_positional_and_keyword_arguments (apache_beam.typehints.typehints_test.TakesDecoratorTestCase)
... ok
test_valid_only_positional_arguments (apache_beam.typehints.typehints_test.TakesDecoratorTestCase)
... ok
test_valid_simple_type_arguments (apache_beam.typehints.typehints_test.TakesDecoratorTestCase)
... ok
test_functions_as_regular_generator (apache_beam.typehints.typehints_test.TestGeneratorWrapper)
... ok
test_compatibility (apache_beam.typehints.typehints_test.TupleHintTestCase) ... ok
test_compatibility_arbitrary_length (apache_beam.typehints.typehints_test.TupleHintTestCase)
... ok
test_getitem_invalid_ellipsis_type_param (apache_beam.typehints.typehints_test.TupleHintTestCase)
... ok
test_getitem_params_must_be_type_or_constraint (apache_beam.typehints.typehints_test.TupleHintTestCase)
... ok
test_raw_tuple (apache_beam.typehints.typehints_test.TupleHintTestCase) ... ok
test_repr (apache_beam.typehints.typehints_test.TupleHintTestCase) ... ok
test_type_check_invalid_composite_type (apache_beam.typehints.typehints_test.TupleHintTestCase)
... ok
test_type_check_invalid_composite_type_arbitrary_length (apache_beam.typehints.typehints_test.TupleHintTestCase)
... ok
test_type_check_invalid_simple_type_arbitrary_length (apache_beam.typehints.typehints_test.TupleHintTestCase)
... ok
test_type_check_invalid_simple_types (apache_beam.typehints.typehints_test.TupleHintTestCase)
... ok
test_type_check_must_be_tuple (apache_beam.typehints.typehints_test.TupleHintTestCase) ...
ok
test_type_check_must_have_same_arity (apache_beam.typehints.typehints_test.TupleHintTestCase)
... ok
test_type_check_valid_composite_type_arbitrary_length (apache_beam.typehints.typehints_test.TupleHintTestCase)
... ok
test_type_check_valid_composite_types (apache_beam.typehints.typehints_test.TupleHintTestCase)
... ok
test_type_check_valid_simple_type_arbitrary_length (apache_beam.typehints.typehints_test.TupleHintTestCase)
... ok
test_type_check_valid_simple_types (apache_beam.typehints.typehints_test.TupleHintTestCase)
... ok
test_getitem_duplicates_ignored (apache_beam.typehints.typehints_test.UnionHintTestCase) ...
ok
test_getitem_must_be_valid_type_param (apache_beam.typehints.typehints_test.UnionHintTestCase)
... ok
test_getitem_must_be_valid_type_param_cant_be_object_instance (apache_beam.typehints.typehints_test.UnionHintTestCase)
... ok
test_getitem_nested_unions_flattened (apache_beam.typehints.typehints_test.UnionHintTestCase)
... ok
test_nested_compatibility (apache_beam.typehints.typehints_test.UnionHintTestCase) ... ok
test_union_hint_compatibility (apache_beam.typehints.typehints_test.UnionHintTestCase) ...
ok
test_union_hint_enforcement_composite_type_in_union (apache_beam.typehints.typehints_test.UnionHintTestCase)
... ok
test_union_hint_enforcement_not_part_of_union (apache_beam.typehints.typehints_test.UnionHintTestCase)
... ok
test_union_hint_enforcement_part_of_union (apache_beam.typehints.typehints_test.UnionHintTestCase)
... ok
test_union_hint_repr (apache_beam.typehints.typehints_test.UnionHintTestCase) ... ok
test_deprecated_with_since_current (apache_beam.utils.annotations_test.AnnotationTests) ...
ok
test_deprecated_with_since_current_message (apache_beam.utils.annotations_test.AnnotationTests)
... ok
test_deprecated_without_current (apache_beam.utils.annotations_test.AnnotationTests) ... ok
test_deprecated_without_since_should_fail (apache_beam.utils.annotations_test.AnnotationTests)
... ok
test_experimental_with_current (apache_beam.utils.annotations_test.AnnotationTests) ... ok
test_experimental_with_current_message (apache_beam.utils.annotations_test.AnnotationTests)
... ok
test_experimental_without_current (apache_beam.utils.annotations_test.AnnotationTests) ...
ok
test_frequency (apache_beam.utils.annotations_test.AnnotationTests)
Tests that the filter 'once' is sufficient to print once per ... ok
test_equal_objects (apache_beam.utils.counters_test.CounterNameTest) ... ok
test_hash_two_objects (apache_beam.utils.counters_test.CounterNameTest) ... ok
test_method_forwarding_not_windows (apache_beam.utils.processes_test.Exec) ... ok
test_method_forwarding_windows (apache_beam.utils.processes_test.Exec) ... ok
test_call_two_objects (apache_beam.utils.retry_test.RetryStateTest) ... ok
test_single_failure (apache_beam.utils.retry_test.RetryStateTest) ... ok
test_two_failures (apache_beam.utils.retry_test.RetryStateTest) ... ok
test_log_calls_for_permanent_failure (apache_beam.utils.retry_test.RetryTest) ... ok
test_log_calls_for_transient_failure (apache_beam.utils.retry_test.RetryTest) ... ok
test_with_default_number_of_retries (apache_beam.utils.retry_test.RetryTest) ... ok
test_with_explicit_decorator (apache_beam.utils.retry_test.RetryTest) ... ok
test_with_explicit_initial_delay (apache_beam.utils.retry_test.RetryTest) ... ok
test_with_explicit_number_of_retries (apache_beam.utils.retry_test.RetryTest) ... ok
test_with_http_error_that_should_be_retried (apache_beam.utils.retry_test.RetryTest) ... ok
test_with_http_error_that_should_not_be_retried (apache_beam.utils.retry_test.RetryTest) ...
ok
test_with_no_retry_decorator (apache_beam.utils.retry_test.RetryTest) ... ok
test_with_real_clock (apache_beam.utils.retry_test.RetryTest) ... ok
test_arithmetic (apache_beam.utils.timestamp_test.DurationTest) ... ok
test_of (apache_beam.utils.timestamp_test.DurationTest) ... ok
test_precision (apache_beam.utils.timestamp_test.DurationTest) ... ok
test_sort_order (apache_beam.utils.timestamp_test.DurationTest) ... ok
test_str (apache_beam.utils.timestamp_test.DurationTest) ... ok
test_arithmetic (apache_beam.utils.timestamp_test.TimestampTest) ... ok
test_of (apache_beam.utils.timestamp_test.TimestampTest) ... ok
test_precision (apache_beam.utils.timestamp_test.TimestampTest) ... ok
test_sort_order (apache_beam.utils.timestamp_test.TimestampTest) ... ok
test_str (apache_beam.utils.timestamp_test.TimestampTest) ... ok
test_utc_timestamp (apache_beam.utils.timestamp_test.TimestampTest) ... ok
test_equality (apache_beam.utils.windowed_value_test.WindowedValueTest) ... ok
test_hash (apache_beam.utils.windowed_value_test.WindowedValueTest) ... ok
test_pickle (apache_beam.utils.windowed_value_test.WindowedValueTest) ... ok
test_timestamps (apache_beam.utils.windowed_value_test.WindowedValueTest) ... ok
test_with_value (apache_beam.utils.windowed_value_test.WindowedValueTest) ... ok
test_no_partial_writeouts (apache_beam.pipeline_test.DirectRunnerRetryTests) ... ok
test_retry_fork_graph (apache_beam.pipeline_test.DirectRunnerRetryTests) ... ok
test_element (apache_beam.pipeline_test.DoFnTest) ... ok
test_side_input_no_tag (apache_beam.pipeline_test.DoFnTest) ... ok
test_side_input_tagged (apache_beam.pipeline_test.DoFnTest) ... ok
test_timestamp_param (apache_beam.pipeline_test.DoFnTest) ... ok
test_window_param (apache_beam.pipeline_test.DoFnTest) ... ok
test_attribute_setting (apache_beam.pipeline_test.PipelineOptionsTest) ... ok
test_defaults (apache_beam.pipeline_test.PipelineOptionsTest) ... ok
test_dir (apache_beam.pipeline_test.PipelineOptionsTest) ... ok
test_flag_parsing (apache_beam.pipeline_test.PipelineOptionsTest) ... ok
test_keyword_parsing (apache_beam.pipeline_test.PipelineOptionsTest) ... ok
test_view_as (apache_beam.pipeline_test.PipelineOptionsTest) ... ok
test_aggregator_empty_input (apache_beam.pipeline_test.PipelineTest) ... ok
test_apply_custom_transform (apache_beam.pipeline_test.PipelineTest) ... ok
test_create (apache_beam.pipeline_test.PipelineTest) ... ok
test_create_singleton_pcollection (apache_beam.pipeline_test.PipelineTest) ... <https://builds.apache.org/job/beam_PostCommit_Python_Verify/ws/sdks/python/apache_beam/coders/typecoders.py>:134:
UserWarning: Using fallback coder for typehint: List[int].
  warnings.warn('Using fallback coder for typehint: %r.' % typehint)
ok
test_flatmap_builtin (apache_beam.pipeline_test.PipelineTest) ... ok
test_memory_usage (apache_beam.pipeline_test.PipelineTest) ... ok
test_metrics_in_source (apache_beam.pipeline_test.PipelineTest) ... ok
test_pipeline_as_context (apache_beam.pipeline_test.PipelineTest) ... <https://builds.apache.org/job/beam_PostCommit_Python_Verify/ws/sdks/python/apache_beam/coders/typecoders.py>:134:
UserWarning: Using fallback coder for typehint: <type 'exceptions.ValueError'>.
  warnings.warn('Using fallback coder for typehint: %r.' % typehint)
ok
test_ptransform_overrides (apache_beam.pipeline_test.PipelineTest) ... ok
test_read (apache_beam.pipeline_test.PipelineTest) ... ok
test_reuse_cloned_custom_transform_instance (apache_beam.pipeline_test.PipelineTest) ... ok
test_reuse_custom_transform_instance (apache_beam.pipeline_test.PipelineTest) ... <https://builds.apache.org/job/beam_PostCommit_Python_Verify/ws/sdks/python/apache_beam/pipeline_test.py>:214:
DeprecationWarning: BaseException.message has been deprecated as of Python 2.6
  cm.exception.message,
ok
test_transform_no_super_init (apache_beam.pipeline_test.PipelineTest) ... ok
test_visit_entire_graph (apache_beam.pipeline_test.PipelineTest) ... ok
test_pickling (apache_beam.pipeline_test.RunnerApiTest) ... ok
test_simple (apache_beam.pipeline_test.RunnerApiTest)
Tests serializing, deserializing, and running a simple pipeline. ... ok
test_assingleton_multi_element (apache_beam.pvalue_test.PValueTest) ... ok
test_pvalue_expected_arguments (apache_beam.pvalue_test.PValueTest) ... ok
test_file_checksum_matchcer_invalid_sleep_time (apache_beam.testing.pipeline_verifiers_test.PipelineVerifiersTest)
... <https://builds.apache.org/job/beam_PostCommit_Python_Verify/ws/sdks/python/apache_beam/testing/pipeline_verifiers_test.py>:130:
DeprecationWarning: BaseException.message has been deprecated as of Python 2.6
  self.assertEqual(cm.exception.message,
ok
test_file_checksum_matcher_read_failed (apache_beam.testing.pipeline_verifiers_test.PipelineVerifiersTest)
... ok
test_file_checksum_matcher_service_error (apache_beam.testing.pipeline_verifiers_test.PipelineVerifiersTest)
... ok
test_file_checksum_matcher_sleep_before_verify (apache_beam.testing.pipeline_verifiers_test.PipelineVerifiersTest)
... ok
test_file_checksum_matcher_success (apache_beam.testing.pipeline_verifiers_test.PipelineVerifiersTest)
... ok
test_pipeline_state_matcher_fails (apache_beam.testing.pipeline_verifiers_test.PipelineVerifiersTest)
Test PipelineStateMatcher fails when using default expected state ... ok
test_pipeline_state_matcher_given_state (apache_beam.testing.pipeline_verifiers_test.PipelineVerifiersTest)
Test PipelineStateMatcher successes when matches given state ... ok
test_pipeline_state_matcher_success (apache_beam.testing.pipeline_verifiers_test.PipelineVerifiersTest)
Test PipelineStateMatcher successes when using default expected state ... ok
test_append_extra_options (apache_beam.testing.test_pipeline_test.TestPipelineTest) ... ok
test_append_verifier_in_extra_opt (apache_beam.testing.test_pipeline_test.TestPipelineTest)
... ok
test_create_test_pipeline_options (apache_beam.testing.test_pipeline_test.TestPipelineTest)
... ok
test_empty_option_args_parsing (apache_beam.testing.test_pipeline_test.TestPipelineTest) ...
ok
test_get_option (apache_beam.testing.test_pipeline_test.TestPipelineTest) ... ok
test_option_args_parsing (apache_beam.testing.test_pipeline_test.TestPipelineTest) ... ok
test_skip_IT (apache_beam.testing.test_pipeline_test.TestPipelineTest) ... SKIP: IT is skipped
because --test-pipeline-options is not specified
test_basic_execution (apache_beam.testing.test_stream_test.TestStreamTest) ... ok
test_basic_test_stream (apache_beam.testing.test_stream_test.TestStreamTest) ... ok
test_gbk_execution (apache_beam.testing.test_stream_test.TestStreamTest) ... ok
test_test_stream_errors (apache_beam.testing.test_stream_test.TestStreamTest) ... ok
test_delete_files_fails_with_invalid_arg (apache_beam.testing.test_utils_test.TestUtilsTest)
... ok
test_delete_files_fails_with_io_error (apache_beam.testing.test_utils_test.TestUtilsTest)
... <https://builds.apache.org/job/beam_PostCommit_Python_Verify/ws/sdks/python/apache_beam/testing/test_utils_test.py>:52:
DeprecationWarning: BaseException.message has been deprecated as of Python 2.6
  error.exception.message.startswith('Delete operation failed'))
ok
test_delete_files_succeeds (apache_beam.testing.test_utils_test.TestUtilsTest) ... ok
test_assert_that_fails (apache_beam.testing.util_test.UtilTest) ... ok
test_assert_that_fails_on_empty_expected (apache_beam.testing.util_test.UtilTest) ... ok
test_assert_that_fails_on_empty_input (apache_beam.testing.util_test.UtilTest) ... ok
test_assert_that_passes (apache_beam.testing.util_test.UtilTest) ... ok

======================================================================
FAIL: test_source_iterator_fn_exception (apache_beam.runners.worker.sideinputs_test.PrefetchingSourceIteratorTest)
----------------------------------------------------------------------
Traceback (most recent call last):
  File "<https://builds.apache.org/job/beam_PostCommit_Python_Verify/ws/sdks/python/apache_beam/runners/worker/sideinputs_test.py",>
line 119, in test_source_iterator_fn_exception
    self.assertEqual(sorted(seen), range(5))
AssertionError: Lists differ: [0, 1, 2, 3] != [0, 1, 2, 3, 4]

Second list contains 1 additional elements.
First extra element 4:
4

- [0, 1, 2, 3]
+ [0, 1, 2, 3, 4]
?            +++

-------------------- >> begin captured logging << --------------------
root: ERROR: Encountered exception in PrefetchingSourceSetIterable reader thread: Traceback
(most recent call last):
  File "<https://builds.apache.org/job/beam_PostCommit_Python_Verify/ws/sdks/python/apache_beam/runners/worker/sideinputs.py",>
line 100, in _reader_thread
    for value in reader:
  File "<https://builds.apache.org/job/beam_PostCommit_Python_Verify/ws/sdks/python/apache_beam/runners/worker/sideinputs_test.py",>
line 101, in exception_generator
    raise MyException('I am an exception!')
MyException: I am an exception!

--------------------- >> end captured logging << ---------------------

----------------------------------------------------------------------
Ran 1346 tests in 349.897s

FAILED (failures=1, skipped=21)
Test failed: <unittest.runner.TextTestResult run=1346 errors=0 failures=1>
error: Test failed: <unittest.runner.TextTestResult run=1346 errors=0 failures=1>
ERROR: InvocationError: '<https://builds.apache.org/job/beam_PostCommit_Python_Verify/ws/sdks/python/target/.tox/py27gcp/bin/python>
setup.py test'
___________________________________ summary ____________________________________
  docs: commands succeeded
  lint: commands succeeded
  py27: commands succeeded
  py27cython: commands succeeded
ERROR:   py27gcp: commands failed
Build step 'Execute shell' marked build as failure
Not sending mail to unregistered user ccy@google.com
Not sending mail to unregistered user klk@google.com
Not sending mail to unregistered user herohde@google.com
Not sending mail to unregistered user kirpichov@google.com
Not sending mail to unregistered user ajamato@ajamato2016.sea.corp.google.com
Not sending mail to unregistered user github@nakomis.com
Not sending mail to unregistered user ekirpichov@gmail.com
Not sending mail to unregistered user valentyn@google.com
Not sending mail to unregistered user xumingmingv@gmail.com
ERROR: Unable to send to address: echauchot@gmail.com+jbonofre@apache.org
javax.mail.internet.AddressException: Domain contains illegal character in string ``echauchot@gmail.com+jbonofre@apache.org''
	at javax.mail.internet.InternetAddress.checkAddress(InternetAddress.java:1269)
	at javax.mail.internet.InternetAddress.parse(InternetAddress.java:1091)
	at javax.mail.internet.InternetAddress.parse(InternetAddress.java:633)
	at javax.mail.internet.InternetAddress.<init>(InternetAddress.java:111)
	at hudson.tasks.Mailer.stringToAddress(Mailer.java:206)
	at jenkins.plugins.mailer.tasks.MimeMessageBuilder.toNormalizedAddress(MimeMessageBuilder.java:309)
	at jenkins.plugins.mailer.tasks.MimeMessageBuilder.addRecipients(MimeMessageBuilder.java:168)
	at jenkins.plugins.mailer.tasks.MimeMessageBuilder.addRecipients(MimeMessageBuilder.java:160)
	at hudson.tasks.MailSender.createEmptyMail(MailSender.java:389)
	at hudson.tasks.MailSender.createFailureMail(MailSender.java:266)
	at hudson.tasks.MailSender.createMail(MailSender.java:181)
	at hudson.tasks.MailSender.run(MailSender.java:112)
	at hudson.tasks.Mailer.perform(Mailer.java:170)
	at hudson.tasks.BuildStepCompatibilityLayer.perform(BuildStepCompatibilityLayer.java:81)
	at hudson.tasks.BuildStepMonitor$1.perform(BuildStepMonitor.java:20)
	at hudson.model.AbstractBuild$AbstractBuildExecution.perform(AbstractBuild.java:736)
	at hudson.model.AbstractBuild$AbstractBuildExecution.performAllBuildSteps(AbstractBuild.java:682)
	at hudson.model.Build$BuildExecution.post2(Build.java:186)
	at hudson.model.AbstractBuild$AbstractBuildExecution.post(AbstractBuild.java:627)
	at hudson.model.Run.execute(Run.java:1762)
	at hudson.model.FreeStyleBuild.run(FreeStyleBuild.java:43)
	at hudson.model.ResourceController.execute(ResourceController.java:97)
	at hudson.model.Executor.run(Executor.java:419)

Mime
View raw message