beam-commits mailing list archives

Site index · List index
Message view « Date » · « Thread »
Top « Date » · « Thread »
From Apache Jenkins Server <jenk...@builds.apache.org>
Subject Build failed in Jenkins: beam_PostCommit_Java_MavenInstall #5160
Date Fri, 03 Nov 2017 02:37:33 GMT
See <https://builds.apache.org/job/beam_PostCommit_Java_MavenInstall/5160/display/redirect?page=changes>

Changes:

[tgroh] Add sdks/java/fn-execution

[tgroh] Add a runners/java-fn-execution module

------------------------------------------
[...truncated 1.25 MB...]
2017-11-03T02:36:01.797 [INFO] Excluding org.reactivestreams:reactive-streams:jar:1.0.0 from
the shaded jar.
2017-11-03T02:36:01.797 [INFO] Excluding com.typesafe:ssl-config-core_2.11:jar:0.2.1 from
the shaded jar.
2017-11-03T02:36:01.797 [INFO] Excluding org.scala-lang.modules:scala-parser-combinators_2.11:jar:1.0.4
from the shaded jar.
2017-11-03T02:36:01.797 [INFO] Excluding com.typesafe.akka:akka-protobuf_2.11:jar:2.4.16 from
the shaded jar.
2017-11-03T02:36:01.797 [INFO] Excluding org.uncommons.maths:uncommons-maths:jar:1.2.2a from
the shaded jar.
2017-11-03T02:36:01.797 [INFO] Excluding io.aeron:aeron-driver:jar:1.0.4 from the shaded jar.
2017-11-03T02:36:01.797 [INFO] Excluding io.aeron:aeron-client:jar:1.0.4 from the shaded jar.
2017-11-03T02:36:01.797 [INFO] Excluding org.agrona:Agrona:jar:0.9.0 from the shaded jar.
2017-11-03T02:36:01.797 [INFO] Excluding com.typesafe.akka:akka-cluster_2.11:jar:2.4.16 from
the shaded jar.
2017-11-03T02:36:01.798 [INFO] Excluding com.typesafe.akka:akka-cluster-tools_2.11:jar:2.4.16
from the shaded jar.
2017-11-03T02:36:01.798 [INFO] Excluding commons-logging:commons-logging:jar:1.1.3 from the
shaded jar.
2017-11-03T02:36:01.798 [INFO] Excluding com.typesafe.akka:akka-distributed-data-experimental_2.11:jar:2.4.16
from the shaded jar.
2017-11-03T02:36:01.798 [INFO] Excluding org.lmdbjava:lmdbjava:jar:0.0.4 from the shaded jar.
2017-11-03T02:36:01.798 [INFO] Excluding com.github.jnr:jnr-ffi:jar:2.0.9 from the shaded
jar.
2017-11-03T02:36:01.798 [INFO] Excluding com.github.jnr:jffi:jar:1.2.11 from the shaded jar.
2017-11-03T02:36:01.798 [INFO] Excluding com.github.jnr:jffi:jar:native:1.2.11 from the shaded
jar.
2017-11-03T02:36:01.798 [INFO] Excluding org.ow2.asm:asm:jar:5.0.3 from the shaded jar.
2017-11-03T02:36:01.798 [INFO] Excluding org.ow2.asm:asm-commons:jar:5.0.3 from the shaded
jar.
2017-11-03T02:36:01.798 [INFO] Excluding org.ow2.asm:asm-analysis:jar:5.0.3 from the shaded
jar.
2017-11-03T02:36:01.798 [INFO] Excluding org.ow2.asm:asm-tree:jar:5.0.3 from the shaded jar.
2017-11-03T02:36:01.798 [INFO] Excluding org.ow2.asm:asm-util:jar:5.0.3 from the shaded jar.
2017-11-03T02:36:01.798 [INFO] Excluding com.github.jnr:jnr-x86asm:jar:1.0.2 from the shaded
jar.
2017-11-03T02:36:01.798 [INFO] Excluding com.github.jnr:jnr-constants:jar:0.9.3 from the shaded
jar.
2017-11-03T02:36:01.798 [INFO] Excluding com.jakewharton.byteunits:byteunits:jar:0.9.1 from
the shaded jar.
2017-11-03T02:36:01.798 [INFO] Excluding com.typesafe.akka:akka-actor_2.11:jar:2.4.16 from
the shaded jar.
2017-11-03T02:36:01.798 [INFO] Excluding org.scala-lang.modules:scala-java8-compat_2.11:jar:0.7.0
from the shaded jar.
2017-11-03T02:36:01.798 [INFO] Excluding com.typesafe.akka:akka-agent_2.11:jar:2.4.16 from
the shaded jar.
2017-11-03T02:36:01.798 [INFO] Excluding org.scala-stm:scala-stm_2.11:jar:0.8 from the shaded
jar.
2017-11-03T02:36:01.798 [INFO] Excluding com.typesafe.akka:akka-slf4j_2.11:jar:2.4.16 from
the shaded jar.
2017-11-03T02:36:01.798 [INFO] Excluding com.typesafe.akka:akka-kernel_2.11:jar:2.4.16 from
the shaded jar.
2017-11-03T02:36:01.798 [INFO] Excluding com.typesafe.akka:akka-http_2.11:jar:10.0.1 from
the shaded jar.
2017-11-03T02:36:01.798 [INFO] Excluding com.typesafe.akka:akka-http-core_2.11:jar:10.0.1
from the shaded jar.
2017-11-03T02:36:01.798 [INFO] Excluding com.typesafe.akka:akka-parsing_2.11:jar:10.0.1 from
the shaded jar.
2017-11-03T02:36:01.798 [INFO] Excluding com.typesafe.akka:akka-http-spray-json_2.11:jar:10.0.1
from the shaded jar.
2017-11-03T02:36:01.798 [INFO] Excluding io.spray:spray-json_2.11:jar:1.3.2 from the shaded
jar.
2017-11-03T02:36:01.798 [INFO] Excluding org.scala-lang:scala-reflect:jar:2.11.8 from the
shaded jar.
2017-11-03T02:36:01.798 [INFO] Excluding org.apache.beam:beam-sdks-java-core:jar:2.3.0-SNAPSHOT
from the shaded jar.
2017-11-03T02:36:01.798 [INFO] Excluding com.google.protobuf:protobuf-java:jar:3.2.0 from
the shaded jar.
2017-11-03T02:36:01.798 [INFO] Excluding com.github.stephenc.findbugs:findbugs-annotations:jar:1.3.9-1
from the shaded jar.
2017-11-03T02:36:01.798 [INFO] Excluding com.fasterxml.jackson.core:jackson-core:jar:2.8.9
from the shaded jar.
2017-11-03T02:36:01.799 [INFO] Excluding net.bytebuddy:byte-buddy:jar:1.6.8 from the shaded
jar.
2017-11-03T02:36:01.799 [INFO] Excluding org.apache.avro:avro:jar:1.8.2 from the shaded jar.
2017-11-03T02:36:01.799 [INFO] Excluding org.codehaus.jackson:jackson-core-asl:jar:1.9.13
from the shaded jar.
2017-11-03T02:36:01.799 [INFO] Excluding org.codehaus.jackson:jackson-mapper-asl:jar:1.9.13
from the shaded jar.
2017-11-03T02:36:01.799 [INFO] Excluding com.thoughtworks.paranamer:paranamer:jar:2.7 from
the shaded jar.
2017-11-03T02:36:01.799 [INFO] Excluding org.tukaani:xz:jar:1.5 from the shaded jar.
2017-11-03T02:36:01.799 [INFO] Excluding org.xerial.snappy:snappy-java:jar:1.1.4 from the
shaded jar.
2017-11-03T02:36:01.799 [INFO] Excluding org.apache.commons:commons-compress:jar:1.14 from
the shaded jar.
2017-11-03T02:36:01.799 [INFO] Excluding org.apache.commons:commons-lang3:jar:3.6 from the
shaded jar.
2017-11-03T02:36:01.799 [INFO] Excluding org.apache.beam:beam-runners-core-java:jar:2.3.0-SNAPSHOT
from the shaded jar.
2017-11-03T02:36:01.799 [INFO] Excluding org.apache.beam:beam-model-pipeline:jar:2.3.0-SNAPSHOT
from the shaded jar.
2017-11-03T02:36:01.799 [INFO] Excluding org.apache.beam:beam-model-fn-execution:jar:2.3.0-SNAPSHOT
from the shaded jar.
2017-11-03T02:36:01.799 [INFO] Excluding io.grpc:grpc-protobuf:jar:1.2.0 from the shaded jar.
2017-11-03T02:36:01.799 [INFO] Excluding io.grpc:grpc-protobuf-lite:jar:1.2.0 from the shaded
jar.
2017-11-03T02:36:01.799 [INFO] Excluding io.grpc:grpc-core:jar:1.2.0 from the shaded jar.
2017-11-03T02:36:01.799 [INFO] Excluding com.google.errorprone:error_prone_annotations:jar:2.0.15
from the shaded jar.
2017-11-03T02:36:01.799 [INFO] Excluding io.grpc:grpc-context:jar:1.2.0 from the shaded jar.
2017-11-03T02:36:01.799 [INFO] Excluding com.google.instrumentation:instrumentation-api:jar:0.3.0
from the shaded jar.
2017-11-03T02:36:01.799 [INFO] Excluding io.grpc:grpc-stub:jar:1.2.0 from the shaded jar.
2017-11-03T02:36:01.799 [INFO] Excluding org.apache.beam:beam-runners-core-construction-java:jar:2.3.0-SNAPSHOT
from the shaded jar.
2017-11-03T02:36:01.799 [INFO] Excluding org.apache.beam:beam-model-job-management:jar:2.3.0-SNAPSHOT
from the shaded jar.
2017-11-03T02:36:01.799 [INFO] Excluding com.google.protobuf:protobuf-java-util:jar:3.2.0
from the shaded jar.
2017-11-03T02:36:01.799 [INFO] Excluding com.google.code.gson:gson:jar:2.7 from the shaded
jar.
2017-11-03T02:36:01.799 [INFO] Excluding joda-time:joda-time:jar:2.4 from the shaded jar.
2017-11-03T02:36:01.799 [INFO] Excluding com.fasterxml.jackson.core:jackson-annotations:jar:2.8.9
from the shaded jar.
2017-11-03T02:36:01.799 [INFO] Including com.google.guava:guava:jar:20.0 in the shaded jar.
2017-11-03T02:36:01.799 [INFO] Excluding com.google.code.findbugs:jsr305:jar:3.0.1 from the
shaded jar.
2017-11-03T02:36:01.799 [INFO] Excluding com.google.auto.service:auto-service:jar:1.0-rc2
from the shaded jar.
2017-11-03T02:36:01.799 [INFO] Excluding com.google.auto:auto-common:jar:0.3 from the shaded
jar.
2017-11-03T02:36:04.654 [INFO] Replacing original artifact with shaded artifact.
2017-11-03T02:36:04.654 [INFO] Replacing <https://builds.apache.org/job/beam_PostCommit_Java_MavenInstall/ws/src/runners/gearpump/target/beam-runners-gearpump-2.3.0-SNAPSHOT.jar>
with <https://builds.apache.org/job/beam_PostCommit_Java_MavenInstall/ws/src/runners/gearpump/target/beam-runners-gearpump-2.3.0-SNAPSHOT-shaded.jar>
2017-11-03T02:36:04.654 [INFO] Replacing original test artifact with shaded test artifact.
2017-11-03T02:36:04.654 [INFO] Replacing <https://builds.apache.org/job/beam_PostCommit_Java_MavenInstall/ws/src/runners/gearpump/target/beam-runners-gearpump-2.3.0-SNAPSHOT-tests.jar>
with <https://builds.apache.org/job/beam_PostCommit_Java_MavenInstall/ws/src/runners/gearpump/target/beam-runners-gearpump-2.3.0-SNAPSHOT-shaded-tests.jar>
2017-11-03T02:36:04.654 [INFO] Dependency-reduced POM written at: <https://builds.apache.org/job/beam_PostCommit_Java_MavenInstall/ws/src/runners/gearpump/dependency-reduced-pom.xml>
2017-11-03T02:36:04.870 [INFO] 
2017-11-03T02:36:04.870 [INFO] --- maven-javadoc-plugin:3.0.0-M1:jar (attach-javadocs) @ beam-runners-gearpump
---
2017-11-03T02:36:07.725 [INFO] Building jar: <https://builds.apache.org/job/beam_PostCommit_Java_MavenInstall/ws/src/runners/gearpump/target/beam-runners-gearpump-2.3.0-SNAPSHOT-javadoc.jar>
2017-11-03T02:36:07.851 [INFO] 
2017-11-03T02:36:07.851 [INFO] --- maven-source-plugin:3.0.1:jar-no-fork (attach-sources)
@ beam-runners-gearpump ---
2017-11-03T02:36:07.855 [INFO] Building jar: <https://builds.apache.org/job/beam_PostCommit_Java_MavenInstall/ws/src/runners/gearpump/target/beam-runners-gearpump-2.3.0-SNAPSHOT-sources.jar>
2017-11-03T02:36:07.985 [INFO] 
2017-11-03T02:36:07.985 [INFO] --- maven-source-plugin:3.0.1:test-jar-no-fork (attach-test-sources)
@ beam-runners-gearpump ---
2017-11-03T02:36:07.989 [INFO] Building jar: <https://builds.apache.org/job/beam_PostCommit_Java_MavenInstall/ws/src/runners/gearpump/target/beam-runners-gearpump-2.3.0-SNAPSHOT-test-sources.jar>
2017-11-03T02:36:08.105 [INFO] 
2017-11-03T02:36:08.105 [INFO] --- reproducible-build-maven-plugin:0.3:strip-jar (default)
@ beam-runners-gearpump ---
2017-11-03T02:36:08.106 [INFO] Stripping <https://builds.apache.org/job/beam_PostCommit_Java_MavenInstall/ws/src/runners/gearpump/target/beam-runners-gearpump-2.3.0-SNAPSHOT-sources.jar>
2017-11-03T02:36:08.110 [INFO] Stripping <https://builds.apache.org/job/beam_PostCommit_Java_MavenInstall/ws/src/runners/gearpump/target/beam-runners-gearpump-2.3.0-SNAPSHOT-test-sources.jar>
2017-11-03T02:36:08.112 [INFO] Stripping <https://builds.apache.org/job/beam_PostCommit_Java_MavenInstall/ws/src/runners/gearpump/target/beam-runners-gearpump-2.3.0-SNAPSHOT-tests.jar>
2017-11-03T02:36:08.115 [INFO] Stripping <https://builds.apache.org/job/beam_PostCommit_Java_MavenInstall/ws/src/runners/gearpump/target/beam-runners-gearpump-2.3.0-SNAPSHOT.jar>
2017-11-03T02:36:08.198 [INFO] Stripping <https://builds.apache.org/job/beam_PostCommit_Java_MavenInstall/ws/src/runners/gearpump/target/original-beam-runners-gearpump-2.3.0-SNAPSHOT.jar>
2017-11-03T02:36:08.203 [INFO] Stripping <https://builds.apache.org/job/beam_PostCommit_Java_MavenInstall/ws/src/runners/gearpump/target/beam-runners-gearpump-2.3.0-SNAPSHOT-javadoc.jar>
2017-11-03T02:36:08.207 [INFO] Stripping <https://builds.apache.org/job/beam_PostCommit_Java_MavenInstall/ws/src/runners/gearpump/target/original-beam-runners-gearpump-2.3.0-SNAPSHOT-tests.jar>
2017-11-03T02:36:08.317 [INFO] 
2017-11-03T02:36:08.317 [INFO] --- maven-dependency-plugin:3.0.1:analyze-only (default) @
beam-runners-gearpump ---
2017-11-03T02:36:08.505 [INFO] No dependency problems found
2017-11-03T02:36:08.612 [INFO] 
2017-11-03T02:36:08.612 [INFO] --- maven-install-plugin:2.5.2:install (default-install) @
beam-runners-gearpump ---
2017-11-03T02:36:08.614 [INFO] Installing <https://builds.apache.org/job/beam_PostCommit_Java_MavenInstall/ws/src/runners/gearpump/target/beam-runners-gearpump-2.3.0-SNAPSHOT.jar>
to <https://builds.apache.org/job/beam_PostCommit_Java_MavenInstall/ws/.repository/org/apache/beam/beam-runners-gearpump/2.3.0-SNAPSHOT/beam-runners-gearpump-2.3.0-SNAPSHOT.jar>
2017-11-03T02:36:08.636 [INFO] Installing <https://builds.apache.org/job/beam_PostCommit_Java_MavenInstall/ws/src/runners/gearpump/dependency-reduced-pom.xml>
to <https://builds.apache.org/job/beam_PostCommit_Java_MavenInstall/ws/.repository/org/apache/beam/beam-runners-gearpump/2.3.0-SNAPSHOT/beam-runners-gearpump-2.3.0-SNAPSHOT.pom>
2017-11-03T02:36:08.667 [INFO] Installing <https://builds.apache.org/job/beam_PostCommit_Java_MavenInstall/ws/src/runners/gearpump/target/beam-runners-gearpump-2.3.0-SNAPSHOT-tests.jar>
to <https://builds.apache.org/job/beam_PostCommit_Java_MavenInstall/ws/.repository/org/apache/beam/beam-runners-gearpump/2.3.0-SNAPSHOT/beam-runners-gearpump-2.3.0-SNAPSHOT-tests.jar>
2017-11-03T02:36:08.669 [INFO] Installing <https://builds.apache.org/job/beam_PostCommit_Java_MavenInstall/ws/src/runners/gearpump/target/beam-runners-gearpump-2.3.0-SNAPSHOT-tests.jar>
to <https://builds.apache.org/job/beam_PostCommit_Java_MavenInstall/ws/.repository/org/apache/beam/beam-runners-gearpump/2.3.0-SNAPSHOT/beam-runners-gearpump-2.3.0-SNAPSHOT-tests.jar>
2017-11-03T02:36:08.670 [INFO] Installing <https://builds.apache.org/job/beam_PostCommit_Java_MavenInstall/ws/src/runners/gearpump/target/beam-runners-gearpump-2.3.0-SNAPSHOT-javadoc.jar>
to <https://builds.apache.org/job/beam_PostCommit_Java_MavenInstall/ws/.repository/org/apache/beam/beam-runners-gearpump/2.3.0-SNAPSHOT/beam-runners-gearpump-2.3.0-SNAPSHOT-javadoc.jar>
2017-11-03T02:36:08.672 [INFO] Installing <https://builds.apache.org/job/beam_PostCommit_Java_MavenInstall/ws/src/runners/gearpump/target/beam-runners-gearpump-2.3.0-SNAPSHOT-sources.jar>
to <https://builds.apache.org/job/beam_PostCommit_Java_MavenInstall/ws/.repository/org/apache/beam/beam-runners-gearpump/2.3.0-SNAPSHOT/beam-runners-gearpump-2.3.0-SNAPSHOT-sources.jar>
2017-11-03T02:36:08.673 [INFO] Installing <https://builds.apache.org/job/beam_PostCommit_Java_MavenInstall/ws/src/runners/gearpump/target/beam-runners-gearpump-2.3.0-SNAPSHOT-test-sources.jar>
to <https://builds.apache.org/job/beam_PostCommit_Java_MavenInstall/ws/.repository/org/apache/beam/beam-runners-gearpump/2.3.0-SNAPSHOT/beam-runners-gearpump-2.3.0-SNAPSHOT-test-sources.jar>
[JENKINS] Archiving disabled
2017-11-03T02:36:10.154 [INFO]                                                           
             
2017-11-03T02:36:10.154 [INFO] ------------------------------------------------------------------------
2017-11-03T02:36:10.154 [INFO] Skipping Apache Beam :: SDKs :: Java :: Aggregated Javadoc
2017-11-03T02:36:10.154 [INFO] This project has been banned from the build due to previous
failures.
2017-11-03T02:36:10.154 [INFO] ------------------------------------------------------------------------
[JENKINS] Archiving disabled
[JENKINS] Archiving disabled
[JENKINS] Archiving disabled
[JENKINS] Archiving disabled
[JENKINS] Archiving disabled
[JENKINS] Archiving disabled
[JENKINS] Archiving disabled
[JENKINS] Archiving disabled
[JENKINS] Archiving disabled
[JENKINS] Archiving disabled
[JENKINS] Archiving disabled
[JENKINS] Archiving disabled
[JENKINS] Archiving disabled
[JENKINS] Archiving disabled
[JENKINS] Archiving disabled
[JENKINS] Archiving disabled
[JENKINS] Archiving disabled
[JENKINS] Archiving disabled
[JENKINS] Archiving disabled
[JENKINS] Archiving disabled
[JENKINS] Archiving disabled
[JENKINS] Archiving disabled
[JENKINS] Archiving disabled
[JENKINS] Archiving disabled
[JENKINS] Archiving disabled
[JENKINS] Archiving disabled
[JENKINS] Archiving disabled
[JENKINS] Archiving disabled
[JENKINS] Archiving disabled
[JENKINS] Archiving disabled
[JENKINS] Archiving disabled
[JENKINS] Archiving disabled
[JENKINS] Archiving disabled
[JENKINS] Archiving disabled
[JENKINS] Archiving disabled
[JENKINS] Archiving disabled
[JENKINS] Archiving disabled
[JENKINS] Archiving disabled
[JENKINS] Archiving disabled
[JENKINS] Archiving disabled
[JENKINS] Archiving disabled
[JENKINS] Archiving disabled
[JENKINS] Archiving disabled
[JENKINS] Archiving disabled
[JENKINS] Archiving disabled
[JENKINS] Archiving disabled
[JENKINS] Archiving disabled
[JENKINS] Archiving disabled
[JENKINS] Archiving disabled
[JENKINS] Archiving disabled
[JENKINS] Archiving disabled
[JENKINS] Archiving disabled
[JENKINS] Archiving disabled
[JENKINS] Archiving disabled
[JENKINS] Archiving disabled
[JENKINS] Archiving disabled
[JENKINS] Archiving disabled
[JENKINS] Archiving disabled
[JENKINS] Archiving disabled
2017-11-03T02:37:09.498 [INFO] ------------------------------------------------------------------------
2017-11-03T02:37:09.498 [INFO] Reactor Summary:
2017-11-03T02:37:09.498 [INFO] 
2017-11-03T02:37:09.498 [INFO] Apache Beam :: Parent .............................. SUCCESS
[ 15.144 s]
2017-11-03T02:37:09.498 [INFO] Apache Beam :: SDKs :: Java :: Build Tools ......... SUCCESS
[ 11.859 s]
2017-11-03T02:37:09.498 [INFO] Apache Beam :: Model ............................... SUCCESS
[  2.204 s]
2017-11-03T02:37:09.498 [INFO] Apache Beam :: Model :: Pipeline ................... SUCCESS
[ 36.995 s]
2017-11-03T02:37:09.498 [INFO] Apache Beam :: Model :: Job Management ............. SUCCESS
[ 23.405 s]
2017-11-03T02:37:09.498 [INFO] Apache Beam :: Model :: Fn Execution ............... SUCCESS
[ 25.883 s]
2017-11-03T02:37:09.498 [INFO] Apache Beam :: SDKs ................................ SUCCESS
[  3.153 s]
2017-11-03T02:37:09.498 [INFO] Apache Beam :: SDKs :: Java ........................ SUCCESS
[  3.224 s]
2017-11-03T02:37:09.498 [INFO] Apache Beam :: SDKs :: Java :: Core ................ SUCCESS
[02:53 min]
2017-11-03T02:37:09.498 [INFO] Apache Beam :: Runners ............................. SUCCESS
[  3.152 s]
2017-11-03T02:37:09.498 [INFO] Apache Beam :: Runners :: Core Construction Java ... SUCCESS
[ 32.947 s]
2017-11-03T02:37:09.498 [INFO] Apache Beam :: Runners :: Core Java ................ SUCCESS
[ 51.764 s]
2017-11-03T02:37:09.499 [INFO] Apache Beam :: Runners :: Direct Java .............. SUCCESS
[06:12 min]
2017-11-03T02:37:09.499 [INFO] Apache Beam :: SDKs :: Java :: IO :: AMQP .......... SUCCESS
[ 44.661 s]
2017-11-03T02:37:09.499 [INFO] Apache Beam :: SDKs :: Java :: IO :: Common ........ SUCCESS
[  8.793 s]
2017-11-03T02:37:09.499 [INFO] Apache Beam :: SDKs :: Java :: IO :: Cassandra ..... SUCCESS
[ 45.544 s]
2017-11-03T02:37:09.499 [INFO] Apache Beam :: SDKs :: Java :: IO :: Elasticsearch . SUCCESS
[ 23.758 s]
2017-11-03T02:37:09.499 [INFO] Apache Beam :: SDKs :: Java :: IO :: Elasticsearch-Tests SUCCESS
[  4.718 s]
2017-11-03T02:37:09.499 [INFO] Apache Beam :: SDKs :: Java :: IO :: Elasticsearch-Tests ::
Common SUCCESS [  5.282 s]
2017-11-03T02:37:09.499 [INFO] Apache Beam :: SDKs :: Java :: IO :: Elasticsearch-Tests ::
2.x SUCCESS [ 33.685 s]
2017-11-03T02:37:09.499 [INFO] Apache Beam :: SDKs :: Java :: IO :: Elasticsearch-Tests ::
5.x SUCCESS [ 43.117 s]
2017-11-03T02:37:09.499 [INFO] Apache Beam :: SDKs :: Java :: Extensions :: Google Cloud Platform
Core SUCCESS [ 46.182 s]
2017-11-03T02:37:09.499 [INFO] Apache Beam :: SDKs :: Java :: Extensions :: Protobuf SUCCESS
[ 30.758 s]
2017-11-03T02:37:09.499 [INFO] Apache Beam :: SDKs :: Java :: IO :: Google Cloud Platform
SUCCESS [02:05 min]
2017-11-03T02:37:09.499 [INFO] Apache Beam :: SDKs :: Java :: IO :: Hadoop Common . SUCCESS
[ 30.161 s]
2017-11-03T02:37:09.499 [INFO] Apache Beam :: SDKs :: Java :: IO :: Hadoop File System SUCCESS
[ 44.989 s]
2017-11-03T02:37:09.499 [INFO] Apache Beam :: SDKs :: Java :: IO :: Hadoop ........ SUCCESS
[  6.870 s]
2017-11-03T02:37:09.499 [INFO] Apache Beam :: SDKs :: Java :: IO :: Hadoop :: input-format
SUCCESS [ 28.639 s]
2017-11-03T02:37:09.499 [INFO] Apache Beam :: Runners :: Google Cloud Dataflow .... SUCCESS
[06:44 min]
2017-11-03T02:37:09.499 [INFO] Apache Beam :: SDKs :: Java :: IO :: Hadoop :: jdk1.8-tests
SUCCESS [01:38 min]
2017-11-03T02:37:09.499 [INFO] Apache Beam :: SDKs :: Java :: IO :: HBase ......... SUCCESS
[02:13 min]
2017-11-03T02:37:09.499 [INFO] Apache Beam :: SDKs :: Java :: IO :: HCatalog ...... SUCCESS
[01:21 min]
2017-11-03T02:37:09.499 [INFO] Apache Beam :: SDKs :: Java :: IO :: JDBC .......... SUCCESS
[01:00 min]
2017-11-03T02:37:09.499 [INFO] Apache Beam :: SDKs :: Java :: IO :: JMS ........... SUCCESS
[ 32.486 s]
2017-11-03T02:37:09.499 [INFO] Apache Beam :: SDKs :: Java :: IO :: Kafka ......... SUCCESS
[ 54.280 s]
2017-11-03T02:37:09.499 [INFO] Apache Beam :: SDKs :: Java :: IO :: Kinesis ....... SUCCESS
[08:45 min]
2017-11-03T02:37:09.499 [INFO] Apache Beam :: SDKs :: Java :: IO :: MongoDB ....... SUCCESS
[ 57.371 s]
2017-11-03T02:37:09.499 [INFO] Apache Beam :: SDKs :: Java :: IO :: MQTT .......... SUCCESS
[ 26.269 s]
2017-11-03T02:37:09.499 [INFO] Apache Beam :: SDKs :: Java :: IO :: Redis ......... SUCCESS
[ 25.405 s]
2017-11-03T02:37:09.499 [INFO] Apache Beam :: SDKs :: Java :: IO :: Solr .......... SUCCESS
[ 47.041 s]
2017-11-03T02:37:09.499 [INFO] Apache Beam :: SDKs :: Java :: IO :: Tika .......... SUCCESS
[ 30.243 s]
2017-11-03T02:37:09.499 [INFO] Apache Beam :: SDKs :: Java :: IO :: XML ........... SUCCESS
[ 34.390 s]
2017-11-03T02:37:09.499 [INFO] Apache Beam :: SDKs :: Java :: Maven Archetypes :: Starter
SUCCESS [ 17.732 s]
2017-11-03T02:37:09.499 [INFO] Apache Beam :: Examples :: Java .................... SUCCESS
[05:14 min]
2017-11-03T02:37:09.499 [INFO] Apache Beam :: SDKs :: Java :: Maven Archetypes :: Examples
SUCCESS [ 46.313 s]
2017-11-03T02:37:09.499 [INFO] Apache Beam :: Examples :: Java 8 .................. SUCCESS
[ 49.504 s]
2017-11-03T02:37:09.499 [INFO] Apache Beam :: SDKs :: Java :: Maven Archetypes :: Examples
- Java 8 SUCCESS [01:02 min]
2017-11-03T02:37:09.499 [INFO] Apache Beam :: SDKs :: Java :: Extensions :: Jackson SUCCESS
[ 24.688 s]
2017-11-03T02:37:09.499 [INFO] Apache Beam :: SDKs :: Java :: Extensions :: Join library SUCCESS
[ 33.683 s]
2017-11-03T02:37:09.499 [INFO] Apache Beam :: SDKs :: Java :: Extensions :: Sorter  SUCCESS
[ 39.169 s]
2017-11-03T02:37:09.499 [INFO] Apache Beam :: SDKs :: Java :: Extensions :: SQL ... SUCCESS
[01:42 min]
2017-11-03T02:37:09.500 [INFO] Apache Beam :: SDKs :: Java :: Nexmark ............. SUCCESS
[01:58 min]
2017-11-03T02:37:09.500 [INFO] Apache Beam :: SDKs :: Java :: Harness ............. FAILURE
[  0.736 s]
2017-11-03T02:37:09.500 [INFO] Apache Beam :: SDKs :: Java :: Java 8 Tests ........ SUCCESS
[ 23.612 s]
2017-11-03T02:37:09.500 [INFO] Apache Beam :: Runners :: Flink .................... SUCCESS
[ 54.302 s]
2017-11-03T02:37:09.500 [INFO] Apache Beam :: Runners :: Spark .................... SUCCESS
[02:37 min]
2017-11-03T02:37:09.500 [INFO] Apache Beam :: Runners :: Apex ..................... SUCCESS
[01:12 min]
2017-11-03T02:37:09.500 [INFO] Apache Beam :: Runners :: Gearpump ................. SUCCESS
[ 37.254 s]
2017-11-03T02:37:09.500 [INFO] Apache Beam :: SDKs :: Java :: Aggregated Javadoc .. SKIPPED
2017-11-03T02:37:09.500 [INFO] ------------------------------------------------------------------------
2017-11-03T02:37:09.500 [INFO] BUILD FAILURE
2017-11-03T02:37:09.500 [INFO] ------------------------------------------------------------------------
2017-11-03T02:37:09.500 [INFO] Total time: 01:09 h
2017-11-03T02:37:09.500 [INFO] Finished at: 2017-11-03T02:37:09+00:00
2017-11-03T02:37:10.979 [INFO] Final Memory: 354M/1647M
2017-11-03T02:37:10.979 [INFO] ------------------------------------------------------------------------
2017-11-03T02:37:10.984 [ERROR] Failed to execute goal on project beam-sdks-java-harness:
Could not resolve dependencies for project org.apache.beam:beam-sdks-java-harness:jar:2.3.0-SNAPSHOT:
The following artifacts could not be resolved: org.apache.beam:beam-sdks-java-fn-execution:jar:2.3.0-SNAPSHOT,
org.apache.beam:beam-sdks-java-fn-execution:jar:tests:2.3.0-SNAPSHOT: Could not find artifact
org.apache.beam:beam-sdks-java-fn-execution:jar:2.3.0-SNAPSHOT in Nexus (http://repository.apache.org/snapshots)
-> [Help 1]
2017-11-03T02:37:10.985 [ERROR] 
2017-11-03T02:37:10.985 [ERROR] To see the full stack trace of the errors, re-run Maven with
the -e switch.
2017-11-03T02:37:10.985 [ERROR] Re-run Maven using the -X switch to enable full debug logging.
2017-11-03T02:37:10.985 [ERROR] 
2017-11-03T02:37:10.985 [ERROR] For more information about the errors and possible solutions,
please read the following articles:
2017-11-03T02:37:10.985 [ERROR] [Help 1] http://cwiki.apache.org/confluence/display/MAVEN/DependencyResolutionException
2017-11-03T02:37:10.985 [ERROR] 
2017-11-03T02:37:10.985 [ERROR] After correcting the problems, you can resume the build with
the command
2017-11-03T02:37:10.985 [ERROR]   mvn <goals> -rf :beam-sdks-java-harness
channel stopped

Mime
View raw message