beam-commits mailing list archives

Site index · List index
Message view « Date » · « Thread »
Top « Date » · « Thread »
From Apache Jenkins Server <jenk...@builds.apache.org>
Subject Build failed in Jenkins: beam_PostCommit_Java_MavenInstall #5811
Date Tue, 30 Jan 2018 14:50:40 GMT
See <https://builds.apache.org/job/beam_PostCommit_Java_MavenInstall/5811/display/redirect?page=changes>

Changes:

[pawel.pk.kaczmarczyk] [BEAM-2469] Handling Kinesis shards splits and merges

------------------------------------------
[...truncated 1.41 MB...]
2018-01-30T14:48:56.447 [INFO] Excluding org.apache.hadoop:hadoop-auth:jar:2.7.3 from the
shaded jar.
2018-01-30T14:48:56.447 [INFO] Excluding org.apache.directory.server:apacheds-kerberos-codec:jar:2.0.0-M15
from the shaded jar.
2018-01-30T14:48:56.447 [INFO] Excluding org.apache.directory.server:apacheds-i18n:jar:2.0.0-M15
from the shaded jar.
2018-01-30T14:48:56.447 [INFO] Excluding org.apache.directory.api:api-asn1-api:jar:1.0.0-M20
from the shaded jar.
2018-01-30T14:48:56.447 [INFO] Excluding org.apache.directory.api:api-util:jar:1.0.0-M20 from
the shaded jar.
2018-01-30T14:48:56.447 [INFO] Excluding org.apache.curator:curator-client:jar:2.7.1 from
the shaded jar.
2018-01-30T14:48:56.447 [INFO] Excluding org.mortbay.jetty:jetty-util:jar:6.1.26 from the
shaded jar.
2018-01-30T14:48:56.447 [INFO] Excluding org.apache.hadoop:hadoop-mapreduce-client-app:jar:2.7.3
from the shaded jar.
2018-01-30T14:48:56.447 [INFO] Excluding org.apache.hadoop:hadoop-mapreduce-client-common:jar:2.7.3
from the shaded jar.
2018-01-30T14:48:56.447 [INFO] Excluding org.apache.hadoop:hadoop-yarn-server-common:jar:2.7.3
from the shaded jar.
2018-01-30T14:48:56.447 [INFO] Excluding org.apache.hadoop:hadoop-mapreduce-client-shuffle:jar:2.7.3
from the shaded jar.
2018-01-30T14:48:56.447 [INFO] Excluding org.apache.hadoop:hadoop-yarn-api:jar:2.7.3 from
the shaded jar.
2018-01-30T14:48:56.447 [INFO] Excluding org.apache.hadoop:hadoop-mapreduce-client-core:jar:2.7.3
from the shaded jar.
2018-01-30T14:48:56.447 [INFO] Excluding org.apache.hadoop:hadoop-mapreduce-client-jobclient:jar:2.7.3
from the shaded jar.
2018-01-30T14:48:56.447 [INFO] Excluding org.apache.hadoop:hadoop-annotations:jar:2.7.3 from
the shaded jar.
2018-01-30T14:48:56.447 [INFO] Excluding org.apache.spark:spark-launcher_2.11:jar:2.2.1 from
the shaded jar.
2018-01-30T14:48:56.447 [INFO] Excluding org.apache.spark:spark-network-common_2.11:jar:2.2.1
from the shaded jar.
2018-01-30T14:48:56.447 [INFO] Excluding org.fusesource.leveldbjni:leveldbjni-all:jar:1.8
from the shaded jar.
2018-01-30T14:48:56.447 [INFO] Excluding org.apache.spark:spark-network-shuffle_2.11:jar:2.2.1
from the shaded jar.
2018-01-30T14:48:56.447 [INFO] Excluding org.apache.spark:spark-unsafe_2.11:jar:2.2.1 from
the shaded jar.
2018-01-30T14:48:56.447 [INFO] Excluding net.java.dev.jets3t:jets3t:jar:0.9.3 from the shaded
jar.
2018-01-30T14:48:56.447 [INFO] Excluding javax.activation:activation:jar:1.1.1 from the shaded
jar.
2018-01-30T14:48:56.447 [INFO] Excluding mx4j:mx4j:jar:3.0.2 from the shaded jar.
2018-01-30T14:48:56.447 [INFO] Excluding javax.mail:mail:jar:1.4.7 from the shaded jar.
2018-01-30T14:48:56.447 [INFO] Excluding org.bouncycastle:bcprov-jdk15on:jar:1.51 from the
shaded jar.
2018-01-30T14:48:56.447 [INFO] Excluding com.jamesmurty.utils:java-xmlbuilder:jar:1.0 from
the shaded jar.
2018-01-30T14:48:56.447 [INFO] Excluding net.iharder:base64:jar:2.3.8 from the shaded jar.
2018-01-30T14:48:56.447 [INFO] Excluding org.apache.curator:curator-recipes:jar:2.6.0 from
the shaded jar.
2018-01-30T14:48:56.447 [INFO] Excluding org.apache.curator:curator-framework:jar:2.6.0 from
the shaded jar.
2018-01-30T14:48:56.447 [INFO] Excluding javax.servlet:javax.servlet-api:jar:3.1.0 from the
shaded jar.
2018-01-30T14:48:56.447 [INFO] Excluding org.apache.commons:commons-math3:jar:3.4.1 from the
shaded jar.
2018-01-30T14:48:56.447 [INFO] Excluding org.slf4j:jul-to-slf4j:jar:1.7.16 from the shaded
jar.
2018-01-30T14:48:56.447 [INFO] Excluding org.slf4j:jcl-over-slf4j:jar:1.7.16 from the shaded
jar.
2018-01-30T14:48:56.447 [INFO] Excluding log4j:log4j:jar:1.2.17 from the shaded jar.
2018-01-30T14:48:56.447 [INFO] Excluding org.slf4j:slf4j-log4j12:jar:1.7.16 from the shaded
jar.
2018-01-30T14:48:56.447 [INFO] Excluding com.ning:compress-lzf:jar:1.0.3 from the shaded jar.
2018-01-30T14:48:56.447 [INFO] Excluding net.jpountz.lz4:lz4:jar:1.3.0 from the shaded jar.
2018-01-30T14:48:56.447 [INFO] Excluding org.roaringbitmap:RoaringBitmap:jar:0.5.11 from the
shaded jar.
2018-01-30T14:48:56.447 [INFO] Excluding commons-net:commons-net:jar:2.2 from the shaded jar.
2018-01-30T14:48:56.447 [INFO] Excluding org.scala-lang:scala-library:jar:2.11.8 from the
shaded jar.
2018-01-30T14:48:56.447 [INFO] Excluding org.json4s:json4s-jackson_2.11:jar:3.2.11 from the
shaded jar.
2018-01-30T14:48:56.447 [INFO] Excluding org.json4s:json4s-core_2.11:jar:3.2.11 from the shaded
jar.
2018-01-30T14:48:56.447 [INFO] Excluding org.json4s:json4s-ast_2.11:jar:3.2.11 from the shaded
jar.
2018-01-30T14:48:56.447 [INFO] Excluding org.scala-lang:scalap:jar:2.11.0 from the shaded
jar.
2018-01-30T14:48:56.447 [INFO] Excluding org.scala-lang:scala-compiler:jar:2.11.0 from the
shaded jar.
2018-01-30T14:48:56.447 [INFO] Excluding org.scala-lang.modules:scala-xml_2.11:jar:1.0.1 from
the shaded jar.
2018-01-30T14:48:56.447 [INFO] Excluding org.glassfish.jersey.core:jersey-client:jar:2.22.2
from the shaded jar.
2018-01-30T14:48:56.447 [INFO] Excluding javax.ws.rs:javax.ws.rs-api:jar:2.0.1 from the shaded
jar.
2018-01-30T14:48:56.447 [INFO] Excluding org.glassfish.hk2:hk2-api:jar:2.4.0-b34 from the
shaded jar.
2018-01-30T14:48:56.447 [INFO] Excluding org.glassfish.hk2:hk2-utils:jar:2.4.0-b34 from the
shaded jar.
2018-01-30T14:48:56.447 [INFO] Excluding org.glassfish.hk2.external:aopalliance-repackaged:jar:2.4.0-b34
from the shaded jar.
2018-01-30T14:48:56.447 [INFO] Excluding org.glassfish.hk2.external:javax.inject:jar:2.4.0-b34
from the shaded jar.
2018-01-30T14:48:56.447 [INFO] Excluding org.glassfish.hk2:hk2-locator:jar:2.4.0-b34 from
the shaded jar.
2018-01-30T14:48:56.447 [INFO] Excluding org.glassfish.jersey.core:jersey-common:jar:2.22.2
from the shaded jar.
2018-01-30T14:48:56.447 [INFO] Excluding javax.annotation:javax.annotation-api:jar:1.2 from
the shaded jar.
2018-01-30T14:48:56.447 [INFO] Excluding org.glassfish.jersey.bundles.repackaged:jersey-guava:jar:2.22.2
from the shaded jar.
2018-01-30T14:48:56.447 [INFO] Excluding org.glassfish.hk2:osgi-resource-locator:jar:1.0.1
from the shaded jar.
2018-01-30T14:48:56.447 [INFO] Excluding org.glassfish.jersey.core:jersey-server:jar:2.22.2
from the shaded jar.
2018-01-30T14:48:56.447 [INFO] Excluding org.glassfish.jersey.media:jersey-media-jaxb:jar:2.22.2
from the shaded jar.
2018-01-30T14:48:56.447 [INFO] Excluding org.glassfish.jersey.containers:jersey-container-servlet:jar:2.22.2
from the shaded jar.
2018-01-30T14:48:56.447 [INFO] Excluding org.glassfish.jersey.containers:jersey-container-servlet-core:jar:2.22.2
from the shaded jar.
2018-01-30T14:48:56.447 [INFO] Excluding io.netty:netty-all:jar:4.0.43.Final from the shaded
jar.
2018-01-30T14:48:56.447 [INFO] Excluding io.netty:netty:jar:3.9.9.Final from the shaded jar.
2018-01-30T14:48:56.447 [INFO] Excluding io.dropwizard.metrics:metrics-jvm:jar:3.1.2 from
the shaded jar.
2018-01-30T14:48:56.447 [INFO] Excluding io.dropwizard.metrics:metrics-json:jar:3.1.2 from
the shaded jar.
2018-01-30T14:48:56.447 [INFO] Excluding io.dropwizard.metrics:metrics-graphite:jar:3.1.2
from the shaded jar.
2018-01-30T14:48:56.447 [INFO] Excluding org.apache.ivy:ivy:jar:2.4.0 from the shaded jar.
2018-01-30T14:48:56.447 [INFO] Excluding oro:oro:jar:2.0.8 from the shaded jar.
2018-01-30T14:48:56.447 [INFO] Excluding net.razorvine:pyrolite:jar:4.13 from the shaded jar.
2018-01-30T14:48:56.447 [INFO] Excluding net.sf.py4j:py4j:jar:0.10.4 from the shaded jar.
2018-01-30T14:48:56.447 [INFO] Excluding org.apache.spark:spark-tags_2.11:jar:2.2.1 from the
shaded jar.
2018-01-30T14:48:56.447 [INFO] Excluding org.apache.commons:commons-crypto:jar:1.0.0 from
the shaded jar.
2018-01-30T14:48:56.447 [INFO] Excluding org.spark-project.spark:unused:jar:1.0.0 from the
shaded jar.
2018-01-30T14:48:56.447 [INFO] Excluding org.apache.spark:spark-streaming_2.11:jar:2.2.1 from
the shaded jar.
2018-01-30T14:48:58.791 [INFO] Replacing original artifact with shaded artifact.
2018-01-30T14:48:58.900 [INFO] 
2018-01-30T14:48:58.900 [INFO] --- maven-assembly-plugin:3.1.0:single (source-release-assembly)
@ beam-sdks-java-javadoc ---
2018-01-30T14:48:58.903 [INFO] Skipping the assembly in this project because it's not the
Execution Root
2018-01-30T14:48:59.822 [INFO] 
2018-01-30T14:48:59.823 [INFO] --- maven-source-plugin:3.0.1:jar-no-fork (attach-sources)
@ beam-sdks-java-javadoc ---
2018-01-30T14:48:59.966 [INFO] 
2018-01-30T14:48:59.966 [INFO] --- maven-source-plugin:3.0.1:test-jar-no-fork (attach-test-sources)
@ beam-sdks-java-javadoc ---
2018-01-30T14:49:00.074 [INFO] 
2018-01-30T14:49:00.074 [INFO] --- maven-javadoc-plugin:3.0.0-M1:jar (attach-javadocs) @ beam-sdks-java-javadoc
---
2018-01-30T14:49:00.076 [INFO] Not executing Javadoc as the project is not a Java classpath-capable
package
2018-01-30T14:49:00.188 [INFO] 
2018-01-30T14:49:00.188 [INFO] --- reproducible-build-maven-plugin:0.4:strip-jar (default)
@ beam-sdks-java-javadoc ---
2018-01-30T14:49:00.188 [INFO] Stripping <https://builds.apache.org/job/beam_PostCommit_Java_MavenInstall/ws/src/sdks/java/javadoc/target/javadoc.jar>
2018-01-30T14:49:00.368 [INFO] 
2018-01-30T14:49:00.369 [INFO] --- maven-dependency-plugin:3.0.2:analyze-only (default) @
beam-sdks-java-javadoc ---
2018-01-30T14:49:00.370 [INFO] Skipping plugin execution
2018-01-30T14:49:00.477 [INFO] 
2018-01-30T14:49:00.477 [INFO] --- maven-install-plugin:2.5.2:install (default-install) @
beam-sdks-java-javadoc ---
2018-01-30T14:49:00.478 [INFO] Installing <https://builds.apache.org/job/beam_PostCommit_Java_MavenInstall/ws/src/sdks/java/javadoc/pom.xml>
to <https://builds.apache.org/job/beam_PostCommit_Java_MavenInstall/ws/.repository/org/apache/beam/beam-sdks-java-javadoc/2.4.0-SNAPSHOT/beam-sdks-java-javadoc-2.4.0-SNAPSHOT.pom>
2018-01-30T14:49:00.480 [INFO] Installing <https://builds.apache.org/job/beam_PostCommit_Java_MavenInstall/ws/src/sdks/java/javadoc/target/javadoc.jar>
to <https://builds.apache.org/job/beam_PostCommit_Java_MavenInstall/ws/.repository/org/apache/beam/beam-sdks-java-javadoc/2.4.0-SNAPSHOT/beam-sdks-java-javadoc-2.4.0-SNAPSHOT.jar>
[JENKINS] Archiving disabled
[JENKINS] Archiving disabled
[JENKINS] Archiving disabled
[JENKINS] Archiving disabled
[JENKINS] Archiving disabled
[JENKINS] Archiving disabled
[JENKINS] Archiving disabled
[JENKINS] Archiving disabled
[JENKINS] Archiving disabled
[JENKINS] Archiving disabled
[JENKINS] Archiving disabled
[JENKINS] Archiving disabled
[JENKINS] Archiving disabled
[JENKINS] Archiving disabled
[JENKINS] Archiving disabled
[JENKINS] Archiving disabled
[JENKINS] Archiving disabled
[JENKINS] Archiving disabled
[JENKINS] Archiving disabled
[JENKINS] Archiving disabled
[JENKINS] Archiving disabled
[JENKINS] Archiving disabled
[JENKINS] Archiving disabled
[JENKINS] Archiving disabled
[JENKINS] Archiving disabled
[JENKINS] Archiving disabled
[JENKINS] Archiving disabled
[JENKINS] Archiving disabled
[JENKINS] Archiving disabled
[JENKINS] Archiving disabled
[JENKINS] Archiving disabled
[JENKINS] Archiving disabled
[JENKINS] Archiving disabled
[JENKINS] Archiving disabled
[JENKINS] Archiving disabled
[JENKINS] Archiving disabled
[JENKINS] Archiving disabled
[JENKINS] Archiving disabled
[JENKINS] Archiving disabled
[JENKINS] Archiving disabled
[JENKINS] Archiving disabled
[JENKINS] Archiving disabled
[JENKINS] Archiving disabled
[JENKINS] Archiving disabled
[JENKINS] Archiving disabled
[JENKINS] Archiving disabled
[JENKINS] Archiving disabled
[JENKINS] Archiving disabled
[JENKINS] Archiving disabled
[JENKINS] Archiving disabled
[JENKINS] Archiving disabled
[JENKINS] Archiving disabled
[JENKINS] Archiving disabled
[JENKINS] Archiving disabled
[JENKINS] Archiving disabled
[JENKINS] Archiving disabled
[JENKINS] Archiving disabled
[JENKINS] Archiving disabled
[JENKINS] Archiving disabled
[JENKINS] Archiving disabled
[JENKINS] Archiving disabled
[JENKINS] Archiving disabled
[JENKINS] Archiving disabled
[JENKINS] Archiving disabled
[JENKINS] Archiving disabled
2018-01-30T14:50:21.238 [INFO] ------------------------------------------------------------------------
2018-01-30T14:50:21.238 [INFO] Reactor Summary:
2018-01-30T14:50:21.238 [INFO] 
2018-01-30T14:50:21.238 [INFO] Apache Beam :: Parent .............................. SUCCESS
[ 15.015 s]
2018-01-30T14:50:21.238 [INFO] Apache Beam :: SDKs :: Java :: Build Tools ......... SUCCESS
[  9.391 s]
2018-01-30T14:50:21.238 [INFO] Apache Beam :: Model ............................... SUCCESS
[  5.630 s]
2018-01-30T14:50:21.238 [INFO] Apache Beam :: Model :: Pipeline ................... SUCCESS
[ 20.343 s]
2018-01-30T14:50:21.238 [INFO] Apache Beam :: Model :: Job Management ............. SUCCESS
[ 14.649 s]
2018-01-30T14:50:21.238 [INFO] Apache Beam :: Model :: Fn Execution ............... SUCCESS
[ 20.842 s]
2018-01-30T14:50:21.239 [INFO] Apache Beam :: SDKs ................................ SUCCESS
[  5.356 s]
2018-01-30T14:50:21.239 [INFO] Apache Beam :: SDKs :: Java ........................ SUCCESS
[  6.717 s]
2018-01-30T14:50:21.239 [INFO] Apache Beam :: SDKs :: Java :: Core ................ SUCCESS
[03:17 min]
2018-01-30T14:50:21.239 [INFO] Apache Beam :: SDKs :: Java :: Fn Execution ........ SUCCESS
[ 31.185 s]
2018-01-30T14:50:21.239 [INFO] Apache Beam :: SDKs :: Java :: Extensions :: Google Cloud Platform
Core SUCCESS [ 27.449 s]
2018-01-30T14:50:21.239 [INFO] Apache Beam :: Runners ............................. SUCCESS
[  6.463 s]
2018-01-30T14:50:21.239 [INFO] Apache Beam :: Runners :: Core Construction Java ... SUCCESS
[01:07 min]
2018-01-30T14:50:21.239 [INFO] Apache Beam :: Runners :: Core Java ................ SUCCESS
[ 44.833 s]
2018-01-30T14:50:21.239 [INFO] Apache Beam :: SDKs :: Java :: Harness ............. SUCCESS
[ 42.998 s]
2018-01-30T14:50:21.239 [INFO] Apache Beam :: SDKs :: Java :: IO :: Amazon Web Services SUCCESS
[ 22.188 s]
2018-01-30T14:50:21.239 [INFO] Apache Beam :: Runners :: Local Java Core .......... SUCCESS
[ 15.899 s]
2018-01-30T14:50:21.239 [INFO] Apache Beam :: Runners :: Direct Java .............. SUCCESS
[04:41 min]
2018-01-30T14:50:21.239 [INFO] Apache Beam :: SDKs :: Java :: IO :: AMQP .......... SUCCESS
[ 25.339 s]
2018-01-30T14:50:21.239 [INFO] Apache Beam :: SDKs :: Java :: IO :: Common ........ SUCCESS
[  8.910 s]
2018-01-30T14:50:21.239 [INFO] Apache Beam :: SDKs :: Java :: IO :: Cassandra ..... SUCCESS
[ 26.443 s]
2018-01-30T14:50:21.239 [INFO] Apache Beam :: SDKs :: Java :: IO :: Elasticsearch . SUCCESS
[ 14.512 s]
2018-01-30T14:50:21.239 [INFO] Apache Beam :: SDKs :: Java :: IO :: Elasticsearch-Tests SUCCESS
[  7.014 s]
2018-01-30T14:50:21.239 [INFO] Apache Beam :: SDKs :: Java :: IO :: Elasticsearch-Tests ::
Common SUCCESS [  7.019 s]
2018-01-30T14:50:21.239 [INFO] Apache Beam :: SDKs :: Java :: IO :: Elasticsearch-Tests ::
2.x SUCCESS [ 23.956 s]
2018-01-30T14:50:21.239 [INFO] Apache Beam :: SDKs :: Java :: IO :: Elasticsearch-Tests ::
5.x SUCCESS [ 26.466 s]
2018-01-30T14:50:21.239 [INFO] Apache Beam :: SDKs :: Java :: Extensions :: Protobuf SUCCESS
[ 20.918 s]
2018-01-30T14:50:21.239 [INFO] Apache Beam :: SDKs :: Java :: IO :: Google Cloud Platform
SUCCESS [01:45 min]
2018-01-30T14:50:21.239 [INFO] Apache Beam :: Runners :: Google Cloud Dataflow .... SUCCESS
[07:14 min]
2018-01-30T14:50:21.239 [INFO] Apache Beam :: SDKs :: Java :: IO :: File-based-io-tests SUCCESS
[ 10.059 s]
2018-01-30T14:50:21.239 [INFO] Apache Beam :: SDKs :: Java :: IO :: Hadoop Common . SUCCESS
[ 22.886 s]
2018-01-30T14:50:21.239 [INFO] Apache Beam :: SDKs :: Java :: IO :: Hadoop File System SUCCESS
[ 37.666 s]
2018-01-30T14:50:21.239 [INFO] Apache Beam :: SDKs :: Java :: IO :: JDBC .......... SUCCESS
[ 38.991 s]
2018-01-30T14:50:21.239 [INFO] Apache Beam :: SDKs :: Java :: IO :: Hadoop Input Format SUCCESS
[01:04 min]
2018-01-30T14:50:21.239 [INFO] Apache Beam :: SDKs :: Java :: IO :: HBase ......... SUCCESS
[01:32 min]
2018-01-30T14:50:21.239 [INFO] Apache Beam :: SDKs :: Java :: IO :: HCatalog ...... SUCCESS
[01:04 min]
2018-01-30T14:50:21.239 [INFO] Apache Beam :: SDKs :: Java :: IO :: JMS ........... SUCCESS
[ 29.907 s]
2018-01-30T14:50:21.239 [INFO] Apache Beam :: SDKs :: Java :: IO :: Kafka ......... SUCCESS
[ 46.025 s]
2018-01-30T14:50:21.239 [INFO] Apache Beam :: SDKs :: Java :: IO :: Kinesis ....... SUCCESS
[01:11 min]
2018-01-30T14:50:21.239 [INFO] Apache Beam :: SDKs :: Java :: IO :: MongoDB ....... SUCCESS
[ 41.483 s]
2018-01-30T14:50:21.239 [INFO] Apache Beam :: SDKs :: Java :: IO :: MQTT .......... SUCCESS
[ 28.071 s]
2018-01-30T14:50:21.239 [INFO] Apache Beam :: SDKs :: Java :: IO :: Redis ......... SUCCESS
[ 19.513 s]
2018-01-30T14:50:21.239 [INFO] Apache Beam :: SDKs :: Java :: IO :: Solr .......... SUCCESS
[ 33.425 s]
2018-01-30T14:50:21.239 [INFO] Apache Beam :: SDKs :: Java :: IO :: Tika .......... SUCCESS
[ 22.284 s]
2018-01-30T14:50:21.239 [INFO] Apache Beam :: SDKs :: Java :: IO :: XML ........... SUCCESS
[ 29.377 s]
2018-01-30T14:50:21.239 [INFO] Apache Beam :: SDKs :: Java :: Java 8 Tests ........ SUCCESS
[ 18.792 s]
2018-01-30T14:50:21.239 [INFO] Apache Beam :: SDKs :: Java :: Maven Archetypes :: Starter
SUCCESS [ 13.398 s]
2018-01-30T14:50:21.239 [INFO] Apache Beam :: Examples :: Java .................... SUCCESS
[04:57 min]
2018-01-30T14:50:21.239 [INFO] Apache Beam :: SDKs :: Java :: Maven Archetypes :: Examples
FAILURE [ 11.387 s]
2018-01-30T14:50:21.239 [INFO] Apache Beam :: SDKs :: Java :: Extensions :: Jackson SUCCESS
[ 20.669 s]
2018-01-30T14:50:21.239 [INFO] Apache Beam :: SDKs :: Java :: Extensions :: Join library SUCCESS
[ 23.388 s]
2018-01-30T14:50:21.239 [INFO] Apache Beam :: SDKs :: Java :: Extensions :: Sketching SUCCESS
[ 27.082 s]
2018-01-30T14:50:21.239 [INFO] Apache Beam :: SDKs :: Java :: Extensions :: Sorter  SUCCESS
[ 36.951 s]
2018-01-30T14:50:21.239 [INFO] Apache Beam :: SDKs :: Java :: Extensions :: SQL ... SUCCESS
[01:20 min]
2018-01-30T14:50:21.239 [INFO] Apache Beam :: SDKs :: Java :: Nexmark ............. SUCCESS
[01:33 min]
2018-01-30T14:50:21.239 [INFO] Apache Beam :: Runners :: Java Fn Execution ........ SUCCESS
[ 20.495 s]
2018-01-30T14:50:21.239 [INFO] Apache Beam :: Runners :: Java Local Artifact Service SUCCESS
[ 16.832 s]
2018-01-30T14:50:21.240 [INFO] Apache Beam :: Runners :: Reference :: Java ........ SUCCESS
[ 15.205 s]
2018-01-30T14:50:21.240 [INFO] Apache Beam :: Runners :: Reference :: Job Orchestrator SUCCESS
[ 17.017 s]
2018-01-30T14:50:21.240 [INFO] Apache Beam :: Runners :: Flink .................... SUCCESS
[ 41.520 s]
2018-01-30T14:50:21.240 [INFO] Apache Beam :: Runners :: Gearpump ................. SUCCESS
[ 29.952 s]
2018-01-30T14:50:21.240 [INFO] Apache Beam :: Runners :: Spark .................... SUCCESS
[01:37 min]
2018-01-30T14:50:21.240 [INFO] Apache Beam :: Runners :: Apex ..................... SUCCESS
[01:03 min]
2018-01-30T14:50:21.240 [INFO] Apache Beam :: SDKs :: Java :: Aggregated Javadoc .. SUCCESS
[ 31.932 s]
2018-01-30T14:50:21.240 [INFO] ------------------------------------------------------------------------
2018-01-30T14:50:21.240 [INFO] BUILD FAILURE
2018-01-30T14:50:21.240 [INFO] ------------------------------------------------------------------------
2018-01-30T14:50:21.240 [INFO] Total time: 56:55 min
2018-01-30T14:50:21.240 [INFO] Finished at: 2018-01-30T14:50:21Z
2018-01-30T14:50:22.209 [INFO] Final Memory: 421M/1770M
2018-01-30T14:50:22.209 [INFO] ------------------------------------------------------------------------
2018-01-30T14:50:22.214 [ERROR] Failed to execute goal org.apache.maven.plugins:maven-archetype-plugin:2.4:integration-test
(default-integration-test) on project beam-sdks-java-maven-archetypes-examples:
2018-01-30T14:50:22.214 [ERROR] Archetype IT 'basic' failed: Execution failure: exit code
= 1
2018-01-30T14:50:22.214 [ERROR] -> [Help 1]
2018-01-30T14:50:22.214 [ERROR] 
2018-01-30T14:50:22.214 [ERROR] To see the full stack trace of the errors, re-run Maven with
the -e switch.
2018-01-30T14:50:22.214 [ERROR] Re-run Maven using the -X switch to enable full debug logging.
2018-01-30T14:50:22.214 [ERROR] 
2018-01-30T14:50:22.214 [ERROR] For more information about the errors and possible solutions,
please read the following articles:
2018-01-30T14:50:22.214 [ERROR] [Help 1] http://cwiki.apache.org/confluence/display/MAVEN/MojoExecutionException
2018-01-30T14:50:22.214 [ERROR] 
2018-01-30T14:50:22.214 [ERROR] After correcting the problems, you can resume the build with
the command
2018-01-30T14:50:22.214 [ERROR]   mvn <goals> -rf :beam-sdks-java-maven-archetypes-examples
channel stopped
Not sending mail to unregistered user joey.baruch@gmail.com
Not sending mail to unregistered user pawel.pk.kaczmarczyk@gmail.com

Mime
View raw message