beam-commits mailing list archives

Site index · List index
Message view « Date » · « Thread »
Top « Date » · « Thread »
From Apache Jenkins Server <jenk...@builds.apache.org>
Subject Build failed in Jenkins: beam_PostCommit_Java_MavenInstall #5821
Date Wed, 31 Jan 2018 13:05:37 GMT
See <https://builds.apache.org/job/beam_PostCommit_Java_MavenInstall/5821/display/redirect>

------------------------------------------
[...truncated 1.28 MB...]
2018-01-31T13:04:12.403 [INFO] Excluding javax.inject:javax.inject:jar:1 from the shaded jar.
2018-01-31T13:04:12.403 [INFO] Excluding aopalliance:aopalliance:jar:1.0 from the shaded jar.
2018-01-31T13:04:12.403 [INFO] Excluding com.sun.jersey:jersey-server:jar:1.9 from the shaded
jar.
2018-01-31T13:04:12.403 [INFO] Excluding asm:asm:jar:3.1 from the shaded jar.
2018-01-31T13:04:12.403 [INFO] Excluding com.sun.jersey.contribs:jersey-guice:jar:1.9 from
the shaded jar.
2018-01-31T13:04:12.403 [INFO] Excluding jline:jline:jar:2.11 from the shaded jar.
2018-01-31T13:04:12.403 [INFO] Excluding org.apache.ant:ant:jar:1.9.2 from the shaded jar.
2018-01-31T13:04:12.403 [INFO] Excluding org.apache.ant:ant-launcher:jar:1.9.2 from the shaded
jar.
2018-01-31T13:04:12.403 [INFO] Excluding net.engio:mbassador:jar:1.1.9 from the shaded jar.
2018-01-31T13:04:12.403 [INFO] Excluding net.lingala.zip4j:zip4j:jar:1.3.2 from the shaded
jar.
2018-01-31T13:04:12.403 [INFO] Excluding commons-codec:commons-codec:jar:1.10 from the shaded
jar.
2018-01-31T13:04:12.403 [INFO] Excluding org.apache.xbean:xbean-asm5-shaded:jar:4.3 from the
shaded jar.
2018-01-31T13:04:12.403 [INFO] Excluding org.jctools:jctools-core:jar:1.1 from the shaded
jar.
2018-01-31T13:04:12.403 [INFO] Excluding org.apache.beam:beam-model-pipeline:jar:2.4.0-SNAPSHOT
from the shaded jar.
2018-01-31T13:04:12.403 [INFO] Excluding com.google.protobuf:protobuf-java:jar:3.2.0 from
the shaded jar.
2018-01-31T13:04:12.403 [INFO] Excluding org.apache.beam:beam-sdks-java-core:jar:2.4.0-SNAPSHOT
from the shaded jar.
2018-01-31T13:04:12.403 [INFO] Including com.google.guava:guava:jar:20.0 in the shaded jar.
2018-01-31T13:04:12.403 [INFO] Excluding com.github.stephenc.findbugs:findbugs-annotations:jar:1.3.9-1
from the shaded jar.
2018-01-31T13:04:12.403 [INFO] Excluding com.fasterxml.jackson.core:jackson-core:jar:2.8.9
from the shaded jar.
2018-01-31T13:04:12.403 [INFO] Excluding com.fasterxml.jackson.core:jackson-annotations:jar:2.8.9
from the shaded jar.
2018-01-31T13:04:12.403 [INFO] Excluding com.fasterxml.jackson.core:jackson-databind:jar:2.8.9
from the shaded jar.
2018-01-31T13:04:12.403 [INFO] Excluding net.bytebuddy:byte-buddy:jar:1.6.8 from the shaded
jar.
2018-01-31T13:04:12.403 [INFO] Excluding org.apache.avro:avro:jar:1.8.2 from the shaded jar.
2018-01-31T13:04:12.403 [INFO] Excluding com.thoughtworks.paranamer:paranamer:jar:2.7 from
the shaded jar.
2018-01-31T13:04:12.403 [INFO] Excluding org.tukaani:xz:jar:1.5 from the shaded jar.
2018-01-31T13:04:12.403 [INFO] Excluding org.xerial.snappy:snappy-java:jar:1.1.4 from the
shaded jar.
2018-01-31T13:04:12.403 [INFO] Excluding org.apache.commons:commons-compress:jar:1.14 from
the shaded jar.
2018-01-31T13:04:12.403 [INFO] Excluding org.apache.beam:beam-runners-core-construction-java:jar:2.4.0-SNAPSHOT
from the shaded jar.
2018-01-31T13:04:12.403 [INFO] Excluding org.apache.beam:beam-model-job-management:jar:2.4.0-SNAPSHOT
from the shaded jar.
2018-01-31T13:04:12.403 [INFO] Excluding com.google.protobuf:protobuf-java-util:jar:3.2.0
from the shaded jar.
2018-01-31T13:04:12.403 [INFO] Excluding com.google.code.gson:gson:jar:2.7 from the shaded
jar.
2018-01-31T13:04:12.403 [INFO] Excluding io.grpc:grpc-core:jar:1.2.0 from the shaded jar.
2018-01-31T13:04:12.403 [INFO] Excluding com.google.errorprone:error_prone_annotations:jar:2.0.15
from the shaded jar.
2018-01-31T13:04:12.403 [INFO] Excluding io.grpc:grpc-context:jar:1.2.0 from the shaded jar.
2018-01-31T13:04:12.403 [INFO] Excluding com.google.instrumentation:instrumentation-api:jar:0.3.0
from the shaded jar.
2018-01-31T13:04:12.403 [INFO] Excluding io.grpc:grpc-stub:jar:1.2.0 from the shaded jar.
2018-01-31T13:04:12.403 [INFO] Excluding org.apache.beam:beam-runners-core-java:jar:2.4.0-SNAPSHOT
from the shaded jar.
2018-01-31T13:04:12.403 [INFO] Excluding org.apache.commons:commons-lang3:jar:3.6 from the
shaded jar.
2018-01-31T13:04:12.403 [INFO] Excluding com.google.code.findbugs:jsr305:jar:3.0.1 from the
shaded jar.
2018-01-31T13:04:12.403 [INFO] Excluding com.google.auto.service:auto-service:jar:1.0-rc2
from the shaded jar.
2018-01-31T13:04:12.403 [INFO] Excluding com.google.auto:auto-common:jar:0.3 from the shaded
jar.
2018-01-31T13:04:12.403 [INFO] Excluding io.grpc:grpc-protobuf:jar:1.2.0 from the shaded jar.
2018-01-31T13:04:12.403 [INFO] Excluding io.grpc:grpc-protobuf-lite:jar:1.2.0 from the shaded
jar.
2018-01-31T13:04:14.271 [INFO] Replacing original artifact with shaded artifact.
2018-01-31T13:04:14.271 [INFO] Replacing <https://builds.apache.org/job/beam_PostCommit_Java_MavenInstall/ws/src/runners/apex/target/beam-runners-apex-2.4.0-SNAPSHOT.jar>
with <https://builds.apache.org/job/beam_PostCommit_Java_MavenInstall/ws/src/runners/apex/target/beam-runners-apex-2.4.0-SNAPSHOT-shaded.jar>
2018-01-31T13:04:14.271 [INFO] Replacing original test artifact with shaded test artifact.
2018-01-31T13:04:14.271 [INFO] Replacing <https://builds.apache.org/job/beam_PostCommit_Java_MavenInstall/ws/src/runners/apex/target/beam-runners-apex-2.4.0-SNAPSHOT-tests.jar>
with <https://builds.apache.org/job/beam_PostCommit_Java_MavenInstall/ws/src/runners/apex/target/beam-runners-apex-2.4.0-SNAPSHOT-shaded-tests.jar>
2018-01-31T13:04:14.478 [INFO] 
2018-01-31T13:04:14.478 [INFO] --- maven-assembly-plugin:3.1.0:single (source-release-assembly)
@ beam-runners-apex ---
2018-01-31T13:04:14.481 [INFO] Skipping the assembly in this project because it's not the
Execution Root
2018-01-31T13:04:14.588 [INFO] 
2018-01-31T13:04:14.588 [INFO] --- maven-source-plugin:3.0.1:jar-no-fork (attach-sources)
@ beam-runners-apex ---
2018-01-31T13:04:14.592 [INFO] Building jar: <https://builds.apache.org/job/beam_PostCommit_Java_MavenInstall/ws/src/runners/apex/target/beam-runners-apex-2.4.0-SNAPSHOT-sources.jar>
2018-01-31T13:04:14.711 [INFO] 
2018-01-31T13:04:14.712 [INFO] --- maven-source-plugin:3.0.1:test-jar-no-fork (attach-test-sources)
@ beam-runners-apex ---
2018-01-31T13:04:14.715 [INFO] Building jar: <https://builds.apache.org/job/beam_PostCommit_Java_MavenInstall/ws/src/runners/apex/target/beam-runners-apex-2.4.0-SNAPSHOT-test-sources.jar>
2018-01-31T13:04:14.832 [INFO] 
2018-01-31T13:04:14.832 [INFO] --- maven-javadoc-plugin:3.0.0-M1:jar (attach-javadocs) @ beam-runners-apex
---
2018-01-31T13:04:16.932 [INFO] 
2 warnings
2018-01-31T13:04:16.932 [WARNING] Javadoc Warnings
2018-01-31T13:04:16.932 [WARNING] <https://builds.apache.org/job/beam_PostCommit_Java_MavenInstall/ws/src/runners/apex/src/main/java/org/apache/beam/runners/apex/translation/utils/StateInternalsProxy.java>:33:
warning: no description for @param
2018-01-31T13:04:16.932 [WARNING] * @param <K>
2018-01-31T13:04:16.932 [WARNING] ^
2018-01-31T13:04:16.932 [WARNING] <https://builds.apache.org/job/beam_PostCommit_Java_MavenInstall/ws/src/runners/apex/src/main/java/org/apache/beam/runners/apex/translation/operators/ApexTimerInternals.java>:48:
warning: no description for @param
2018-01-31T13:04:16.932 [WARNING] * @param <K>
2018-01-31T13:04:16.932 [WARNING] ^
2018-01-31T13:04:16.940 [INFO] Building jar: <https://builds.apache.org/job/beam_PostCommit_Java_MavenInstall/ws/src/runners/apex/target/beam-runners-apex-2.4.0-SNAPSHOT-javadoc.jar>
2018-01-31T13:04:17.141 [INFO] 
2018-01-31T13:04:17.141 [INFO] --- reproducible-build-maven-plugin:0.4:strip-jar (default)
@ beam-runners-apex ---
2018-01-31T13:04:17.142 [INFO] Stripping <https://builds.apache.org/job/beam_PostCommit_Java_MavenInstall/ws/src/runners/apex/target/beam-runners-apex-2.4.0-SNAPSHOT-test-sources.jar>
2018-01-31T13:04:17.146 [INFO] Stripping <https://builds.apache.org/job/beam_PostCommit_Java_MavenInstall/ws/src/runners/apex/target/original-beam-runners-apex-2.4.0-SNAPSHOT-tests.jar>
2018-01-31T13:04:17.151 [INFO] Stripping <https://builds.apache.org/job/beam_PostCommit_Java_MavenInstall/ws/src/runners/apex/target/original-beam-runners-apex-2.4.0-SNAPSHOT.jar>
2018-01-31T13:04:17.158 [INFO] Stripping <https://builds.apache.org/job/beam_PostCommit_Java_MavenInstall/ws/src/runners/apex/target/beam-runners-apex-2.4.0-SNAPSHOT-javadoc.jar>
2018-01-31T13:04:17.162 [INFO] Stripping <https://builds.apache.org/job/beam_PostCommit_Java_MavenInstall/ws/src/runners/apex/target/beam-runners-apex-2.4.0-SNAPSHOT-sources.jar>
2018-01-31T13:04:17.165 [INFO] Stripping <https://builds.apache.org/job/beam_PostCommit_Java_MavenInstall/ws/src/runners/apex/target/beam-runners-apex-2.4.0-SNAPSHOT.jar>
2018-01-31T13:04:17.257 [INFO] Stripping <https://builds.apache.org/job/beam_PostCommit_Java_MavenInstall/ws/src/runners/apex/target/beam-runners-apex-2.4.0-SNAPSHOT-tests.jar>
2018-01-31T13:04:17.367 [INFO] 
2018-01-31T13:04:17.368 [INFO] --- maven-surefire-plugin:2.20.1:test (validates-runner-tests)
@ beam-runners-apex ---
2018-01-31T13:04:17.372 [INFO] Tests are skipped.
2018-01-31T13:04:17.479 [INFO] 
2018-01-31T13:04:17.479 [INFO] --- maven-dependency-plugin:3.0.2:analyze-only (default) @
beam-runners-apex ---
2018-01-31T13:04:17.610 [INFO] No dependency problems found
2018-01-31T13:04:17.717 [INFO] 
2018-01-31T13:04:17.717 [INFO] --- maven-install-plugin:2.5.2:install (default-install) @
beam-runners-apex ---
2018-01-31T13:04:17.719 [INFO] Installing <https://builds.apache.org/job/beam_PostCommit_Java_MavenInstall/ws/src/runners/apex/target/beam-runners-apex-2.4.0-SNAPSHOT.jar>
to <https://builds.apache.org/job/beam_PostCommit_Java_MavenInstall/ws/.repository/org/apache/beam/beam-runners-apex/2.4.0-SNAPSHOT/beam-runners-apex-2.4.0-SNAPSHOT.jar>
2018-01-31T13:04:17.746 [INFO] Installing <https://builds.apache.org/job/beam_PostCommit_Java_MavenInstall/ws/src/runners/apex/pom.xml>
to <https://builds.apache.org/job/beam_PostCommit_Java_MavenInstall/ws/.repository/org/apache/beam/beam-runners-apex/2.4.0-SNAPSHOT/beam-runners-apex-2.4.0-SNAPSHOT.pom>
2018-01-31T13:04:17.766 [INFO] Installing <https://builds.apache.org/job/beam_PostCommit_Java_MavenInstall/ws/src/runners/apex/target/beam-runners-apex-2.4.0-SNAPSHOT-tests.jar>
to <https://builds.apache.org/job/beam_PostCommit_Java_MavenInstall/ws/.repository/org/apache/beam/beam-runners-apex/2.4.0-SNAPSHOT/beam-runners-apex-2.4.0-SNAPSHOT-tests.jar>
2018-01-31T13:04:17.767 [INFO] Installing <https://builds.apache.org/job/beam_PostCommit_Java_MavenInstall/ws/src/runners/apex/target/beam-runners-apex-2.4.0-SNAPSHOT-tests.jar>
to <https://builds.apache.org/job/beam_PostCommit_Java_MavenInstall/ws/.repository/org/apache/beam/beam-runners-apex/2.4.0-SNAPSHOT/beam-runners-apex-2.4.0-SNAPSHOT-tests.jar>
2018-01-31T13:04:17.768 [INFO] Installing <https://builds.apache.org/job/beam_PostCommit_Java_MavenInstall/ws/src/runners/apex/target/beam-runners-apex-2.4.0-SNAPSHOT-sources.jar>
to <https://builds.apache.org/job/beam_PostCommit_Java_MavenInstall/ws/.repository/org/apache/beam/beam-runners-apex/2.4.0-SNAPSHOT/beam-runners-apex-2.4.0-SNAPSHOT-sources.jar>
2018-01-31T13:04:17.769 [INFO] Installing <https://builds.apache.org/job/beam_PostCommit_Java_MavenInstall/ws/src/runners/apex/target/beam-runners-apex-2.4.0-SNAPSHOT-test-sources.jar>
to <https://builds.apache.org/job/beam_PostCommit_Java_MavenInstall/ws/.repository/org/apache/beam/beam-runners-apex/2.4.0-SNAPSHOT/beam-runners-apex-2.4.0-SNAPSHOT-test-sources.jar>
2018-01-31T13:04:17.770 [INFO] Installing <https://builds.apache.org/job/beam_PostCommit_Java_MavenInstall/ws/src/runners/apex/target/beam-runners-apex-2.4.0-SNAPSHOT-javadoc.jar>
to <https://builds.apache.org/job/beam_PostCommit_Java_MavenInstall/ws/.repository/org/apache/beam/beam-runners-apex/2.4.0-SNAPSHOT/beam-runners-apex-2.4.0-SNAPSHOT-javadoc.jar>
[JENKINS] Archiving disabled
2018-01-31T13:04:19.315 [INFO] 
2018-01-31T13:04:19.315 [INFO] ------------------------------------------------------------------------
2018-01-31T13:04:19.315 [INFO] Skipping Apache Beam :: SDKs :: Java :: Aggregated Javadoc
2018-01-31T13:04:19.315 [INFO] This project has been banned from the build due to previous
failures.
2018-01-31T13:04:19.315 [INFO] ------------------------------------------------------------------------
[JENKINS] Archiving disabled
[JENKINS] Archiving disabled
[JENKINS] Archiving disabled
[JENKINS] Archiving disabled
[JENKINS] Archiving disabled
[JENKINS] Archiving disabled
[JENKINS] Archiving disabled
[JENKINS] Archiving disabled
[JENKINS] Archiving disabled
[JENKINS] Archiving disabled
[JENKINS] Archiving disabled
[JENKINS] Archiving disabled
[JENKINS] Archiving disabled
[JENKINS] Archiving disabled
[JENKINS] Archiving disabled
[JENKINS] Archiving disabled
[JENKINS] Archiving disabled
[JENKINS] Archiving disabled
[JENKINS] Archiving disabled
[JENKINS] Archiving disabled
[JENKINS] Archiving disabled
[JENKINS] Archiving disabled
[JENKINS] Archiving disabled
[JENKINS] Archiving disabled
[JENKINS] Archiving disabled
[JENKINS] Archiving disabled
[JENKINS] Archiving disabled
[JENKINS] Archiving disabled
[JENKINS] Archiving disabled
[JENKINS] Archiving disabled
[JENKINS] Archiving disabled
[JENKINS] Archiving disabled
[JENKINS] Archiving disabled
[JENKINS] Archiving disabled
[JENKINS] Archiving disabled
[JENKINS] Archiving disabled
[JENKINS] Archiving disabled
[JENKINS] Archiving disabled
[JENKINS] Archiving disabled
[JENKINS] Archiving disabled
[JENKINS] Archiving disabled
[JENKINS] Archiving disabled
[JENKINS] Archiving disabled
[JENKINS] Archiving disabled
[JENKINS] Archiving disabled
[JENKINS] Archiving disabled
[JENKINS] Archiving disabled
[JENKINS] Archiving disabled
[JENKINS] Archiving disabled
[JENKINS] Archiving disabled
[JENKINS] Archiving disabled
[JENKINS] Archiving disabled
[JENKINS] Archiving disabled
[JENKINS] Archiving disabled
[JENKINS] Archiving disabled
[JENKINS] Archiving disabled
[JENKINS] Archiving disabled
[JENKINS] Archiving disabled
[JENKINS] Archiving disabled
[JENKINS] Archiving disabled
[JENKINS] Archiving disabled
[JENKINS] Archiving disabled
[JENKINS] Archiving disabled
[JENKINS] Archiving disabled2018-01-31T13:05:19.960 [INFO] ------------------------------------------------------------------------
2018-01-31T13:05:19.960 [INFO] Reactor Summary:
2018-01-31T13:05:19.960 [INFO] 

2018-01-31T13:05:19.961 [INFO] Apache Beam :: Parent .............................. SUCCESS
[ 17.060 s]
2018-01-31T13:05:19.961 [INFO] Apache Beam :: SDKs :: Java :: Build Tools ......... SUCCESS
[  9.438 s]
2018-01-31T13:05:19.961 [INFO] Apache Beam :: Model ............................... SUCCESS
[  2.378 s]
2018-01-31T13:05:19.961 [INFO] Apache Beam :: Model :: Pipeline ................... SUCCESS
[ 21.567 s]
2018-01-31T13:05:19.961 [INFO] Apache Beam :: Model :: Job Management ............. SUCCESS
[ 15.180 s]
2018-01-31T13:05:19.961 [INFO] Apache Beam :: Model :: Fn Execution ............... SUCCESS
[ 18.448 s]
2018-01-31T13:05:19.961 [INFO] Apache Beam :: SDKs ................................ SUCCESS
[  3.281 s]
2018-01-31T13:05:19.961 [INFO] Apache Beam :: SDKs :: Java ........................ SUCCESS
[  3.215 s]
2018-01-31T13:05:19.961 [INFO] Apache Beam :: SDKs :: Java :: Core ................ SUCCESS
[03:43 min]
2018-01-31T13:05:19.961 [INFO] Apache Beam :: SDKs :: Java :: Fn Execution ........ SUCCESS
[ 44.241 s]
2018-01-31T13:05:19.961 [INFO] Apache Beam :: SDKs :: Java :: Extensions :: Google Cloud Platform
Core SUCCESS [ 35.494 s]
2018-01-31T13:05:19.961 [INFO] Apache Beam :: Runners ............................. SUCCESS
[  4.228 s]
2018-01-31T13:05:19.961 [INFO] Apache Beam :: Runners :: Core Construction Java ... SUCCESS
[ 43.603 s]
2018-01-31T13:05:19.961 [INFO] Apache Beam :: Runners :: Core Java ................ SUCCESS
[ 50.651 s]
2018-01-31T13:05:19.961 [INFO] Apache Beam :: SDKs :: Java :: Harness ............. SUCCESS
[ 44.763 s]
2018-01-31T13:05:19.961 [INFO] Apache Beam :: SDKs :: Java :: IO :: Amazon Web Services SUCCESS
[ 26.751 s]
2018-01-31T13:05:19.961 [INFO] Apache Beam :: Runners :: Local Java Core .......... SUCCESS
[ 15.181 s]
2018-01-31T13:05:19.961 [INFO] Apache Beam :: Runners :: Direct Java .............. SUCCESS
[05:10 min]
2018-01-31T13:05:19.961 [INFO] Apache Beam :: SDKs :: Java :: IO :: AMQP .......... SUCCESS
[ 36.910 s]
2018-01-31T13:05:19.961 [INFO] Apache Beam :: SDKs :: Java :: IO :: Common ........ SUCCESS
[  7.441 s]
2018-01-31T13:05:19.961 [INFO] Apache Beam :: SDKs :: Java :: IO :: Cassandra ..... SUCCESS
[ 28.833 s]
2018-01-31T13:05:19.961 [INFO] Apache Beam :: SDKs :: Java :: IO :: Elasticsearch . SUCCESS
[ 17.993 s]
2018-01-31T13:05:19.961 [INFO] Apache Beam :: SDKs :: Java :: IO :: Elasticsearch-Tests SUCCESS
[  4.510 s]
2018-01-31T13:05:19.961 [INFO] Apache Beam :: SDKs :: Java :: IO :: Elasticsearch-Tests ::
Common SUCCESS [  4.720 s]
2018-01-31T13:05:19.961 [INFO] Apache Beam :: SDKs :: Java :: IO :: Elasticsearch-Tests ::
2.x SUCCESS [ 30.056 s]
2018-01-31T13:05:19.961 [INFO] Apache Beam :: SDKs :: Java :: IO :: Elasticsearch-Tests ::
5.x SUCCESS [ 53.317 s]
2018-01-31T13:05:19.961 [INFO] Apache Beam :: SDKs :: Java :: Extensions :: Protobuf SUCCESS
[ 27.918 s]
2018-01-31T13:05:19.961 [INFO] Apache Beam :: SDKs :: Java :: IO :: Google Cloud Platform
SUCCESS [02:04 min]
2018-01-31T13:05:19.961 [INFO] Apache Beam :: Runners :: Google Cloud Dataflow .... SUCCESS
[07:56 min]
2018-01-31T13:05:19.961 [INFO] Apache Beam :: SDKs :: Java :: IO :: File-based-io-tests SUCCESS
[  9.398 s]
2018-01-31T13:05:19.961 [INFO] Apache Beam :: SDKs :: Java :: IO :: Hadoop Common . SUCCESS
[ 18.201 s]
2018-01-31T13:05:19.961 [INFO] Apache Beam :: SDKs :: Java :: IO :: Hadoop File System SUCCESS
[ 34.701 s]
2018-01-31T13:05:19.961 [INFO] Apache Beam :: SDKs :: Java :: IO :: JDBC .......... SUCCESS
[ 36.684 s]
2018-01-31T13:05:19.961 [INFO] Apache Beam :: SDKs :: Java :: IO :: Hadoop Input Format SUCCESS
[01:08 min]
2018-01-31T13:05:19.961 [INFO] Apache Beam :: SDKs :: Java :: IO :: HBase ......... SUCCESS
[01:26 min]
2018-01-31T13:05:19.961 [INFO] Apache Beam :: SDKs :: Java :: IO :: HCatalog ...... SUCCESS
[01:04 min]
2018-01-31T13:05:19.962 [INFO] Apache Beam :: SDKs :: Java :: IO :: JMS ........... SUCCESS
[ 28.603 s]
2018-01-31T13:05:19.962 [INFO] Apache Beam :: SDKs :: Java :: IO :: Kafka ......... SUCCESS
[ 44.448 s]
2018-01-31T13:05:19.962 [INFO] Apache Beam :: SDKs :: Java :: IO :: Kinesis ....... SUCCESS
[01:07 min]
2018-01-31T13:05:19.962 [INFO] Apache Beam :: SDKs :: Java :: IO :: MongoDB ....... SUCCESS
[ 53.437 s]
2018-01-31T13:05:19.962 [INFO] Apache Beam :: SDKs :: Java :: IO :: MQTT .......... SUCCESS
[ 33.602 s]
2018-01-31T13:05:19.962 [INFO] Apache Beam :: SDKs :: Java :: IO :: Redis ......... SUCCESS
[ 26.873 s]
2018-01-31T13:05:19.962 [INFO] Apache Beam :: SDKs :: Java :: IO :: Solr .......... SUCCESS
[ 46.776 s]
2018-01-31T13:05:19.962 [INFO] Apache Beam :: SDKs :: Java :: IO :: Tika .......... SUCCESS
[ 32.537 s]
2018-01-31T13:05:19.962 [INFO] Apache Beam :: SDKs :: Java :: IO :: XML ........... SUCCESS
[ 38.816 s]
2018-01-31T13:05:19.962 [INFO] Apache Beam :: SDKs :: Java :: Java 8 Tests ........ SUCCESS
[ 21.510 s]
2018-01-31T13:05:19.962 [INFO] Apache Beam :: SDKs :: Java :: Maven Archetypes :: Starter
SUCCESS [ 16.604 s]
2018-01-31T13:05:19.962 [INFO] Apache Beam :: Examples :: Java .................... SUCCESS
[05:28 min]
2018-01-31T13:05:19.962 [INFO] Apache Beam :: SDKs :: Java :: Maven Archetypes :: Examples
SUCCESS [ 45.536 s]
2018-01-31T13:05:19.962 [INFO] Apache Beam :: SDKs :: Java :: Extensions :: Jackson SUCCESS
[ 23.016 s]
2018-01-31T13:05:19.962 [INFO] Apache Beam :: SDKs :: Java :: Extensions :: Join library SUCCESS
[ 26.775 s]
2018-01-31T13:05:19.962 [INFO] Apache Beam :: SDKs :: Java :: Extensions :: Sketching SUCCESS
[ 38.287 s]
2018-01-31T13:05:19.962 [INFO] Apache Beam :: SDKs :: Java :: Extensions :: Sorter  SUCCESS
[01:06 min]
2018-01-31T13:05:19.962 [INFO] Apache Beam :: SDKs :: Java :: Extensions :: SQL ... FAILURE
[04:26 min]
2018-01-31T13:05:19.962 [INFO] Apache Beam :: SDKs :: Java :: Nexmark ............. SKIPPED
2018-01-31T13:05:19.962 [INFO] Apache Beam :: Runners :: Java Fn Execution ........ SUCCESS
[01:10 min]
2018-01-31T13:05:19.962 [INFO] Apache Beam :: Runners :: Java Local Artifact Service SUCCESS
[01:01 min]
2018-01-31T13:05:19.962 [INFO] Apache Beam :: Runners :: Reference :: Java ........ SUCCESS
[ 23.337 s]
2018-01-31T13:05:19.962 [INFO] Apache Beam :: Runners :: Reference :: Job Orchestrator SUCCESS
[ 26.537 s]
2018-01-31T13:05:19.962 [INFO] Apache Beam :: Runners :: Flink .................... SUCCESS
[ 58.842 s]
2018-01-31T13:05:19.962 [INFO] Apache Beam :: Runners :: Gearpump ................. SUCCESS
[ 25.329 s]
2018-01-31T13:05:19.962 [INFO] Apache Beam :: Runners :: Spark .................... SUCCESS
[01:41 min]
2018-01-31T13:05:19.962 [INFO] Apache Beam :: Runners :: Apex ..................... SUCCESS
[01:06 min]
2018-01-31T13:05:19.962 [INFO] Apache Beam :: SDKs :: Java :: Aggregated Javadoc .. SKIPPED
2018-01-31T13:05:19.962 [INFO] ------------------------------------------------------------------------
2018-01-31T13:05:19.962 [INFO] BUILD FAILURE
2018-01-31T13:05:19.962 [INFO] ------------------------------------------------------------------------
2018-01-31T13:05:19.962 [INFO] Total time: 01:03 h
2018-01-31T13:05:19.962 [INFO] Finished at: 2018-01-31T13:05:19Z
2018-01-31T13:05:20.901 [INFO] Final Memory: 393M/1387M
2018-01-31T13:05:20.902 [INFO] ------------------------------------------------------------------------
Waiting for Jenkins to finish collecting data
2018-01-31T13:05:26.539 [ERROR] Failed to execute goal org.apache.maven.plugins:maven-dependency-plugin:3.0.2:analyze-only
(default) on project beam-sdks-java-extensions-sql: Dependency problems found -> [Help
1]
2018-01-31T13:05:26.540 [ERROR] 
2018-01-31T13:05:26.540 [ERROR] To see the full stack trace of the errors, re-run Maven with
the -e switch.
2018-01-31T13:05:26.540 [ERROR] Re-run Maven using the -X switch to enable full debug logging.
2018-01-31T13:05:26.540 [ERROR] 
2018-01-31T13:05:26.540 [ERROR] For more information about the errors and possible solutions,
please read the following articles:
2018-01-31T13:05:26.540 [ERROR] [Help 1] http://cwiki.apache.org/confluence/display/MAVEN/MojoExecutionException
2018-01-31T13:05:26.540 [ERROR] 
2018-01-31T13:05:26.540 [ERROR] After correcting the problems, you can resume the build with
the command
2018-01-31T13:05:26.540 [ERROR]   mvn <goals> -rf :beam-sdks-java-extensions-sql
channel stopped
Not sending mail to unregistered user kedin@google.com

Mime
View raw message