beam-commits mailing list archives

Site index · List index
Message view « Date » · « Thread »
Top « Date » · « Thread »
From Apache Jenkins Server <jenk...@builds.apache.org>
Subject Build failed in Jenkins: beam_PostCommit_Java_MavenInstall #5642
Date Sat, 13 Jan 2018 07:16:20 GMT
See <https://builds.apache.org/job/beam_PostCommit_Java_MavenInstall/5642/display/redirect>

------------------------------------------
[...truncated 1.34 MB...]
2018-01-13T07:14:29.971 [INFO] Excluding org.scala-stm:scala-stm_2.11:jar:0.8 from the shaded
jar.
2018-01-13T07:14:29.971 [INFO] Excluding com.typesafe.akka:akka-slf4j_2.11:jar:2.4.16 from
the shaded jar.
2018-01-13T07:14:29.971 [INFO] Excluding com.typesafe.akka:akka-kernel_2.11:jar:2.4.16 from
the shaded jar.
2018-01-13T07:14:29.971 [INFO] Excluding com.typesafe.akka:akka-http_2.11:jar:10.0.1 from
the shaded jar.
2018-01-13T07:14:29.971 [INFO] Excluding com.typesafe.akka:akka-http-core_2.11:jar:10.0.1
from the shaded jar.
2018-01-13T07:14:29.971 [INFO] Excluding com.typesafe.akka:akka-parsing_2.11:jar:10.0.1 from
the shaded jar.
2018-01-13T07:14:29.971 [INFO] Excluding com.typesafe.akka:akka-http-spray-json_2.11:jar:10.0.1
from the shaded jar.
2018-01-13T07:14:29.971 [INFO] Excluding io.spray:spray-json_2.11:jar:1.3.2 from the shaded
jar.
2018-01-13T07:14:29.971 [INFO] Excluding org.scala-lang:scala-reflect:jar:2.11.8 from the
shaded jar.
2018-01-13T07:14:29.971 [INFO] Excluding org.apache.beam:beam-sdks-java-core:jar:2.3.0-SNAPSHOT
from the shaded jar.
2018-01-13T07:14:29.971 [INFO] Excluding com.google.protobuf:protobuf-java:jar:3.2.0 from
the shaded jar.
2018-01-13T07:14:29.971 [INFO] Excluding com.github.stephenc.findbugs:findbugs-annotations:jar:1.3.9-1
from the shaded jar.
2018-01-13T07:14:29.971 [INFO] Excluding com.fasterxml.jackson.core:jackson-core:jar:2.8.9
from the shaded jar.
2018-01-13T07:14:29.971 [INFO] Excluding net.bytebuddy:byte-buddy:jar:1.6.8 from the shaded
jar.
2018-01-13T07:14:29.971 [INFO] Excluding org.apache.avro:avro:jar:1.8.2 from the shaded jar.
2018-01-13T07:14:29.971 [INFO] Excluding org.codehaus.jackson:jackson-core-asl:jar:1.9.13
from the shaded jar.
2018-01-13T07:14:29.971 [INFO] Excluding org.codehaus.jackson:jackson-mapper-asl:jar:1.9.13
from the shaded jar.
2018-01-13T07:14:29.971 [INFO] Excluding com.thoughtworks.paranamer:paranamer:jar:2.7 from
the shaded jar.
2018-01-13T07:14:29.971 [INFO] Excluding org.tukaani:xz:jar:1.5 from the shaded jar.
2018-01-13T07:14:29.971 [INFO] Excluding org.xerial.snappy:snappy-java:jar:1.1.4 from the
shaded jar.
2018-01-13T07:14:29.971 [INFO] Excluding org.apache.commons:commons-compress:jar:1.14 from
the shaded jar.
2018-01-13T07:14:29.971 [INFO] Excluding org.apache.commons:commons-lang3:jar:3.6 from the
shaded jar.
2018-01-13T07:14:29.971 [INFO] Excluding org.apache.beam:beam-runners-core-java:jar:2.3.0-SNAPSHOT
from the shaded jar.
2018-01-13T07:14:29.971 [INFO] Excluding org.apache.beam:beam-model-pipeline:jar:2.3.0-SNAPSHOT
from the shaded jar.
2018-01-13T07:14:29.971 [INFO] Excluding org.apache.beam:beam-runners-core-construction-java:jar:2.3.0-SNAPSHOT
from the shaded jar.
2018-01-13T07:14:29.971 [INFO] Excluding org.apache.beam:beam-model-job-management:jar:2.3.0-SNAPSHOT
from the shaded jar.
2018-01-13T07:14:29.971 [INFO] Excluding io.grpc:grpc-protobuf:jar:1.2.0 from the shaded jar.
2018-01-13T07:14:29.971 [INFO] Excluding io.grpc:grpc-protobuf-lite:jar:1.2.0 from the shaded
jar.
2018-01-13T07:14:29.971 [INFO] Excluding com.google.protobuf:protobuf-java-util:jar:3.2.0
from the shaded jar.
2018-01-13T07:14:29.971 [INFO] Excluding com.google.code.gson:gson:jar:2.7 from the shaded
jar.
2018-01-13T07:14:29.971 [INFO] Excluding io.grpc:grpc-core:jar:1.2.0 from the shaded jar.
2018-01-13T07:14:29.971 [INFO] Excluding com.google.errorprone:error_prone_annotations:jar:2.0.15
from the shaded jar.
2018-01-13T07:14:29.971 [INFO] Excluding io.grpc:grpc-context:jar:1.2.0 from the shaded jar.
2018-01-13T07:14:29.971 [INFO] Excluding com.google.instrumentation:instrumentation-api:jar:0.3.0
from the shaded jar.
2018-01-13T07:14:29.971 [INFO] Excluding io.grpc:grpc-stub:jar:1.2.0 from the shaded jar.
2018-01-13T07:14:29.971 [INFO] Excluding joda-time:joda-time:jar:2.4 from the shaded jar.
2018-01-13T07:14:29.971 [INFO] Excluding com.fasterxml.jackson.core:jackson-annotations:jar:2.8.9
from the shaded jar.
2018-01-13T07:14:29.971 [INFO] Including com.google.guava:guava:jar:20.0 in the shaded jar.
2018-01-13T07:14:29.971 [INFO] Excluding com.google.code.findbugs:jsr305:jar:3.0.1 from the
shaded jar.
2018-01-13T07:14:29.971 [INFO] Excluding com.google.auto.service:auto-service:jar:1.0-rc2
from the shaded jar.
2018-01-13T07:14:29.971 [INFO] Excluding com.google.auto:auto-common:jar:0.3 from the shaded
jar.
2018-01-13T07:14:31.811 [INFO] Replacing original artifact with shaded artifact.
2018-01-13T07:14:31.811 [INFO] Replacing <https://builds.apache.org/job/beam_PostCommit_Java_MavenInstall/ws/src/runners/gearpump/target/beam-runners-gearpump-2.3.0-SNAPSHOT.jar>
with <https://builds.apache.org/job/beam_PostCommit_Java_MavenInstall/ws/src/runners/gearpump/target/beam-runners-gearpump-2.3.0-SNAPSHOT-shaded.jar>
2018-01-13T07:14:31.811 [INFO] Replacing original test artifact with shaded test artifact.
2018-01-13T07:14:31.811 [INFO] Replacing <https://builds.apache.org/job/beam_PostCommit_Java_MavenInstall/ws/src/runners/gearpump/target/beam-runners-gearpump-2.3.0-SNAPSHOT-tests.jar>
with <https://builds.apache.org/job/beam_PostCommit_Java_MavenInstall/ws/src/runners/gearpump/target/beam-runners-gearpump-2.3.0-SNAPSHOT-shaded-tests.jar>
2018-01-13T07:14:31.812 [INFO] Dependency-reduced POM written at: <https://builds.apache.org/job/beam_PostCommit_Java_MavenInstall/ws/src/runners/gearpump/dependency-reduced-pom.xml>
2018-01-13T07:14:32.018 [INFO] 
2018-01-13T07:14:32.018 [INFO] --- maven-javadoc-plugin:3.0.0-M1:jar (attach-javadocs) @ beam-runners-gearpump
---
2018-01-13T07:14:35.583 [INFO] Building jar: <https://builds.apache.org/job/beam_PostCommit_Java_MavenInstall/ws/src/runners/gearpump/target/beam-runners-gearpump-2.3.0-SNAPSHOT-javadoc.jar>
2018-01-13T07:14:35.705 [INFO] 
2018-01-13T07:14:35.705 [INFO] --- maven-source-plugin:3.0.1:jar-no-fork (attach-sources)
@ beam-runners-gearpump ---
2018-01-13T07:14:35.708 [INFO] Building jar: <https://builds.apache.org/job/beam_PostCommit_Java_MavenInstall/ws/src/runners/gearpump/target/beam-runners-gearpump-2.3.0-SNAPSHOT-sources.jar>
2018-01-13T07:14:35.826 [INFO] 
2018-01-13T07:14:35.826 [INFO] --- maven-source-plugin:3.0.1:test-jar-no-fork (attach-test-sources)
@ beam-runners-gearpump ---
2018-01-13T07:14:35.829 [INFO] Building jar: <https://builds.apache.org/job/beam_PostCommit_Java_MavenInstall/ws/src/runners/gearpump/target/beam-runners-gearpump-2.3.0-SNAPSHOT-test-sources.jar>
2018-01-13T07:14:35.944 [INFO] 
2018-01-13T07:14:35.944 [INFO] --- reproducible-build-maven-plugin:0.4:strip-jar (default)
@ beam-runners-gearpump ---
2018-01-13T07:14:35.945 [INFO] Stripping <https://builds.apache.org/job/beam_PostCommit_Java_MavenInstall/ws/src/runners/gearpump/target/beam-runners-gearpump-2.3.0-SNAPSHOT-sources.jar>
2018-01-13T07:14:35.947 [INFO] Stripping <https://builds.apache.org/job/beam_PostCommit_Java_MavenInstall/ws/src/runners/gearpump/target/beam-runners-gearpump-2.3.0-SNAPSHOT-test-sources.jar>
2018-01-13T07:14:35.949 [INFO] Stripping <https://builds.apache.org/job/beam_PostCommit_Java_MavenInstall/ws/src/runners/gearpump/target/beam-runners-gearpump-2.3.0-SNAPSHOT-tests.jar>
2018-01-13T07:14:35.951 [INFO] Stripping <https://builds.apache.org/job/beam_PostCommit_Java_MavenInstall/ws/src/runners/gearpump/target/beam-runners-gearpump-2.3.0-SNAPSHOT.jar>
2018-01-13T07:14:36.035 [INFO] Stripping <https://builds.apache.org/job/beam_PostCommit_Java_MavenInstall/ws/src/runners/gearpump/target/original-beam-runners-gearpump-2.3.0-SNAPSHOT.jar>
2018-01-13T07:14:36.039 [INFO] Stripping <https://builds.apache.org/job/beam_PostCommit_Java_MavenInstall/ws/src/runners/gearpump/target/beam-runners-gearpump-2.3.0-SNAPSHOT-javadoc.jar>
2018-01-13T07:14:36.043 [INFO] Stripping <https://builds.apache.org/job/beam_PostCommit_Java_MavenInstall/ws/src/runners/gearpump/target/original-beam-runners-gearpump-2.3.0-SNAPSHOT-tests.jar>
2018-01-13T07:14:36.153 [INFO] 
2018-01-13T07:14:36.153 [INFO] --- maven-dependency-plugin:3.0.1:analyze-only (default) @
beam-runners-gearpump ---
2018-01-13T07:14:36.385 [INFO] No dependency problems found
2018-01-13T07:14:36.492 [INFO] 
2018-01-13T07:14:36.492 [INFO] --- maven-install-plugin:2.5.2:install (default-install) @
beam-runners-gearpump ---
2018-01-13T07:14:36.494 [INFO] Installing <https://builds.apache.org/job/beam_PostCommit_Java_MavenInstall/ws/src/runners/gearpump/target/beam-runners-gearpump-2.3.0-SNAPSHOT.jar>
to <https://builds.apache.org/job/beam_PostCommit_Java_MavenInstall/ws/.repository/org/apache/beam/beam-runners-gearpump/2.3.0-SNAPSHOT/beam-runners-gearpump-2.3.0-SNAPSHOT.jar>
2018-01-13T07:14:36.513 [INFO] Installing <https://builds.apache.org/job/beam_PostCommit_Java_MavenInstall/ws/src/runners/gearpump/dependency-reduced-pom.xml>
to <https://builds.apache.org/job/beam_PostCommit_Java_MavenInstall/ws/.repository/org/apache/beam/beam-runners-gearpump/2.3.0-SNAPSHOT/beam-runners-gearpump-2.3.0-SNAPSHOT.pom>
2018-01-13T07:14:36.544 [INFO] Installing <https://builds.apache.org/job/beam_PostCommit_Java_MavenInstall/ws/src/runners/gearpump/target/beam-runners-gearpump-2.3.0-SNAPSHOT-tests.jar>
to <https://builds.apache.org/job/beam_PostCommit_Java_MavenInstall/ws/.repository/org/apache/beam/beam-runners-gearpump/2.3.0-SNAPSHOT/beam-runners-gearpump-2.3.0-SNAPSHOT-tests.jar>
2018-01-13T07:14:36.546 [INFO] Installing <https://builds.apache.org/job/beam_PostCommit_Java_MavenInstall/ws/src/runners/gearpump/target/beam-runners-gearpump-2.3.0-SNAPSHOT-tests.jar>
to <https://builds.apache.org/job/beam_PostCommit_Java_MavenInstall/ws/.repository/org/apache/beam/beam-runners-gearpump/2.3.0-SNAPSHOT/beam-runners-gearpump-2.3.0-SNAPSHOT-tests.jar>
2018-01-13T07:14:36.547 [INFO] Installing <https://builds.apache.org/job/beam_PostCommit_Java_MavenInstall/ws/src/runners/gearpump/target/beam-runners-gearpump-2.3.0-SNAPSHOT-javadoc.jar>
to <https://builds.apache.org/job/beam_PostCommit_Java_MavenInstall/ws/.repository/org/apache/beam/beam-runners-gearpump/2.3.0-SNAPSHOT/beam-runners-gearpump-2.3.0-SNAPSHOT-javadoc.jar>
2018-01-13T07:14:36.549 [INFO] Installing <https://builds.apache.org/job/beam_PostCommit_Java_MavenInstall/ws/src/runners/gearpump/target/beam-runners-gearpump-2.3.0-SNAPSHOT-sources.jar>
to <https://builds.apache.org/job/beam_PostCommit_Java_MavenInstall/ws/.repository/org/apache/beam/beam-runners-gearpump/2.3.0-SNAPSHOT/beam-runners-gearpump-2.3.0-SNAPSHOT-sources.jar>
2018-01-13T07:14:36.550 [INFO] Installing <https://builds.apache.org/job/beam_PostCommit_Java_MavenInstall/ws/src/runners/gearpump/target/beam-runners-gearpump-2.3.0-SNAPSHOT-test-sources.jar>
to <https://builds.apache.org/job/beam_PostCommit_Java_MavenInstall/ws/.repository/org/apache/beam/beam-runners-gearpump/2.3.0-SNAPSHOT/beam-runners-gearpump-2.3.0-SNAPSHOT-test-sources.jar>
[JENKINS] Archiving disabled
2018-01-13T07:14:38.089 [INFO]                                                           
             
2018-01-13T07:14:38.089 [INFO] ------------------------------------------------------------------------
2018-01-13T07:14:38.089 [INFO] Skipping Apache Beam :: SDKs :: Java :: Aggregated Javadoc
2018-01-13T07:14:38.089 [INFO] This project has been banned from the build due to previous
failures.
2018-01-13T07:14:38.089 [INFO] ------------------------------------------------------------------------
[JENKINS] Archiving disabled
[JENKINS] Archiving disabled
[JENKINS] Archiving disabled
[JENKINS] Archiving disabled
[JENKINS] Archiving disabled
[JENKINS] Archiving disabled
[JENKINS] Archiving disabled
[JENKINS] Archiving disabled
[JENKINS] Archiving disabled
[JENKINS] Archiving disabled
[JENKINS] Archiving disabled
[JENKINS] Archiving disabled
[JENKINS] Archiving disabled
[JENKINS] Archiving disabled
[JENKINS] Archiving disabled
[JENKINS] Archiving disabled
[JENKINS] Archiving disabled
[JENKINS] Archiving disabled
[JENKINS] Archiving disabled
[JENKINS] Archiving disabled
[JENKINS] Archiving disabled
[JENKINS] Archiving disabled
[JENKINS] Archiving disabled
[JENKINS] Archiving disabled
[JENKINS] Archiving disabled
[JENKINS] Archiving disabled
[JENKINS] Archiving disabled
[JENKINS] Archiving disabled
[JENKINS] Archiving disabled
[JENKINS] Archiving disabled
[JENKINS] Archiving disabled
[JENKINS] Archiving disabled
[JENKINS] Archiving disabled
[JENKINS] Archiving disabled
[JENKINS] Archiving disabled
[JENKINS] Archiving disabled
[JENKINS] Archiving disabled
[JENKINS] Archiving disabled
[JENKINS] Archiving disabled
[JENKINS] Archiving disabled
[JENKINS] Archiving disabled
[JENKINS] Archiving disabled
[JENKINS] Archiving disabled
[JENKINS] Archiving disabled
[JENKINS] Archiving disabled
[JENKINS] Archiving disabled
[JENKINS] Archiving disabled
[JENKINS] Archiving disabled
[JENKINS] Archiving disabled
[JENKINS] Archiving disabled
[JENKINS] Archiving disabled
[JENKINS] Archiving disabled
[JENKINS] Archiving disabled
[JENKINS] Archiving disabled
[JENKINS] Archiving disabled
[JENKINS] Archiving disabled
[JENKINS] Archiving disabled
[JENKINS] Archiving disabled
[JENKINS] Archiving disabled
[JENKINS] Archiving disabled
[JENKINS] Archiving disabled
[JENKINS] Archiving disabled
[JENKINS] Archiving disabled
[JENKINS] Archiving disabled
[JENKINS] Archiving disabled
[JENKINS] Archiving disabled
[JENKINS] Archiving disabled
2018-01-13T07:15:41.963 [INFO] ------------------------------------------------------------------------
2018-01-13T07:15:41.963 [INFO] Reactor Summary:
2018-01-13T07:15:41.963 [INFO] 
2018-01-13T07:15:41.963 [INFO] Apache Beam :: Parent .............................. SUCCESS
[ 16.096 s]
2018-01-13T07:15:41.963 [INFO] Apache Beam :: SDKs :: Java :: Build Tools ......... SUCCESS
[  9.643 s]
2018-01-13T07:15:41.963 [INFO] Apache Beam :: Model ............................... SUCCESS
[  2.364 s]
2018-01-13T07:15:41.963 [INFO] Apache Beam :: Model :: Pipeline ................... SUCCESS
[ 21.238 s]
2018-01-13T07:15:41.963 [INFO] Apache Beam :: Model :: Job Management ............. SUCCESS
[ 14.206 s]
2018-01-13T07:15:41.963 [INFO] Apache Beam :: Model :: Fn Execution ............... SUCCESS
[ 18.325 s]
2018-01-13T07:15:41.963 [INFO] Apache Beam :: SDKs ................................ SUCCESS
[  3.121 s]
2018-01-13T07:15:41.963 [INFO] Apache Beam :: SDKs :: Java ........................ SUCCESS
[  3.129 s]
2018-01-13T07:15:41.963 [INFO] Apache Beam :: SDKs :: Java :: Core ................ SUCCESS
[02:46 min]
2018-01-13T07:15:41.963 [INFO] Apache Beam :: Runners ............................. SUCCESS
[  3.306 s]
2018-01-13T07:15:41.963 [INFO] Apache Beam :: Runners :: Local Java Core .......... SUCCESS
[ 12.445 s]
2018-01-13T07:15:41.964 [INFO] Apache Beam :: Runners :: Core Construction Java ... SUCCESS
[ 33.740 s]
2018-01-13T07:15:41.964 [INFO] Apache Beam :: Runners :: Core Java ................ SUCCESS
[01:05 min]
2018-01-13T07:15:41.964 [INFO] Apache Beam :: Runners :: Direct Java .............. SUCCESS
[12:03 min]
2018-01-13T07:15:41.964 [INFO] Apache Beam :: SDKs :: Java :: IO :: AMQP .......... SUCCESS
[01:12 min]
2018-01-13T07:15:41.964 [INFO] Apache Beam :: SDKs :: Java :: IO :: Common ........ SUCCESS
[ 12.731 s]
2018-01-13T07:15:41.964 [INFO] Apache Beam :: SDKs :: Java :: IO :: Cassandra ..... SUCCESS
[01:04 min]
2018-01-13T07:15:41.964 [INFO] Apache Beam :: SDKs :: Java :: IO :: Elasticsearch . SUCCESS
[ 35.718 s]
2018-01-13T07:15:41.964 [INFO] Apache Beam :: SDKs :: Java :: IO :: Elasticsearch-Tests SUCCESS
[  7.976 s]
2018-01-13T07:15:41.964 [INFO] Apache Beam :: SDKs :: Java :: IO :: Elasticsearch-Tests ::
Common SUCCESS [  9.400 s]
2018-01-13T07:15:41.964 [INFO] Apache Beam :: SDKs :: Java :: IO :: Elasticsearch-Tests ::
2.x SUCCESS [ 52.049 s]
2018-01-13T07:15:41.964 [INFO] Apache Beam :: SDKs :: Java :: IO :: Elasticsearch-Tests ::
5.x SUCCESS [01:12 min]
2018-01-13T07:15:41.964 [INFO] Apache Beam :: SDKs :: Java :: Extensions :: Google Cloud Platform
Core SUCCESS [01:02 min]
2018-01-13T07:15:41.964 [INFO] Apache Beam :: SDKs :: Java :: Extensions :: Protobuf SUCCESS
[ 42.977 s]
2018-01-13T07:15:41.964 [INFO] Apache Beam :: SDKs :: Java :: IO :: Google Cloud Platform
SUCCESS [03:43 min]
2018-01-13T07:15:41.964 [INFO] Apache Beam :: Runners :: Google Cloud Dataflow .... SUCCESS
[09:51 min]
2018-01-13T07:15:41.964 [INFO] Apache Beam :: SDKs :: Java :: IO :: File-based-io-tests SUCCESS
[ 17.249 s]
2018-01-13T07:15:41.964 [INFO] Apache Beam :: SDKs :: Java :: IO :: Hadoop Common . SUCCESS
[ 27.964 s]
2018-01-13T07:15:41.964 [INFO] Apache Beam :: SDKs :: Java :: IO :: Hadoop File System SUCCESS
[ 54.381 s]
2018-01-13T07:15:41.964 [INFO] Apache Beam :: SDKs :: Java :: IO :: Hadoop ........ SUCCESS
[  5.445 s]
2018-01-13T07:15:41.964 [INFO] Apache Beam :: SDKs :: Java :: IO :: Hadoop :: input-format
SUCCESS [ 24.133 s]
2018-01-13T07:15:41.964 [INFO] Apache Beam :: SDKs :: Java :: IO :: Hadoop :: jdk1.8-tests
SUCCESS [01:36 min]
2018-01-13T07:15:41.964 [INFO] Apache Beam :: SDKs :: Java :: IO :: HBase ......... SUCCESS
[02:20 min]
2018-01-13T07:15:41.964 [INFO] Apache Beam :: SDKs :: Java :: IO :: HCatalog ...... SUCCESS
[ 58.490 s]
2018-01-13T07:15:41.964 [INFO] Apache Beam :: SDKs :: Java :: IO :: JDBC .......... SUCCESS
[ 45.897 s]
2018-01-13T07:15:41.964 [INFO] Apache Beam :: SDKs :: Java :: IO :: JMS ........... SUCCESS
[ 25.424 s]
2018-01-13T07:15:41.964 [INFO] Apache Beam :: SDKs :: Java :: IO :: Kafka ......... SUCCESS
[ 36.961 s]
2018-01-13T07:15:41.964 [INFO] Apache Beam :: SDKs :: Java :: IO :: Kinesis ....... SUCCESS
[ 46.352 s]
2018-01-13T07:15:41.964 [INFO] Apache Beam :: SDKs :: Java :: IO :: MongoDB ....... SUCCESS
[ 42.926 s]
2018-01-13T07:15:41.964 [INFO] Apache Beam :: SDKs :: Java :: IO :: MQTT .......... SUCCESS
[ 30.617 s]
2018-01-13T07:15:41.964 [INFO] Apache Beam :: SDKs :: Java :: IO :: Redis ......... SUCCESS
[ 21.566 s]
2018-01-13T07:15:41.964 [INFO] Apache Beam :: SDKs :: Java :: IO :: Solr .......... SUCCESS
[ 37.764 s]
2018-01-13T07:15:41.964 [INFO] Apache Beam :: SDKs :: Java :: IO :: Tika .......... SUCCESS
[ 26.331 s]
2018-01-13T07:15:41.964 [INFO] Apache Beam :: SDKs :: Java :: IO :: XML ........... SUCCESS
[ 29.787 s]
2018-01-13T07:15:41.964 [INFO] Apache Beam :: SDKs :: Java :: Maven Archetypes :: Starter
SUCCESS [ 15.577 s]
2018-01-13T07:15:41.964 [INFO] Apache Beam :: Examples :: Java .................... SUCCESS
[05:17 min]
2018-01-13T07:15:41.964 [INFO] Apache Beam :: SDKs :: Java :: Maven Archetypes :: Examples
SUCCESS [ 28.500 s]
2018-01-13T07:15:41.964 [INFO] Apache Beam :: Examples :: Java 8 .................. SUCCESS
[ 38.473 s]
2018-01-13T07:15:41.964 [INFO] Apache Beam :: SDKs :: Java :: Maven Archetypes :: Examples
- Java 8 SUCCESS [ 31.514 s]
2018-01-13T07:15:41.964 [INFO] Apache Beam :: SDKs :: Java :: Extensions :: Jackson SUCCESS
[ 16.283 s]
2018-01-13T07:15:41.964 [INFO] Apache Beam :: SDKs :: Java :: Extensions :: Join library SUCCESS
[ 18.053 s]
2018-01-13T07:15:41.964 [INFO] Apache Beam :: SDKs :: Java :: Extensions :: Sketching SUCCESS
[ 22.199 s]
2018-01-13T07:15:41.964 [INFO] Apache Beam :: SDKs :: Java :: Extensions :: Sorter  SUCCESS
[ 32.597 s]
2018-01-13T07:15:41.964 [INFO] Apache Beam :: SDKs :: Java :: Extensions :: SQL ... SUCCESS
[01:25 min]
2018-01-13T07:15:41.964 [INFO] Apache Beam :: SDKs :: Java :: Fn Execution ........ SUCCESS
[ 35.686 s]
2018-01-13T07:15:41.964 [INFO] Apache Beam :: SDKs :: Java :: Nexmark ............. SUCCESS
[01:58 min]
2018-01-13T07:15:41.964 [INFO] Apache Beam :: SDKs :: Java :: Harness ............. SUCCESS
[ 41.853 s]
2018-01-13T07:15:41.964 [INFO] Apache Beam :: SDKs :: Java :: Java 8 Tests ........ SUCCESS
[ 21.300 s]
2018-01-13T07:15:41.965 [INFO] Apache Beam :: Runners :: Java Fn Execution ........ FAILURE
[ 26.513 s]
2018-01-13T07:15:41.965 [INFO] Apache Beam :: Runners :: Java Local Artifact Service SKIPPED
2018-01-13T07:15:41.965 [INFO] Apache Beam :: Runners :: Reference :: Java ........ SUCCESS
[ 14.354 s]
2018-01-13T07:15:41.965 [INFO] Apache Beam :: Runners :: Reference :: Job Orchestrator SKIPPED
2018-01-13T07:15:41.965 [INFO] Apache Beam :: Runners :: Flink .................... FAILURE
[  9.954 s]
2018-01-13T07:15:41.965 [INFO] Apache Beam :: Runners :: Spark .................... SUCCESS
[02:58 min]
2018-01-13T07:15:41.965 [INFO] Apache Beam :: Runners :: Apex ..................... SUCCESS
[01:17 min]
2018-01-13T07:15:41.965 [INFO] Apache Beam :: Runners :: Gearpump ................. SUCCESS
[ 35.953 s]
2018-01-13T07:15:41.965 [INFO] Apache Beam :: SDKs :: Java :: Aggregated Javadoc .. SKIPPED
2018-01-13T07:15:41.965 [INFO] ------------------------------------------------------------------------
2018-01-13T07:15:41.965 [INFO] BUILD FAILURE
2018-01-13T07:15:41.965 [INFO] ------------------------------------------------------------------------
2018-01-13T07:15:41.965 [INFO] Total time: 01:14 h
2018-01-13T07:15:41.965 [INFO] Finished at: 2018-01-13T07:15:41+00:00
2018-01-13T07:15:42.843 [INFO] Final Memory: 394M/1731M
2018-01-13T07:15:42.843 [INFO] ------------------------------------------------------------------------
Waiting for Jenkins to finish collecting data
2018-01-13T07:15:43.384 [ERROR] Failed to execute goal org.apache.maven.plugins:maven-dependency-plugin:3.0.1:analyze-only
(default) on project beam-runners-java-fn-execution: Dependency problems found -> [Help
1]
2018-01-13T07:15:43.385 [ERROR] Failed to execute goal org.apache.maven.plugins:maven-checkstyle-plugin:2.17:check
(default) on project beam-runners-flink_2.11: You have 1 Checkstyle violation. -> [Help
2]
2018-01-13T07:15:43.385 [ERROR] 
2018-01-13T07:15:43.385 [ERROR] To see the full stack trace of the errors, re-run Maven with
the -e switch.
2018-01-13T07:15:43.385 [ERROR] Re-run Maven using the -X switch to enable full debug logging.
2018-01-13T07:15:43.385 [ERROR] 
2018-01-13T07:15:43.385 [ERROR] For more information about the errors and possible solutions,
please read the following articles:
2018-01-13T07:15:43.385 [ERROR] [Help 1] http://cwiki.apache.org/confluence/display/MAVEN/MojoExecutionException
2018-01-13T07:15:43.385 [ERROR] [Help 2] http://cwiki.apache.org/confluence/display/MAVEN/MojoFailureException
2018-01-13T07:15:43.385 [ERROR] 
2018-01-13T07:15:43.385 [ERROR] After correcting the problems, you can resume the build with
the command
2018-01-13T07:15:43.385 [ERROR]   mvn <goals> -rf :beam-runners-java-fn-execution
channel stopped
Not sending mail to unregistered user sidhom@google.com
Not sending mail to unregistered user swegner@google.com
Not sending mail to unregistered user arostami@google.com
Not sending mail to unregistered user github@alasdairhodge.co.uk
Not sending mail to unregistered user ankurgoenka@gmail.com
Not sending mail to unregistered user ehudm@google.com
Not sending mail to unregistered user batbat@batbat-linuxworkstation.sea.corp.google.com
Not sending mail to unregistered user dariusz.aniszewski@polidea.com
Not sending mail to unregistered user jb@nanthrax.net

Mime
View raw message