beam-commits mailing list archives

Site index · List index
Message view « Date » · « Thread »
Top « Date » · « Thread »
From Apache Jenkins Server <jenk...@builds.apache.org>
Subject Build failed in Jenkins: beam_PostCommit_Java_ValidatesRunner_Spark #4002
Date Fri, 26 Jan 2018 19:11:37 GMT
See <https://builds.apache.org/job/beam_PostCommit_Java_ValidatesRunner_Spark/4002/display/redirect?page=changes>

Changes:

[zoy] Increasing BatchElements's max_batch_size to 10K

[lcwik] [BEAM-2273] Cleanup examples Maven Archetype to copy in a clean state

[XuMingmin] [BEAM-3526] KakfaIO support for finalizeCheckpoint() (#4481)

------------------------------------------
[...truncated 569.47 KB...]
2018-01-26T19:09:32.331 [INFO] Downloading from central: https://repo.maven.apache.org/maven2/org/lz4/lz4-java/1.4/lz4-java-1.4.jar
2018-01-26T19:09:32.331 [INFO] Downloading from central: https://repo.maven.apache.org/maven2/org/springframework/spring-core/4.3.5.RELEASE/spring-core-4.3.5.RELEASE.jar
2018-01-26T19:09:32.331 [INFO] Downloading from central: https://repo.maven.apache.org/maven2/org/springframework/spring-expression/4.3.5.RELEASE/spring-expression-4.3.5.RELEASE.jar
2018-01-26T19:09:32.331 [INFO] Downloading from central: https://repo.maven.apache.org/maven2/commons-logging/commons-logging/1.2/commons-logging-1.2.jar
2018-01-26T19:09:32.368 [INFO] Downloaded from central: https://repo.maven.apache.org/maven2/commons-logging/commons-logging/1.2/commons-logging-1.2.jar
(62 kB at 1.7 MB/s)
2018-01-26T19:09:32.384 [INFO] Downloaded from central: https://repo.maven.apache.org/maven2/org/springframework/spring-expression/4.3.5.RELEASE/spring-expression-4.3.5.RELEASE.jar
(263 kB at 5.0 MB/s)
2018-01-26T19:09:32.391 [INFO] Downloaded from central: https://repo.maven.apache.org/maven2/org/lz4/lz4-java/1.4/lz4-java-1.4.jar
(370 kB at 6.1 MB/s)
2018-01-26T19:09:32.436 [INFO] Downloaded from central: https://repo.maven.apache.org/maven2/org/springframework/spring-core/4.3.5.RELEASE/spring-core-4.3.5.RELEASE.jar
(1.1 MB at 11 MB/s)
2018-01-26T19:09:32.467 [INFO] Downloaded from central: https://repo.maven.apache.org/maven2/org/apache/kafka/kafka-clients/1.0.0/kafka-clients-1.0.0.jar
(1.6 MB at 12 MB/s)
2018-01-26T19:09:32.470 [INFO] 
2018-01-26T19:09:32.470 [INFO] --- maven-clean-plugin:3.0.0:clean (default-clean) @ beam-sdks-java-io-kafka
---
2018-01-26T19:09:32.474 [INFO] Deleting <https://builds.apache.org/job/beam_PostCommit_Java_ValidatesRunner_Spark/ws/src/sdks/java/io/kafka>
(includes = [**/*.pyc, **/*.egg-info/, **/sdks/python/LICENSE, **/sdks/python/NOTICE, **/sdks/python/README.md,
**/sdks/python/apache_beam/portability/api/*pb2*.*, **/sdks/python/**/*.c, **/sdks/python/**/*.so,
**/sdks/python/**/*.egg], excludes = [])
2018-01-26T19:09:32.625 [INFO] 
2018-01-26T19:09:32.625 [INFO] --- maven-enforcer-plugin:3.0.0-M1:enforce (enforce) @ beam-sdks-java-io-kafka
---
2018-01-26T19:09:33.372 [INFO] 
2018-01-26T19:09:33.372 [INFO] --- maven-enforcer-plugin:3.0.0-M1:enforce (enforce-banned-dependencies)
@ beam-sdks-java-io-kafka ---
2018-01-26T19:09:33.488 [INFO] 
2018-01-26T19:09:33.488 [INFO] --- maven-remote-resources-plugin:1.5:process (process-resource-bundles)
@ beam-sdks-java-io-kafka ---
2018-01-26T19:09:34.034 [INFO] 
2018-01-26T19:09:34.034 [INFO] --- maven-resources-plugin:3.0.2:resources (default-resources)
@ beam-sdks-java-io-kafka ---
2018-01-26T19:09:34.035 [INFO] Using 'UTF-8' encoding to copy filtered resources.
2018-01-26T19:09:34.035 [INFO] skip non existing resourceDirectory <https://builds.apache.org/job/beam_PostCommit_Java_ValidatesRunner_Spark/ws/src/sdks/java/io/kafka/src/main/resources>
2018-01-26T19:09:34.035 [INFO] Copying 3 resources
2018-01-26T19:09:34.181 [INFO] 
2018-01-26T19:09:34.182 [INFO] --- maven-compiler-plugin:3.6.2:compile (default-compile) @
beam-sdks-java-io-kafka ---
2018-01-26T19:09:34.186 [INFO] Changes detected - recompiling the module!
2018-01-26T19:09:34.187 [INFO] Compiling 10 source files to <https://builds.apache.org/job/beam_PostCommit_Java_ValidatesRunner_Spark/ws/src/sdks/java/io/kafka/target/classes>
2018-01-26T19:09:34.869 [INFO] <https://builds.apache.org/job/beam_PostCommit_Java_ValidatesRunner_Spark/ws/src/sdks/java/io/kafka/src/main/java/org/apache/beam/sdk/io/kafka/KafkaRecordCoder.java>:
<https://builds.apache.org/job/beam_PostCommit_Java_ValidatesRunner_Spark/ws/src/sdks/java/io/kafka/src/main/java/org/apache/beam/sdk/io/kafka/KafkaRecordCoder.java>
uses or overrides a deprecated API.
2018-01-26T19:09:34.869 [INFO] <https://builds.apache.org/job/beam_PostCommit_Java_ValidatesRunner_Spark/ws/src/sdks/java/io/kafka/src/main/java/org/apache/beam/sdk/io/kafka/KafkaRecordCoder.java>:
Recompile with -Xlint:deprecation for details.
2018-01-26T19:09:34.869 [INFO] <https://builds.apache.org/job/beam_PostCommit_Java_ValidatesRunner_Spark/ws/src/sdks/java/io/kafka/src/main/java/org/apache/beam/sdk/io/kafka/ProducerSpEL.java>:
Some input files use unchecked or unsafe operations.
2018-01-26T19:09:34.869 [INFO] <https://builds.apache.org/job/beam_PostCommit_Java_ValidatesRunner_Spark/ws/src/sdks/java/io/kafka/src/main/java/org/apache/beam/sdk/io/kafka/ProducerSpEL.java>:
Recompile with -Xlint:unchecked for details.
2018-01-26T19:09:34.977 [INFO] 
2018-01-26T19:09:34.977 [INFO] --- maven-resources-plugin:3.0.2:testResources (default-testResources)
@ beam-sdks-java-io-kafka ---
2018-01-26T19:09:34.978 [INFO] Using 'UTF-8' encoding to copy filtered resources.
2018-01-26T19:09:34.978 [INFO] skip non existing resourceDirectory <https://builds.apache.org/job/beam_PostCommit_Java_ValidatesRunner_Spark/ws/src/sdks/java/io/kafka/src/test/resources>
2018-01-26T19:09:34.979 [INFO] Copying 3 resources
2018-01-26T19:09:35.087 [INFO] 
2018-01-26T19:09:35.087 [INFO] --- maven-compiler-plugin:3.6.2:testCompile (default-testCompile)
@ beam-sdks-java-io-kafka ---
2018-01-26T19:09:35.094 [INFO] Changes detected - recompiling the module!
2018-01-26T19:09:35.094 [INFO] Compiling 2 source files to <https://builds.apache.org/job/beam_PostCommit_Java_ValidatesRunner_Spark/ws/src/sdks/java/io/kafka/target/test-classes>
2018-01-26T19:09:35.450 [INFO] <https://builds.apache.org/job/beam_PostCommit_Java_ValidatesRunner_Spark/ws/src/sdks/java/io/kafka/src/test/java/org/apache/beam/sdk/io/kafka/KafkaIOTest.java>:
<https://builds.apache.org/job/beam_PostCommit_Java_ValidatesRunner_Spark/ws/src/sdks/java/io/kafka/src/test/java/org/apache/beam/sdk/io/kafka/KafkaIOTest.java>
uses unchecked or unsafe operations.
2018-01-26T19:09:35.450 [INFO] <https://builds.apache.org/job/beam_PostCommit_Java_ValidatesRunner_Spark/ws/src/sdks/java/io/kafka/src/test/java/org/apache/beam/sdk/io/kafka/KafkaIOTest.java>:
Recompile with -Xlint:unchecked for details.
2018-01-26T19:09:35.558 [INFO] 
2018-01-26T19:09:35.558 [INFO] --- maven-checkstyle-plugin:2.17:check (default) @ beam-sdks-java-io-kafka
---
2018-01-26T19:09:36.531 [INFO] Starting audit...
Audit done.
2018-01-26T19:09:36.652 [INFO] 
2018-01-26T19:09:36.652 [INFO] --- maven-surefire-plugin:2.20:test (default-test) @ beam-sdks-java-io-kafka
---
2018-01-26T19:09:36.658 [INFO] Surefire report directory: <https://builds.apache.org/job/beam_PostCommit_Java_ValidatesRunner_Spark/ws/src/sdks/java/io/kafka/target/surefire-reports>
2018-01-26T19:09:36.659 [INFO] Using configured provider org.apache.maven.surefire.junitcore.JUnitCoreProvider
2018-01-26T19:09:36.659 [INFO] parallel='none', perCoreThreadCount=true, threadCount=0, useUnlimitedThreads=false,
threadCountSuites=0, threadCountClasses=0, threadCountMethods=0, parallelOptimized=true
2018-01-26T19:09:36.661 [INFO] 
2018-01-26T19:09:36.661 [INFO] -------------------------------------------------------
2018-01-26T19:09:36.661 [INFO]  T E S T S
2018-01-26T19:09:36.661 [INFO] -------------------------------------------------------
2018-01-26T19:09:37.472 [INFO] Running org.apache.beam.sdk.io.kafka.KafkaIOTest
2018-01-26T19:09:56.827 [INFO] Tests run: 21, Failures: 0, Errors: 0, Skipped: 0, Time elapsed:
19.353 s - in org.apache.beam.sdk.io.kafka.KafkaIOTest
2018-01-26T19:09:56.827 [INFO] Running org.apache.beam.sdk.io.kafka.KafkaRecordCoderTest
2018-01-26T19:09:56.829 [INFO] Tests run: 1, Failures: 0, Errors: 0, Skipped: 0, Time elapsed:
0 s - in org.apache.beam.sdk.io.kafka.KafkaRecordCoderTest
2018-01-26T19:09:57.205 [INFO] 
2018-01-26T19:09:57.205 [INFO] Results:
2018-01-26T19:09:57.205 [INFO] 
2018-01-26T19:09:57.205 [INFO] Tests run: 22, Failures: 0, Errors: 0, Skipped: 0
2018-01-26T19:09:57.205 [INFO] 
[JENKINS] Recording test results
2018-01-26T19:09:57.762 [INFO] 
2018-01-26T19:09:57.762 [INFO] --- build-helper-maven-plugin:3.0.0:regex-properties (render-artifact-id)
@ beam-sdks-java-io-kafka ---
2018-01-26T19:09:58.175 [INFO] 
2018-01-26T19:09:58.175 [INFO] --- maven-jar-plugin:3.0.2:jar (default-jar) @ beam-sdks-java-io-kafka
---
2018-01-26T19:09:58.182 [INFO] Building jar: <https://builds.apache.org/job/beam_PostCommit_Java_ValidatesRunner_Spark/ws/src/sdks/java/io/kafka/target/beam-sdks-java-io-kafka-2.3.0-SNAPSHOT.jar>
2018-01-26T19:09:58.586 [INFO] 
2018-01-26T19:09:58.586 [INFO] --- maven-site-plugin:3.5.1:attach-descriptor (attach-descriptor)
@ beam-sdks-java-io-kafka ---
2018-01-26T19:09:58.979 [INFO] 
2018-01-26T19:09:58.979 [INFO] --- maven-jar-plugin:3.0.2:test-jar (default-test-jar) @ beam-sdks-java-io-kafka
---
2018-01-26T19:09:58.984 [INFO] Building jar: <https://builds.apache.org/job/beam_PostCommit_Java_ValidatesRunner_Spark/ws/src/sdks/java/io/kafka/target/beam-sdks-java-io-kafka-2.3.0-SNAPSHOT-tests.jar>
2018-01-26T19:09:59.100 [INFO] 
2018-01-26T19:09:59.100 [INFO] --- maven-shade-plugin:3.0.0:shade (bundle-and-repackage) @
beam-sdks-java-io-kafka ---
2018-01-26T19:09:59.104 [INFO] Excluding org.apache.beam:beam-sdks-java-core:jar:2.3.0-SNAPSHOT
from the shaded jar.
2018-01-26T19:09:59.104 [INFO] Excluding com.google.protobuf:protobuf-java:jar:3.2.0 from
the shaded jar.
2018-01-26T19:09:59.104 [INFO] Excluding com.github.stephenc.findbugs:findbugs-annotations:jar:1.3.9-1
from the shaded jar.
2018-01-26T19:09:59.104 [INFO] Excluding com.fasterxml.jackson.core:jackson-core:jar:2.8.9
from the shaded jar.
2018-01-26T19:09:59.105 [INFO] Excluding net.bytebuddy:byte-buddy:jar:1.6.8 from the shaded
jar.
2018-01-26T19:09:59.105 [INFO] Excluding org.apache.avro:avro:jar:1.8.2 from the shaded jar.
2018-01-26T19:09:59.105 [INFO] Excluding org.codehaus.jackson:jackson-core-asl:jar:1.9.13
from the shaded jar.
2018-01-26T19:09:59.105 [INFO] Excluding org.codehaus.jackson:jackson-mapper-asl:jar:1.9.13
from the shaded jar.
2018-01-26T19:09:59.105 [INFO] Excluding com.thoughtworks.paranamer:paranamer:jar:2.7 from
the shaded jar.
2018-01-26T19:09:59.105 [INFO] Excluding org.tukaani:xz:jar:1.5 from the shaded jar.
2018-01-26T19:09:59.105 [INFO] Excluding org.xerial.snappy:snappy-java:jar:1.1.4 from the
shaded jar.
2018-01-26T19:09:59.105 [INFO] Excluding org.apache.commons:commons-compress:jar:1.14 from
the shaded jar.
2018-01-26T19:09:59.105 [INFO] Excluding org.apache.commons:commons-lang3:jar:3.6 from the
shaded jar.
2018-01-26T19:09:59.105 [INFO] Excluding org.apache.kafka:kafka-clients:jar:1.0.0 from the
shaded jar.
2018-01-26T19:09:59.105 [INFO] Excluding org.lz4:lz4-java:jar:1.4 from the shaded jar.
2018-01-26T19:09:59.105 [INFO] Excluding org.slf4j:slf4j-api:jar:1.7.25 from the shaded jar.
2018-01-26T19:09:59.105 [INFO] Excluding joda-time:joda-time:jar:2.4 from the shaded jar.
2018-01-26T19:09:59.105 [INFO] Including com.google.guava:guava:jar:20.0 in the shaded jar.
2018-01-26T19:09:59.105 [INFO] Excluding com.google.code.findbugs:jsr305:jar:3.0.1 from the
shaded jar.
2018-01-26T19:09:59.105 [INFO] Excluding com.fasterxml.jackson.core:jackson-annotations:jar:2.8.9
from the shaded jar.
2018-01-26T19:09:59.105 [INFO] Excluding com.fasterxml.jackson.core:jackson-databind:jar:2.8.9
from the shaded jar.
2018-01-26T19:09:59.105 [INFO] Excluding org.springframework:spring-expression:jar:4.3.5.RELEASE
from the shaded jar.
2018-01-26T19:09:59.105 [INFO] Excluding org.springframework:spring-core:jar:4.3.5.RELEASE
from the shaded jar.
2018-01-26T19:09:59.105 [INFO] Excluding commons-logging:commons-logging:jar:1.2 from the
shaded jar.
2018-01-26T19:10:00.853 [INFO] Replacing original artifact with shaded artifact.
2018-01-26T19:10:00.853 [INFO] Replacing <https://builds.apache.org/job/beam_PostCommit_Java_ValidatesRunner_Spark/ws/src/sdks/java/io/kafka/target/beam-sdks-java-io-kafka-2.3.0-SNAPSHOT.jar>
with <https://builds.apache.org/job/beam_PostCommit_Java_ValidatesRunner_Spark/ws/src/sdks/java/io/kafka/target/beam-sdks-java-io-kafka-2.3.0-SNAPSHOT-shaded.jar>
2018-01-26T19:10:00.853 [INFO] Replacing original test artifact with shaded test artifact.
2018-01-26T19:10:00.853 [INFO] Replacing <https://builds.apache.org/job/beam_PostCommit_Java_ValidatesRunner_Spark/ws/src/sdks/java/io/kafka/target/beam-sdks-java-io-kafka-2.3.0-SNAPSHOT-tests.jar>
with <https://builds.apache.org/job/beam_PostCommit_Java_ValidatesRunner_Spark/ws/src/sdks/java/io/kafka/target/beam-sdks-java-io-kafka-2.3.0-SNAPSHOT-shaded-tests.jar>
2018-01-26T19:10:00.854 [INFO] Dependency-reduced POM written at: <https://builds.apache.org/job/beam_PostCommit_Java_ValidatesRunner_Spark/ws/src/sdks/java/io/kafka/dependency-reduced-pom.xml>
2018-01-26T19:10:01.068 [INFO] 
2018-01-26T19:10:01.068 [INFO] --- maven-dependency-plugin:3.0.1:analyze-only (default) @
beam-sdks-java-io-kafka ---
2018-01-26T19:10:01.139 [WARNING] Used undeclared dependencies found:
2018-01-26T19:10:01.139 [WARNING]    org.apache.avro:avro:jar:1.8.2:compile
[JENKINS] Archiving disabled
[JENKINS] Archiving disabled
[JENKINS] Archiving disabled
[JENKINS] Archiving disabled
[JENKINS] Archiving disabled
[JENKINS] Archiving disabled
[JENKINS] Archiving disabled
[JENKINS] Archiving disabled
[JENKINS] Archiving disabled
[JENKINS] Archiving disabled
[JENKINS] Archiving disabled
[JENKINS] Archiving disabled
[JENKINS] Archiving disabled
[JENKINS] Archiving disabled
[JENKINS] Archiving disabled
[JENKINS] Archiving disabled
[JENKINS] Archiving disabled
[JENKINS] Archiving disabled2018-01-26T19:10:30.279 [INFO] ------------------------------------------------------------------------
2018-01-26T19:10:30.279 [INFO] Reactor Summary:
2018-01-26T19:10:30.279 [INFO] 
2018-01-26T19:10:30.279 [INFO] Apache Beam :: Parent .............................. SUCCESS
[ 25.240 s]
2018-01-26T19:10:30.279 [INFO] Apache Beam :: SDKs :: Java :: Build Tools ......... SUCCESS
[ 13.551 s]
2018-01-26T19:10:30.279 [INFO] Apache Beam :: Model ............................... SUCCESS
[  4.019 s]
2018-01-26T19:10:30.279 [INFO] Apache Beam :: Model :: Pipeline ................... SUCCESS
[ 17.819 s]
2018-01-26T19:10:30.279 [INFO] Apache Beam :: Model :: Job Management ............. SUCCESS
[ 12.769 s]
2018-01-26T19:10:30.279 [INFO] Apache Beam :: Model :: Fn Execution ............... SUCCESS
[ 12.364 s]
2018-01-26T19:10:30.279 [INFO] Apache Beam :: SDKs ................................ SUCCESS
[  4.142 s]
2018-01-26T19:10:30.279 [INFO] Apache Beam :: SDKs :: Java ........................ SUCCESS
[  5.651 s]
2018-01-26T19:10:30.279 [INFO] Apache Beam :: SDKs :: Java :: Core ................ SUCCESS
[03:30 min]
2018-01-26T19:10:30.279 [INFO] Apache Beam :: Runners ............................. SUCCESS
[  4.925 s]
2018-01-26T19:10:30.279 [INFO] Apache Beam :: Runners :: Local Java Core .......... SUCCESS
[ 12.300 s]
2018-01-26T19:10:30.280 [INFO] Apache Beam :: Runners :: Core Construction Java ... SUCCESS
[ 21.521 s]
2018-01-26T19:10:30.280 [INFO] Apache Beam :: Runners :: Core Java ................ SUCCESS
[ 42.285 s]
2018-01-26T19:10:30.280 [INFO] Apache Beam :: Runners :: Direct Java .............. SUCCESS
[04:29 min]
2018-01-26T19:10:30.280 [INFO] Apache Beam :: SDKs :: Java :: IO .................. SUCCESS
[  4.841 s]
2018-01-26T19:10:30.280 [INFO] Apache Beam :: SDKs :: Java :: IO :: Kafka ......... FAILURE
[ 30.274 s]
2018-01-26T19:10:30.280 [INFO] Apache Beam :: Runners :: Spark .................... SKIPPED
2018-01-26T19:10:30.280 [INFO] ------------------------------------------------------------------------
2018-01-26T19:10:30.280 [INFO] BUILD FAILURE
2018-01-26T19:10:30.280 [INFO] ------------------------------------------------------------------------
2018-01-26T19:10:30.280 [INFO] Total time: 15:09 min
2018-01-26T19:10:30.280 [INFO] Finished at: 2018-01-26T19:10:30Z

2018-01-26T19:10:30.924 [INFO] Final Memory: 132M/1579M
2018-01-26T19:10:30.925 [INFO] ------------------------------------------------------------------------
2018-01-26T19:10:30.925 [WARNING] The requested profile "validates-runner-tests" could not
be activated because it does not exist.
Waiting for Jenkins to finish collecting data
2018-01-26T19:10:33.157 [ERROR] Failed to execute goal org.apache.maven.plugins:maven-dependency-plugin:3.0.1:analyze-only
(default) on project beam-sdks-java-io-kafka: Dependency problems found -> [Help 1]
org.apache.maven.lifecycle.LifecycleExecutionException: Failed to execute goal org.apache.maven.plugins:maven-dependency-plugin:3.0.1:analyze-only
(default) on project beam-sdks-java-io-kafka: Dependency problems found
    at org.apache.maven.lifecycle.internal.MojoExecutor.execute (MojoExecutor.java:213)
    at org.apache.maven.lifecycle.internal.MojoExecutor.execute (MojoExecutor.java:154)
    at org.apache.maven.lifecycle.internal.MojoExecutor.execute (MojoExecutor.java:146)
    at org.apache.maven.lifecycle.internal.LifecycleModuleBuilder.buildProject (LifecycleModuleBuilder.java:117)
    at org.apache.maven.lifecycle.internal.LifecycleModuleBuilder.buildProject (LifecycleModuleBuilder.java:81)
    at org.apache.maven.lifecycle.internal.builder.singlethreaded.SingleThreadedBuilder.build
(SingleThreadedBuilder.java:51)
    at org.apache.maven.lifecycle.internal.LifecycleStarter.execute (LifecycleStarter.java:128)
    at org.apache.maven.DefaultMaven.doExecute (DefaultMaven.java:309)
    at org.apache.maven.DefaultMaven.doExecute (DefaultMaven.java:194)
    at org.apache.maven.DefaultMaven.execute (DefaultMaven.java:107)
    at org.jvnet.hudson.maven3.launcher.Maven35Launcher.main (Maven35Launcher.java:130)
    at sun.reflect.NativeMethodAccessorImpl.invoke0 (Native Method)
    at sun.reflect.NativeMethodAccessorImpl.invoke (NativeMethodAccessorImpl.java:62)
    at sun.reflect.DelegatingMethodAccessorImpl.invoke (DelegatingMethodAccessorImpl.java:43)
    at java.lang.reflect.Method.invoke (Method.java:498)
    at org.codehaus.plexus.classworlds.launcher.Launcher.launchEnhanced (Launcher.java:289)
    at org.codehaus.plexus.classworlds.launcher.Launcher.launch (Launcher.java:229)
    at jenkins.maven3.agent.Maven35Main.launch (Maven35Main.java:176)
    at sun.reflect.NativeMethodAccessorImpl.invoke0 (Native Method)
    at sun.reflect.NativeMethodAccessorImpl.invoke (NativeMethodAccessorImpl.java:62)
    at sun.reflect.DelegatingMethodAccessorImpl.invoke (DelegatingMethodAccessorImpl.java:43)
    at java.lang.reflect.Method.invoke (Method.java:498)
    at hudson.maven.Maven3Builder.call (Maven3Builder.java:139)
    at hudson.maven.Maven3Builder.call (Maven3Builder.java:70)
    at hudson.remoting.UserRequest.perform (UserRequest.java:207)
    at hudson.remoting.UserRequest.perform (UserRequest.java:53)
    at hudson.remoting.Request$2.run (Request.java:358)
    at hudson.remoting.InterceptingExecutorService$1.call (InterceptingExecutorService.java:72)
    at java.util.concurrent.FutureTask.run (FutureTask.java:266)
    at java.util.concurrent.ThreadPoolExecutor.runWorker (ThreadPoolExecutor.java:1149)
    at java.util.concurrent.ThreadPoolExecutor$Worker.run (ThreadPoolExecutor.java:624)
    at java.lang.Thread.run (Thread.java:748)
Caused by: org.apache.maven.plugin.MojoExecutionException: Dependency problems found
    at org.apache.maven.plugins.dependency.analyze.AbstractAnalyzeMojo.execute (AbstractAnalyzeMojo.java:261)
    at org.apache.maven.plugin.DefaultBuildPluginManager.executeMojo (DefaultBuildPluginManager.java:134)
    at org.apache.maven.lifecycle.internal.MojoExecutor.execute (MojoExecutor.java:208)
    at org.apache.maven.lifecycle.internal.MojoExecutor.execute (MojoExecutor.java:154)
    at org.apache.maven.lifecycle.internal.MojoExecutor.execute (MojoExecutor.java:146)
    at org.apache.maven.lifecycle.internal.LifecycleModuleBuilder.buildProject (LifecycleModuleBuilder.java:117)
    at org.apache.maven.lifecycle.internal.LifecycleModuleBuilder.buildProject (LifecycleModuleBuilder.java:81)
    at org.apache.maven.lifecycle.internal.builder.singlethreaded.SingleThreadedBuilder.build
(SingleThreadedBuilder.java:51)
    at org.apache.maven.lifecycle.internal.LifecycleStarter.execute (LifecycleStarter.java:128)
    at org.apache.maven.DefaultMaven.doExecute (DefaultMaven.java:309)
    at org.apache.maven.DefaultMaven.doExecute (DefaultMaven.java:194)
    at org.apache.maven.DefaultMaven.execute (DefaultMaven.java:107)
    at org.jvnet.hudson.maven3.launcher.Maven35Launcher.main (Maven35Launcher.java:130)
    at sun.reflect.NativeMethodAccessorImpl.invoke0 (Native Method)
    at sun.reflect.NativeMethodAccessorImpl.invoke (NativeMethodAccessorImpl.java:62)
    at sun.reflect.DelegatingMethodAccessorImpl.invoke (DelegatingMethodAccessorImpl.java:43)
    at java.lang.reflect.Method.invoke (Method.java:498)
    at org.codehaus.plexus.classworlds.launcher.Launcher.launchEnhanced (Launcher.java:289)
    at org.codehaus.plexus.classworlds.launcher.Launcher.launch (Launcher.java:229)
    at jenkins.maven3.agent.Maven35Main.launch (Maven35Main.java:176)
    at sun.reflect.NativeMethodAccessorImpl.invoke0 (Native Method)
    at sun.reflect.NativeMethodAccessorImpl.invoke (NativeMethodAccessorImpl.java:62)
    at sun.reflect.DelegatingMethodAccessorImpl.invoke (DelegatingMethodAccessorImpl.java:43)
    at java.lang.reflect.Method.invoke (Method.java:498)
    at hudson.maven.Maven3Builder.call (Maven3Builder.java:139)
    at hudson.maven.Maven3Builder.call (Maven3Builder.java:70)
    at hudson.remoting.UserRequest.perform (UserRequest.java:207)
    at hudson.remoting.UserRequest.perform (UserRequest.java:53)
    at hudson.remoting.Request$2.run (Request.java:358)
    at hudson.remoting.InterceptingExecutorService$1.call (InterceptingExecutorService.java:72)
    at java.util.concurrent.FutureTask.run (FutureTask.java:266)
    at java.util.concurrent.ThreadPoolExecutor.runWorker (ThreadPoolExecutor.java:1149)
    at java.util.concurrent.ThreadPoolExecutor$Worker.run (ThreadPoolExecutor.java:624)
    at java.lang.Thread.run (Thread.java:748)
2018-01-26T19:10:33.158 [ERROR] 
2018-01-26T19:10:33.158 [ERROR] Re-run Maven using the -X switch to enable full debug logging.
2018-01-26T19:10:33.158 [ERROR] 
2018-01-26T19:10:33.158 [ERROR] For more information about the errors and possible solutions,
please read the following articles:
2018-01-26T19:10:33.158 [ERROR] [Help 1] http://cwiki.apache.org/confluence/display/MAVEN/MojoExecutionException
2018-01-26T19:10:33.159 [ERROR] 
2018-01-26T19:10:33.159 [ERROR] After correcting the problems, you can resume the build with
the command
2018-01-26T19:10:33.159 [ERROR]   mvn <goals> -rf :beam-sdks-java-io-kafka
channel stopped
Not sending mail to unregistered user github@alasdairhodge.co.uk
Not sending mail to unregistered user melissapa@google.com
Not sending mail to unregistered user sduskis@google.com
Not sending mail to unregistered user batbat@batbat-linuxworkstation.sea.corp.google.com
Not sending mail to unregistered user ehudm@google.com
Not sending mail to unregistered user holdenkarau@google.com
Not sending mail to unregistered user XuMingmin@users.noreply.github.com
Not sending mail to unregistered user robert@frantil.com
Not sending mail to unregistered user jb@nanthrax.net
Not sending mail to unregistered user zhouhai02@meituan.com
Not sending mail to unregistered user zoy@giggles.nyc.corp.google.com
Not sending mail to unregistered user kirpichov@google.com
Not sending mail to unregistered user markliu@google.com
Not sending mail to unregistered user rober@frantil.com

Mime
View raw message