beam-commits mailing list archives

Site index · List index
Message view « Date » · « Thread »
Top « Date » · « Thread »
From Apache Jenkins Server <jenk...@builds.apache.org>
Subject Build failed in Jenkins: beam_PostCommit_Java_MavenInstall #5640
Date Sat, 13 Jan 2018 03:23:18 GMT
See <https://builds.apache.org/job/beam_PostCommit_Java_MavenInstall/5640/display/redirect?page=changes>

Changes:

[chamikara] Updates the error message when trying to execute an export job on an

[tgroh] Handle a populated Error field in FnApiControlClient

[sidhom] Expose side inputs in CombineTranslation and refactor portable

[sidhom] Use portable constructs in Flink batch translator

------------------------------------------
[...truncated 1.34 MB...]
2018-01-13T03:21:26.242 [INFO] Excluding org.scala-lang.modules:scala-java8-compat_2.11:jar:0.7.0
from the shaded jar.
2018-01-13T03:21:26.242 [INFO] Excluding com.typesafe.akka:akka-agent_2.11:jar:2.4.16 from
the shaded jar.
2018-01-13T03:21:26.242 [INFO] Excluding org.scala-stm:scala-stm_2.11:jar:0.8 from the shaded
jar.
2018-01-13T03:21:26.242 [INFO] Excluding com.typesafe.akka:akka-slf4j_2.11:jar:2.4.16 from
the shaded jar.
2018-01-13T03:21:26.242 [INFO] Excluding com.typesafe.akka:akka-kernel_2.11:jar:2.4.16 from
the shaded jar.
2018-01-13T03:21:26.242 [INFO] Excluding com.typesafe.akka:akka-http_2.11:jar:10.0.1 from
the shaded jar.
2018-01-13T03:21:26.242 [INFO] Excluding com.typesafe.akka:akka-http-core_2.11:jar:10.0.1
from the shaded jar.
2018-01-13T03:21:26.242 [INFO] Excluding com.typesafe.akka:akka-parsing_2.11:jar:10.0.1 from
the shaded jar.
2018-01-13T03:21:26.242 [INFO] Excluding com.typesafe.akka:akka-http-spray-json_2.11:jar:10.0.1
from the shaded jar.
2018-01-13T03:21:26.242 [INFO] Excluding io.spray:spray-json_2.11:jar:1.3.2 from the shaded
jar.
2018-01-13T03:21:26.242 [INFO] Excluding org.scala-lang:scala-reflect:jar:2.11.8 from the
shaded jar.
2018-01-13T03:21:26.242 [INFO] Excluding org.apache.beam:beam-sdks-java-core:jar:2.3.0-SNAPSHOT
from the shaded jar.
2018-01-13T03:21:26.242 [INFO] Excluding com.google.protobuf:protobuf-java:jar:3.2.0 from
the shaded jar.
2018-01-13T03:21:26.242 [INFO] Excluding com.github.stephenc.findbugs:findbugs-annotations:jar:1.3.9-1
from the shaded jar.
2018-01-13T03:21:26.242 [INFO] Excluding com.fasterxml.jackson.core:jackson-core:jar:2.8.9
from the shaded jar.
2018-01-13T03:21:26.242 [INFO] Excluding net.bytebuddy:byte-buddy:jar:1.6.8 from the shaded
jar.
2018-01-13T03:21:26.242 [INFO] Excluding org.apache.avro:avro:jar:1.8.2 from the shaded jar.
2018-01-13T03:21:26.242 [INFO] Excluding org.codehaus.jackson:jackson-core-asl:jar:1.9.13
from the shaded jar.
2018-01-13T03:21:26.242 [INFO] Excluding org.codehaus.jackson:jackson-mapper-asl:jar:1.9.13
from the shaded jar.
2018-01-13T03:21:26.242 [INFO] Excluding com.thoughtworks.paranamer:paranamer:jar:2.7 from
the shaded jar.
2018-01-13T03:21:26.242 [INFO] Excluding org.tukaani:xz:jar:1.5 from the shaded jar.
2018-01-13T03:21:26.242 [INFO] Excluding org.xerial.snappy:snappy-java:jar:1.1.4 from the
shaded jar.
2018-01-13T03:21:26.242 [INFO] Excluding org.apache.commons:commons-compress:jar:1.14 from
the shaded jar.
2018-01-13T03:21:26.242 [INFO] Excluding org.apache.commons:commons-lang3:jar:3.6 from the
shaded jar.
2018-01-13T03:21:26.242 [INFO] Excluding org.apache.beam:beam-runners-core-java:jar:2.3.0-SNAPSHOT
from the shaded jar.
2018-01-13T03:21:26.242 [INFO] Excluding org.apache.beam:beam-model-pipeline:jar:2.3.0-SNAPSHOT
from the shaded jar.
2018-01-13T03:21:26.242 [INFO] Excluding org.apache.beam:beam-runners-core-construction-java:jar:2.3.0-SNAPSHOT
from the shaded jar.
2018-01-13T03:21:26.242 [INFO] Excluding org.apache.beam:beam-model-job-management:jar:2.3.0-SNAPSHOT
from the shaded jar.
2018-01-13T03:21:26.242 [INFO] Excluding io.grpc:grpc-protobuf:jar:1.2.0 from the shaded jar.
2018-01-13T03:21:26.242 [INFO] Excluding io.grpc:grpc-protobuf-lite:jar:1.2.0 from the shaded
jar.
2018-01-13T03:21:26.242 [INFO] Excluding com.google.protobuf:protobuf-java-util:jar:3.2.0
from the shaded jar.
2018-01-13T03:21:26.242 [INFO] Excluding com.google.code.gson:gson:jar:2.7 from the shaded
jar.
2018-01-13T03:21:26.242 [INFO] Excluding io.grpc:grpc-core:jar:1.2.0 from the shaded jar.
2018-01-13T03:21:26.242 [INFO] Excluding com.google.errorprone:error_prone_annotations:jar:2.0.15
from the shaded jar.
2018-01-13T03:21:26.242 [INFO] Excluding io.grpc:grpc-context:jar:1.2.0 from the shaded jar.
2018-01-13T03:21:26.242 [INFO] Excluding com.google.instrumentation:instrumentation-api:jar:0.3.0
from the shaded jar.
2018-01-13T03:21:26.242 [INFO] Excluding io.grpc:grpc-stub:jar:1.2.0 from the shaded jar.
2018-01-13T03:21:26.242 [INFO] Excluding joda-time:joda-time:jar:2.4 from the shaded jar.
2018-01-13T03:21:26.242 [INFO] Excluding com.fasterxml.jackson.core:jackson-annotations:jar:2.8.9
from the shaded jar.
2018-01-13T03:21:26.242 [INFO] Including com.google.guava:guava:jar:20.0 in the shaded jar.
2018-01-13T03:21:26.242 [INFO] Excluding com.google.code.findbugs:jsr305:jar:3.0.1 from the
shaded jar.
2018-01-13T03:21:26.242 [INFO] Excluding com.google.auto.service:auto-service:jar:1.0-rc2
from the shaded jar.
2018-01-13T03:21:26.242 [INFO] Excluding com.google.auto:auto-common:jar:0.3 from the shaded
jar.
2018-01-13T03:21:28.181 [INFO] Replacing original artifact with shaded artifact.
2018-01-13T03:21:28.182 [INFO] Replacing <https://builds.apache.org/job/beam_PostCommit_Java_MavenInstall/ws/src/runners/gearpump/target/beam-runners-gearpump-2.3.0-SNAPSHOT.jar>
with <https://builds.apache.org/job/beam_PostCommit_Java_MavenInstall/ws/src/runners/gearpump/target/beam-runners-gearpump-2.3.0-SNAPSHOT-shaded.jar>
2018-01-13T03:21:28.182 [INFO] Replacing original test artifact with shaded test artifact.
2018-01-13T03:21:28.182 [INFO] Replacing <https://builds.apache.org/job/beam_PostCommit_Java_MavenInstall/ws/src/runners/gearpump/target/beam-runners-gearpump-2.3.0-SNAPSHOT-tests.jar>
with <https://builds.apache.org/job/beam_PostCommit_Java_MavenInstall/ws/src/runners/gearpump/target/beam-runners-gearpump-2.3.0-SNAPSHOT-shaded-tests.jar>
2018-01-13T03:21:28.182 [INFO] Dependency-reduced POM written at: <https://builds.apache.org/job/beam_PostCommit_Java_MavenInstall/ws/src/runners/gearpump/dependency-reduced-pom.xml>
2018-01-13T03:21:28.387 [INFO] 
2018-01-13T03:21:28.387 [INFO] --- maven-javadoc-plugin:3.0.0-M1:jar (attach-javadocs) @ beam-runners-gearpump
---
2018-01-13T03:21:30.607 [INFO] Building jar: <https://builds.apache.org/job/beam_PostCommit_Java_MavenInstall/ws/src/runners/gearpump/target/beam-runners-gearpump-2.3.0-SNAPSHOT-javadoc.jar>
2018-01-13T03:21:30.731 [INFO] 
2018-01-13T03:21:30.731 [INFO] --- maven-source-plugin:3.0.1:jar-no-fork (attach-sources)
@ beam-runners-gearpump ---
2018-01-13T03:21:30.734 [INFO] Building jar: <https://builds.apache.org/job/beam_PostCommit_Java_MavenInstall/ws/src/runners/gearpump/target/beam-runners-gearpump-2.3.0-SNAPSHOT-sources.jar>
2018-01-13T03:21:30.855 [INFO] 
2018-01-13T03:21:30.855 [INFO] --- maven-source-plugin:3.0.1:test-jar-no-fork (attach-test-sources)
@ beam-runners-gearpump ---
2018-01-13T03:21:30.858 [INFO] Building jar: <https://builds.apache.org/job/beam_PostCommit_Java_MavenInstall/ws/src/runners/gearpump/target/beam-runners-gearpump-2.3.0-SNAPSHOT-test-sources.jar>
2018-01-13T03:21:30.974 [INFO] 
2018-01-13T03:21:30.974 [INFO] --- reproducible-build-maven-plugin:0.4:strip-jar (default)
@ beam-runners-gearpump ---
2018-01-13T03:21:30.975 [INFO] Stripping <https://builds.apache.org/job/beam_PostCommit_Java_MavenInstall/ws/src/runners/gearpump/target/beam-runners-gearpump-2.3.0-SNAPSHOT-sources.jar>
2018-01-13T03:21:30.977 [INFO] Stripping <https://builds.apache.org/job/beam_PostCommit_Java_MavenInstall/ws/src/runners/gearpump/target/beam-runners-gearpump-2.3.0-SNAPSHOT-test-sources.jar>
2018-01-13T03:21:30.979 [INFO] Stripping <https://builds.apache.org/job/beam_PostCommit_Java_MavenInstall/ws/src/runners/gearpump/target/beam-runners-gearpump-2.3.0-SNAPSHOT-tests.jar>
2018-01-13T03:21:30.982 [INFO] Stripping <https://builds.apache.org/job/beam_PostCommit_Java_MavenInstall/ws/src/runners/gearpump/target/beam-runners-gearpump-2.3.0-SNAPSHOT.jar>
2018-01-13T03:21:31.061 [INFO] Stripping <https://builds.apache.org/job/beam_PostCommit_Java_MavenInstall/ws/src/runners/gearpump/target/original-beam-runners-gearpump-2.3.0-SNAPSHOT.jar>
2018-01-13T03:21:31.065 [INFO] Stripping <https://builds.apache.org/job/beam_PostCommit_Java_MavenInstall/ws/src/runners/gearpump/target/beam-runners-gearpump-2.3.0-SNAPSHOT-javadoc.jar>
2018-01-13T03:21:31.068 [INFO] Stripping <https://builds.apache.org/job/beam_PostCommit_Java_MavenInstall/ws/src/runners/gearpump/target/original-beam-runners-gearpump-2.3.0-SNAPSHOT-tests.jar>
2018-01-13T03:21:31.177 [INFO] 
2018-01-13T03:21:31.178 [INFO] --- maven-dependency-plugin:3.0.1:analyze-only (default) @
beam-runners-gearpump ---
2018-01-13T03:21:31.340 [INFO] No dependency problems found
2018-01-13T03:21:31.447 [INFO] 
2018-01-13T03:21:31.447 [INFO] --- maven-install-plugin:2.5.2:install (default-install) @
beam-runners-gearpump ---
2018-01-13T03:21:31.450 [INFO] Installing <https://builds.apache.org/job/beam_PostCommit_Java_MavenInstall/ws/src/runners/gearpump/target/beam-runners-gearpump-2.3.0-SNAPSHOT.jar>
to <https://builds.apache.org/job/beam_PostCommit_Java_MavenInstall/ws/.repository/org/apache/beam/beam-runners-gearpump/2.3.0-SNAPSHOT/beam-runners-gearpump-2.3.0-SNAPSHOT.jar>
2018-01-13T03:21:31.472 [INFO] Installing <https://builds.apache.org/job/beam_PostCommit_Java_MavenInstall/ws/src/runners/gearpump/dependency-reduced-pom.xml>
to <https://builds.apache.org/job/beam_PostCommit_Java_MavenInstall/ws/.repository/org/apache/beam/beam-runners-gearpump/2.3.0-SNAPSHOT/beam-runners-gearpump-2.3.0-SNAPSHOT.pom>
2018-01-13T03:21:31.503 [INFO] Installing <https://builds.apache.org/job/beam_PostCommit_Java_MavenInstall/ws/src/runners/gearpump/target/beam-runners-gearpump-2.3.0-SNAPSHOT-tests.jar>
to <https://builds.apache.org/job/beam_PostCommit_Java_MavenInstall/ws/.repository/org/apache/beam/beam-runners-gearpump/2.3.0-SNAPSHOT/beam-runners-gearpump-2.3.0-SNAPSHOT-tests.jar>
2018-01-13T03:21:31.505 [INFO] Installing <https://builds.apache.org/job/beam_PostCommit_Java_MavenInstall/ws/src/runners/gearpump/target/beam-runners-gearpump-2.3.0-SNAPSHOT-tests.jar>
to <https://builds.apache.org/job/beam_PostCommit_Java_MavenInstall/ws/.repository/org/apache/beam/beam-runners-gearpump/2.3.0-SNAPSHOT/beam-runners-gearpump-2.3.0-SNAPSHOT-tests.jar>
2018-01-13T03:21:31.506 [INFO] Installing <https://builds.apache.org/job/beam_PostCommit_Java_MavenInstall/ws/src/runners/gearpump/target/beam-runners-gearpump-2.3.0-SNAPSHOT-javadoc.jar>
to <https://builds.apache.org/job/beam_PostCommit_Java_MavenInstall/ws/.repository/org/apache/beam/beam-runners-gearpump/2.3.0-SNAPSHOT/beam-runners-gearpump-2.3.0-SNAPSHOT-javadoc.jar>
2018-01-13T03:21:31.507 [INFO] Installing <https://builds.apache.org/job/beam_PostCommit_Java_MavenInstall/ws/src/runners/gearpump/target/beam-runners-gearpump-2.3.0-SNAPSHOT-sources.jar>
to <https://builds.apache.org/job/beam_PostCommit_Java_MavenInstall/ws/.repository/org/apache/beam/beam-runners-gearpump/2.3.0-SNAPSHOT/beam-runners-gearpump-2.3.0-SNAPSHOT-sources.jar>
2018-01-13T03:21:31.508 [INFO] Installing <https://builds.apache.org/job/beam_PostCommit_Java_MavenInstall/ws/src/runners/gearpump/target/beam-runners-gearpump-2.3.0-SNAPSHOT-test-sources.jar>
to <https://builds.apache.org/job/beam_PostCommit_Java_MavenInstall/ws/.repository/org/apache/beam/beam-runners-gearpump/2.3.0-SNAPSHOT/beam-runners-gearpump-2.3.0-SNAPSHOT-test-sources.jar>
[JENKINS] Archiving disabled
2018-01-13T03:21:33.373 [INFO]                                                           
             
2018-01-13T03:21:33.373 [INFO] ------------------------------------------------------------------------
2018-01-13T03:21:33.373 [INFO] Skipping Apache Beam :: SDKs :: Java :: Aggregated Javadoc
2018-01-13T03:21:33.373 [INFO] This project has been banned from the build due to previous
failures.
2018-01-13T03:21:33.373 [INFO] ------------------------------------------------------------------------
[JENKINS] Archiving disabled
[JENKINS] Archiving disabled
[JENKINS] Archiving disabled
[JENKINS] Archiving disabled
[JENKINS] Archiving disabled
[JENKINS] Archiving disabled
[JENKINS] Archiving disabled
[JENKINS] Archiving disabled
[JENKINS] Archiving disabled
[JENKINS] Archiving disabled
[JENKINS] Archiving disabled
[JENKINS] Archiving disabled
[JENKINS] Archiving disabled
[JENKINS] Archiving disabled
[JENKINS] Archiving disabled
[JENKINS] Archiving disabled
[JENKINS] Archiving disabled
[JENKINS] Archiving disabled
[JENKINS] Archiving disabled
[JENKINS] Archiving disabled
[JENKINS] Archiving disabled
[JENKINS] Archiving disabled
[JENKINS] Archiving disabled
[JENKINS] Archiving disabled
[JENKINS] Archiving disabled
[JENKINS] Archiving disabled
[JENKINS] Archiving disabled
[JENKINS] Archiving disabled
[JENKINS] Archiving disabled
[JENKINS] Archiving disabled
[JENKINS] Archiving disabled
[JENKINS] Archiving disabled
[JENKINS] Archiving disabled
[JENKINS] Archiving disabled
[JENKINS] Archiving disabled
[JENKINS] Archiving disabled
[JENKINS] Archiving disabled
[JENKINS] Archiving disabled
[JENKINS] Archiving disabled
[JENKINS] Archiving disabled
[JENKINS] Archiving disabled
[JENKINS] Archiving disabled
[JENKINS] Archiving disabled
[JENKINS] Archiving disabled
[JENKINS] Archiving disabled
[JENKINS] Archiving disabled
[JENKINS] Archiving disabled
[JENKINS] Archiving disabled
[JENKINS] Archiving disabled
[JENKINS] Archiving disabled
[JENKINS] Archiving disabled
[JENKINS] Archiving disabled
[JENKINS] Archiving disabled
[JENKINS] Archiving disabled
[JENKINS] Archiving disabled
[JENKINS] Archiving disabled
[JENKINS] Archiving disabled
[JENKINS] Archiving disabled
[JENKINS] Archiving disabled
[JENKINS] Archiving disabled
[JENKINS] Archiving disabled
[JENKINS] Archiving disabled
[JENKINS] Archiving disabled
[JENKINS] Archiving disabled
[JENKINS] Archiving disabled
[JENKINS] Archiving disabled
[JENKINS] Archiving disabled
2018-01-13T03:22:41.865 [INFO] ------------------------------------------------------------------------
2018-01-13T03:22:41.865 [INFO] Reactor Summary:
2018-01-13T03:22:41.865 [INFO] 
2018-01-13T03:22:41.866 [INFO] Apache Beam :: Parent .............................. SUCCESS
[ 16.164 s]
2018-01-13T03:22:41.866 [INFO] Apache Beam :: SDKs :: Java :: Build Tools ......... SUCCESS
[  8.535 s]
2018-01-13T03:22:41.866 [INFO] Apache Beam :: Model ............................... SUCCESS
[  2.160 s]
2018-01-13T03:22:41.866 [INFO] Apache Beam :: Model :: Pipeline ................... SUCCESS
[ 25.454 s]
2018-01-13T03:22:41.866 [INFO] Apache Beam :: Model :: Job Management ............. SUCCESS
[ 14.686 s]
2018-01-13T03:22:41.866 [INFO] Apache Beam :: Model :: Fn Execution ............... SUCCESS
[ 20.724 s]
2018-01-13T03:22:41.866 [INFO] Apache Beam :: SDKs ................................ SUCCESS
[  3.428 s]
2018-01-13T03:22:41.866 [INFO] Apache Beam :: SDKs :: Java ........................ SUCCESS
[  3.022 s]
2018-01-13T03:22:41.866 [INFO] Apache Beam :: SDKs :: Java :: Core ................ SUCCESS
[02:48 min]
2018-01-13T03:22:41.866 [INFO] Apache Beam :: Runners ............................. SUCCESS
[  3.324 s]
2018-01-13T03:22:41.866 [INFO] Apache Beam :: Runners :: Local Java Core .......... SUCCESS
[ 11.677 s]
2018-01-13T03:22:41.866 [INFO] Apache Beam :: Runners :: Core Construction Java ... SUCCESS
[ 32.179 s]
2018-01-13T03:22:41.866 [INFO] Apache Beam :: Runners :: Core Java ................ SUCCESS
[ 50.828 s]
2018-01-13T03:22:41.866 [INFO] Apache Beam :: Runners :: Direct Java .............. SUCCESS
[05:55 min]
2018-01-13T03:22:41.866 [INFO] Apache Beam :: SDKs :: Java :: IO :: AMQP .......... SUCCESS
[ 47.826 s]
2018-01-13T03:22:41.866 [INFO] Apache Beam :: SDKs :: Java :: IO :: Common ........ SUCCESS
[  8.483 s]
2018-01-13T03:22:41.866 [INFO] Apache Beam :: SDKs :: Java :: IO :: Cassandra ..... SUCCESS
[ 43.960 s]
2018-01-13T03:22:41.866 [INFO] Apache Beam :: SDKs :: Java :: IO :: Elasticsearch . SUCCESS
[ 25.929 s]
2018-01-13T03:22:41.866 [INFO] Apache Beam :: SDKs :: Java :: IO :: Elasticsearch-Tests SUCCESS
[  4.888 s]
2018-01-13T03:22:41.866 [INFO] Apache Beam :: SDKs :: Java :: IO :: Elasticsearch-Tests ::
Common SUCCESS [  5.418 s]
2018-01-13T03:22:41.866 [INFO] Apache Beam :: SDKs :: Java :: IO :: Elasticsearch-Tests ::
2.x SUCCESS [ 34.587 s]
2018-01-13T03:22:41.866 [INFO] Apache Beam :: SDKs :: Java :: IO :: Elasticsearch-Tests ::
5.x SUCCESS [ 44.906 s]
2018-01-13T03:22:41.866 [INFO] Apache Beam :: SDKs :: Java :: Extensions :: Google Cloud Platform
Core SUCCESS [04:37 min]
2018-01-13T03:22:41.866 [INFO] Apache Beam :: SDKs :: Java :: Extensions :: Protobuf SUCCESS
[ 28.329 s]
2018-01-13T03:22:41.866 [INFO] Apache Beam :: SDKs :: Java :: IO :: Google Cloud Platform
SUCCESS [02:20 min]
2018-01-13T03:22:41.866 [INFO] Apache Beam :: Runners :: Google Cloud Dataflow .... SUCCESS
[08:39 min]
2018-01-13T03:22:41.866 [INFO] Apache Beam :: SDKs :: Java :: IO :: File-based-io-tests SUCCESS
[ 13.323 s]
2018-01-13T03:22:41.866 [INFO] Apache Beam :: SDKs :: Java :: IO :: Hadoop Common . SUCCESS
[ 26.696 s]
2018-01-13T03:22:41.866 [INFO] Apache Beam :: SDKs :: Java :: IO :: Hadoop File System SUCCESS
[ 54.802 s]
2018-01-13T03:22:41.866 [INFO] Apache Beam :: SDKs :: Java :: IO :: Hadoop ........ SUCCESS
[  7.272 s]
2018-01-13T03:22:41.866 [INFO] Apache Beam :: SDKs :: Java :: IO :: Hadoop :: input-format
SUCCESS [ 33.190 s]
2018-01-13T03:22:41.866 [INFO] Apache Beam :: SDKs :: Java :: IO :: Hadoop :: jdk1.8-tests
SUCCESS [01:29 min]
2018-01-13T03:22:41.866 [INFO] Apache Beam :: SDKs :: Java :: IO :: HBase ......... SUCCESS
[01:29 min]
2018-01-13T03:22:41.866 [INFO] Apache Beam :: SDKs :: Java :: IO :: HCatalog ...... SUCCESS
[01:19 min]
2018-01-13T03:22:41.866 [INFO] Apache Beam :: SDKs :: Java :: IO :: JDBC .......... SUCCESS
[01:28 min]
2018-01-13T03:22:41.866 [INFO] Apache Beam :: SDKs :: Java :: IO :: JMS ........... SUCCESS
[ 29.802 s]
2018-01-13T03:22:41.866 [INFO] Apache Beam :: SDKs :: Java :: IO :: Kafka ......... SUCCESS
[ 40.383 s]
2018-01-13T03:22:41.866 [INFO] Apache Beam :: SDKs :: Java :: IO :: Kinesis ....... SUCCESS
[ 40.334 s]
2018-01-13T03:22:41.866 [INFO] Apache Beam :: SDKs :: Java :: IO :: MongoDB ....... SUCCESS
[ 41.098 s]
2018-01-13T03:22:41.866 [INFO] Apache Beam :: SDKs :: Java :: IO :: MQTT .......... SUCCESS
[ 30.487 s]
2018-01-13T03:22:41.866 [INFO] Apache Beam :: SDKs :: Java :: IO :: Redis ......... SUCCESS
[ 22.595 s]
2018-01-13T03:22:41.866 [INFO] Apache Beam :: SDKs :: Java :: IO :: Solr .......... SUCCESS
[ 42.477 s]
2018-01-13T03:22:41.866 [INFO] Apache Beam :: SDKs :: Java :: IO :: Tika .......... SUCCESS
[ 27.479 s]
2018-01-13T03:22:41.866 [INFO] Apache Beam :: SDKs :: Java :: IO :: XML ........... SUCCESS
[ 34.743 s]
2018-01-13T03:22:41.866 [INFO] Apache Beam :: SDKs :: Java :: Maven Archetypes :: Starter
SUCCESS [ 15.897 s]
2018-01-13T03:22:41.866 [INFO] Apache Beam :: Examples :: Java .................... SUCCESS
[08:47 min]
2018-01-13T03:22:41.866 [INFO] Apache Beam :: SDKs :: Java :: Maven Archetypes :: Examples
SUCCESS [ 32.496 s]
2018-01-13T03:22:41.866 [INFO] Apache Beam :: Examples :: Java 8 .................. SUCCESS
[ 39.008 s]
2018-01-13T03:22:41.866 [INFO] Apache Beam :: SDKs :: Java :: Maven Archetypes :: Examples
- Java 8 SUCCESS [ 30.099 s]
2018-01-13T03:22:41.866 [INFO] Apache Beam :: SDKs :: Java :: Extensions :: Jackson SUCCESS
[ 15.606 s]
2018-01-13T03:22:41.866 [INFO] Apache Beam :: SDKs :: Java :: Extensions :: Join library SUCCESS
[ 17.799 s]
2018-01-13T03:22:41.866 [INFO] Apache Beam :: SDKs :: Java :: Extensions :: Sketching SUCCESS
[ 21.182 s]
2018-01-13T03:22:41.866 [INFO] Apache Beam :: SDKs :: Java :: Extensions :: Sorter  SUCCESS
[ 31.311 s]
2018-01-13T03:22:41.866 [INFO] Apache Beam :: SDKs :: Java :: Extensions :: SQL ... SUCCESS
[01:21 min]
2018-01-13T03:22:41.866 [INFO] Apache Beam :: SDKs :: Java :: Fn Execution ........ SUCCESS
[ 31.426 s]
2018-01-13T03:22:41.866 [INFO] Apache Beam :: SDKs :: Java :: Nexmark ............. SUCCESS
[01:34 min]
2018-01-13T03:22:41.866 [INFO] Apache Beam :: SDKs :: Java :: Harness ............. SUCCESS
[ 34.976 s]
2018-01-13T03:22:41.866 [INFO] Apache Beam :: SDKs :: Java :: Java 8 Tests ........ SUCCESS
[ 15.454 s]
2018-01-13T03:22:41.866 [INFO] Apache Beam :: Runners :: Java Fn Execution ........ FAILURE
[ 17.011 s]
2018-01-13T03:22:41.866 [INFO] Apache Beam :: Runners :: Java Local Artifact Service SKIPPED
2018-01-13T03:22:41.866 [INFO] Apache Beam :: Runners :: Reference :: Java ........ SUCCESS
[ 10.554 s]
2018-01-13T03:22:41.866 [INFO] Apache Beam :: Runners :: Reference :: Job Orchestrator SKIPPED
2018-01-13T03:22:41.866 [INFO] Apache Beam :: Runners :: Flink .................... FAILURE
[  9.624 s]
2018-01-13T03:22:41.866 [INFO] Apache Beam :: Runners :: Spark .................... SUCCESS
[01:56 min]
2018-01-13T03:22:41.866 [INFO] Apache Beam :: Runners :: Apex ..................... SUCCESS
[01:06 min]
2018-01-13T03:22:41.867 [INFO] Apache Beam :: Runners :: Gearpump ................. SUCCESS
[ 25.788 s]
2018-01-13T03:22:41.867 [INFO] Apache Beam :: SDKs :: Java :: Aggregated Javadoc .. SKIPPED
2018-01-13T03:22:41.867 [INFO] ------------------------------------------------------------------------
2018-01-13T03:22:41.867 [INFO] BUILD FAILURE
2018-01-13T03:22:41.867 [INFO] ------------------------------------------------------------------------
2018-01-13T03:22:41.867 [INFO] Total time: 01:08 h
2018-01-13T03:22:41.867 [INFO] Finished at: 2018-01-13T03:22:41+00:00
2018-01-13T03:22:42.785 [INFO] Final Memory: 394M/1782M
2018-01-13T03:22:42.785 [INFO] ------------------------------------------------------------------------
2018-01-13T03:22:42.796 [ERROR] Failed to execute goal org.apache.maven.plugins:maven-dependency-plugin:3.0.1:analyze-only
(default) on project beam-runners-java-fn-execution: Dependency problems found -> [Help
1]
2018-01-13T03:22:42.796 [ERROR] Failed to execute goal org.apache.maven.plugins:maven-checkstyle-plugin:2.17:check
(default) on project beam-runners-flink_2.11: You have 1 Checkstyle violation. -> [Help
2]
2018-01-13T03:22:42.796 [ERROR] 
2018-01-13T03:22:42.796 [ERROR] To see the full stack trace of the errors, re-run Maven with
the -e switch.
2018-01-13T03:22:42.796 [ERROR] Re-run Maven using the -X switch to enable full debug logging.
2018-01-13T03:22:42.796 [ERROR] 
2018-01-13T03:22:42.796 [ERROR] For more information about the errors and possible solutions,
please read the following articles:
2018-01-13T03:22:42.796 [ERROR] [Help 1] http://cwiki.apache.org/confluence/display/MAVEN/MojoExecutionException
2018-01-13T03:22:42.796 [ERROR] [Help 2] http://cwiki.apache.org/confluence/display/MAVEN/MojoFailureException
2018-01-13T03:22:42.796 [ERROR] 
2018-01-13T03:22:42.796 [ERROR] After correcting the problems, you can resume the build with
the command
2018-01-13T03:22:42.796 [ERROR]   mvn <goals> -rf :beam-runners-java-fn-execution
channel stopped
Not sending mail to unregistered user swegner@google.com
Not sending mail to unregistered user sidhom@google.com
Not sending mail to unregistered user arostami@google.com
Not sending mail to unregistered user ankurgoenka@gmail.com
Not sending mail to unregistered user ehudm@google.com
Not sending mail to unregistered user batbat@batbat-linuxworkstation.sea.corp.google.com
Not sending mail to unregistered user dariusz.aniszewski@polidea.com
Not sending mail to unregistered user jb@nanthrax.net

Mime
View raw message